{
  "project_info": {
    "project_number": "130010307823",
    "project_id": "postpc2021ex7",
    "storage_bucket": "postpc2021ex7.appspot.com"
  },
  "client": [
    {
      "client_info": {
        "mobilesdk_app_id": "1:130010307823:android:d30e13bb7f0682a18b8f1a",
        "android_client_info": {
          "package_name": "com.example.postpc2021ex7"
        }
      },
      "oauth_client": [
        {
          "client_id": "130010307823-d5bio8n1ef4i4a0i3oa5o1dff6dfur5b.apps.googleusercontent.com",
          "client_type": 3
        }
      ],
      "api_key": [
        {
          "current_key": "AIzaSyAOHEjrCMxbx_hbe4I3vC10FBqtBFMxZxw"
        }
      ],
      "services": {
        "appinvite_service": {
          "other_platform_oauth_client": [
            {
              "client_id": "130010307823-d5bio8n1ef4i4a0i3oa5o1dff6dfur5b.apps.googleusercontent.com",
              "client_type": 3
            }
          ]
        }
      }
    }
  ],
  "configuration_version": "1"
}