%YAML 1.1
%TAG !u! tag:unity3d.com,2011:
--- !u!1045 &1
EditorBuildSettings:
  m_ObjectHideFlags: 0
  serializedVersion: 2
  m_Scenes:
  - enabled: 1
    path: Assets/Scenes/AMainMenu.unity
    guid: d384db1b8b01ea841806c97f9b0ac9a4
  - enabled: 1
    path: Assets/Scenes/AConfigure.unity
    guid: 656a6ad124dfa464f8261c0095fdc5cd
  - enabled: 1
    path: Assets/frogger/AMain.unity
    guid: 4a7176d840319e44898aec2dd04efaf9
  - enabled: 1
    path: Assets/Scenes/AInstructions - Copy.unity
    guid: 4975b9abc596b6d418e7746708021915
  m_configObjects: {}
