{
  "project_info": {
    "project_number": "796875665883",
    "project_id": "my-books-ce62f",
    "storage_bucket": "my-books-ce62f.appspot.com"
  },
  "client": [
    {
      "client_info": {
        "mobilesdk_app_id": "1:796875665883:android:341eb40b6ef2cd929ef7fe",
        "android_client_info": {
          "package_name": "com.example.mybooks"
        }
      },
      "oauth_client": [
        {
          "client_id": "796875665883-ftpdmkhfe5r4vkkvljfgkqr70r0rvs3r.apps.googleusercontent.com",
          "client_type": 1,
          "android_info": {
            "package_name": "com.example.mybooks",
            "certificate_hash": "5afbc3fd07066a99062377dccb7efb7f2d082c95"
          }
        },
        {
          "client_id": "796875665883-67cvshukoplkh3k03jonvq0obkh9d6o5.apps.googleusercontent.com",
          "client_type": 3
        }
      ],
      "api_key": [
        {
          "current_key": "AIzaSyAdAPQFN1AYwkIuR6-9PB7dw_yhPq1R6q0"
        }
      ],
      "services": {
        "appinvite_service": {
          "other_platform_oauth_client": [
            {
              "client_id": "796875665883-67cvshukoplkh3k03jonvq0obkh9d6o5.apps.googleusercontent.com",
              "client_type": 3
            }
          ]
        }
      }
    }
  ],
  "configuration_version": "1"
}