-------------------------------------------------------------------------------
Test set: com.sarthi.sonasupershop.SonaSuperShopApplicationTests
-------------------------------------------------------------------------------
Tests run: 1, Failures: 0, Errors: 0, Skipped: 0, Time elapsed: 11.433 s - in com.sarthi.sonasupershop.SonaSuperShopApplicationTests
