{
  "openapi": "3.0.0",
  "info": {
    "title": "Octez DAL Node RPC",
    "description": "The RPC API for the Octez DAL node.",
    "version": "Octez 20.1 (1a991a03)"
  },
  "paths": {
    "/commitments": {
      "post": {
        "description": "Add a slot in the node's context if not already present. The corresponding commitment is returned.",
        "requestBody": {
          "content": {
            "application/json": {
              "schema": {
                "type": "string",
                "pattern": "^([a-zA-Z0-9][a-zA-Z0-9])*$"
              }
            }
          }
        },
        "responses": {
          "200": {
            "description": "",
            "content": {
              "application/json": {
                "schema": {
                  "title": "Commitment representation for the DAL (Base58Check-encoded)",
                  "oneOf": [
                    {
                      "$ref": "#/components/schemas/unistring"
                    }
                  ]
                }
              }
            }
          },
          "default": {
            "description": "",
            "content": {
              "application/json": {
                "schema": {
                  "description": "The full list of errors is available with the global RPC `GET errors`"
                }
              }
            }
          }
        }
      }
    },
    "/commitments/{DAL_commitment}": {
      "patch": {
        "description": "Associate a commitment to a level and a slot index.",
        "parameters": [
          {
            "name": "DAL_commitment",
            "in": "path",
            "description": "DAL_commitment (Base58Check-encoded)",
            "required": true,
            "schema": {
              "type": "string"
            }
          }
        ],
        "requestBody": {
          "content": {
            "application/json": {
              "schema": {
                "type": "object",
                "properties": {
                  "slot_level": {
                    "type": "integer",
                    "minimum": -2147483648,
                    "maximum": 2147483647
                  },
                  "slot_index": {
                    "type": "integer",
                    "minimum": 0,
                    "maximum": 255
                  }
                },
                "required": [
                  "slot_level",
                  "slot_index"
                ]
              }
            }
          }
        },
        "responses": {
          "200": {
            "description": "",
            "content": {
              "application/json": {
                "schema": {}
              }
            }
          },
          "default": {
            "description": "",
            "content": {
              "application/json": {
                "schema": {
                  "description": "The full list of errors is available with the global RPC `GET errors`"
                }
              }
            }
          }
        }
      }
    },
    "/commitments/{DAL_commitment}/headers": {
      "get": {
        "description": "Return the known headers for the slot whose commitment is given.",
        "parameters": [
          {
            "name": "DAL_commitment",
            "in": "path",
            "description": "DAL_commitment (Base58Check-encoded)",
            "required": true,
            "schema": {
              "type": "string"
            }
          },
          {
            "name": "slot_level",
            "in": "query",
            "required": false,
            "schema": {
              "type": "string"
            }
          },
          {
            "name": "slot_index",
            "in": "query",
            "required": false,
            "schema": {
              "type": "string"
            }
          }
        ],
        "responses": {
          "200": {
            "description": "",
            "content": {
              "application/json": {
                "schema": {
                  "type": "array",
                  "items": {
                    "oneOf": [
                      {
                        "title": "waiting_attestation",
                        "type": "object",
                        "properties": {
                          "slot_level": {
                            "type": "integer",
                            "minimum": -2147483648,
                            "maximum": 2147483647
                          },
                          "slot_index": {
                            "type": "integer",
                            "minimum": 0,
                            "maximum": 255
                          },
                          "commitment": {
                            "$ref": "#/components/schemas/DAL_commitment"
                          },
                          "status": {
                            "type": "string",
                            "enum": [
                              "waiting_attestation"
                            ]
                          }
                        },
                        "required": [
                          "slot_level",
                          "slot_index",
                          "commitment",
                          "status"
                        ]
                      },
                      {
                        "title": "attested",
                        "type": "object",
                        "properties": {
                          "slot_level": {
                            "type": "integer",
                            "minimum": -2147483648,
                            "maximum": 2147483647
                          },
                          "slot_index": {
                            "type": "integer",
                            "minimum": 0,
                            "maximum": 255
                          },
                          "commitment": {
                            "$ref": "#/components/schemas/DAL_commitment"
                          },
                          "status": {
                            "type": "string",
                            "enum": [
                              "attested"
                            ]
                          }
                        },
                        "required": [
                          "slot_level",
                          "slot_index",
                          "commitment",
                          "status"
                        ]
                      },
                      {
                        "title": "unattested",
                        "type": "object",
                        "properties": {
                          "slot_level": {
                            "type": "integer",
                            "minimum": -2147483648,
                            "maximum": 2147483647
                          },
                          "slot_index": {
                            "type": "integer",
                            "minimum": 0,
                            "maximum": 255
                          },
                          "commitment": {
                            "$ref": "#/components/schemas/DAL_commitment"
                          },
                          "status": {
                            "type": "string",
                            "enum": [
                              "unattested"
                            ]
                          }
                        },
                        "required": [
                          "slot_level",
                          "slot_index",
                          "commitment",
                          "status"
                        ]
                      },
                      {
                        "title": "not_selected",
                        "type": "object",
                        "properties": {
                          "slot_level": {
                            "type": "integer",
                            "minimum": -2147483648,
                            "maximum": 2147483647
                          },
                          "slot_index": {
                            "type": "integer",
                            "minimum": 0,
                            "maximum": 255
                          },
                          "commitment": {
                            "$ref": "#/components/schemas/DAL_commitment"
                          },
                          "status": {
                            "type": "string",
                            "enum": [
                              "not_selected"
                            ]
                          }
                        },
                        "required": [
                          "slot_level",
                          "slot_index",
                          "commitment",
                          "status"
                        ]
                      },
                      {
                        "title": "unseen_or_not_finalized",
                        "type": "object",
                        "properties": {
                          "slot_level": {
                            "type": "integer",
                            "minimum": -2147483648,
                            "maximum": 2147483647
                          },
                          "slot_index": {
                            "type": "integer",
                            "minimum": 0,
                            "maximum": 255
                          },
                          "commitment": {
                            "$ref": "#/components/schemas/DAL_commitment"
                          },
                          "status": {
                            "type": "string",
                            "enum": [
                              "unseen"
                            ]
                          }
                        },
                        "required": [
                          "slot_level",
                          "slot_index",
                          "commitment",
                          "status"
                        ]
                      }
                    ]
                  }
                }
              }
            }
          },
          "default": {
            "description": "",
            "content": {
              "application/json": {
                "schema": {
                  "description": "The full list of errors is available with the global RPC `GET errors`"
                }
              }
            }
          }
        }
      }
    },
    "/commitments/{DAL_commitment}/proof": {
      "get": {
        "description": "Compute the proof associated with a commitment.",
        "parameters": [
          {
            "name": "DAL_commitment",
            "in": "path",
            "description": "DAL_commitment (Base58Check-encoded)",
            "required": true,
            "schema": {
              "type": "string"
            }
          }
        ],
        "responses": {
          "200": {
            "description": "",
            "content": {
              "application/json": {
                "schema": {
                  "type": "string",
                  "pattern": "^([a-zA-Z0-9][a-zA-Z0-9])*$"
                }
              }
            }
          },
          "default": {
            "description": "",
            "content": {
              "application/json": {
                "schema": {
                  "description": "The full list of errors is available with the global RPC `GET errors`"
                }
              }
            }
          }
        }
      }
    },
    "/commitments/{DAL_commitment}/shards": {
      "put": {
        "description": "Compute and save the shards of the slot associated to the given commitment. If the input's flag is true, the shard proofs are also computed.",
        "parameters": [
          {
            "name": "DAL_commitment",
            "in": "path",
            "description": "DAL_commitment (Base58Check-encoded)",
            "required": true,
            "schema": {
              "type": "string"
            }
          }
        ],
        "requestBody": {
          "content": {
            "application/json": {
              "schema": {
                "type": "object",
                "properties": {
                  "with_proof": {
                    "type": "boolean"
                  }
                },
                "required": [
                  "with_proof"
                ]
              }
            }
          }
        },
        "responses": {
          "200": {
            "description": "",
            "content": {
              "application/json": {
                "schema": {}
              }
            }
          },
          "default": {
            "description": "",
            "content": {
              "application/json": {
                "schema": {
                  "description": "The full list of errors is available with the global RPC `GET errors`"
                }
              }
            }
          }
        }
      }
    },
    "/commitments/{DAL_commitment}/slot": {
      "get": {
        "description": "Retrieve the content of the slot associated with the given commitment.",
        "parameters": [
          {
            "name": "DAL_commitment",
            "in": "path",
            "description": "DAL_commitment (Base58Check-encoded)",
            "required": true,
            "schema": {
              "type": "string"
            }
          }
        ],
        "responses": {
          "200": {
            "description": "",
            "content": {
              "application/json": {
                "schema": {
                  "type": "string",
                  "pattern": "^([a-zA-Z0-9][a-zA-Z0-9])*$"
                }
              }
            }
          },
          "default": {
            "description": "",
            "content": {
              "application/json": {
                "schema": {
                  "description": "The full list of errors is available with the global RPC `GET errors`"
                }
              }
            }
          }
        }
      }
    },
    "/levels/{int32}/headers": {
      "get": {
        "description": "Return the known headers for the given published level.",
        "parameters": [
          {
            "name": "int32",
            "in": "path",
            "required": true,
            "schema": {
              "type": "string"
            }
          },
          {
            "name": "status",
            "in": "query",
            "required": false,
            "schema": {
              "type": "string"
            }
          }
        ],
        "responses": {
          "200": {
            "description": "",
            "content": {
              "application/json": {
                "schema": {
                  "type": "array",
                  "items": {
                    "oneOf": [
                      {
                        "title": "waiting_attestation",
                        "type": "object",
                        "properties": {
                          "slot_level": {
                            "type": "integer",
                            "minimum": -2147483648,
                            "maximum": 2147483647
                          },
                          "slot_index": {
                            "type": "integer",
                            "minimum": 0,
                            "maximum": 255
                          },
                          "commitment": {
                            "$ref": "#/components/schemas/DAL_commitment"
                          },
                          "status": {
                            "type": "string",
                            "enum": [
                              "waiting_attestation"
                            ]
                          }
                        },
                        "required": [
                          "slot_level",
                          "slot_index",
                          "commitment",
                          "status"
                        ]
                      },
                      {
                        "title": "attested",
                        "type": "object",
                        "properties": {
                          "slot_level": {
                            "type": "integer",
                            "minimum": -2147483648,
                            "maximum": 2147483647
                          },
                          "slot_index": {
                            "type": "integer",
                            "minimum": 0,
                            "maximum": 255
                          },
                          "commitment": {
                            "$ref": "#/components/schemas/DAL_commitment"
                          },
                          "status": {
                            "type": "string",
                            "enum": [
                              "attested"
                            ]
                          }
                        },
                        "required": [
                          "slot_level",
                          "slot_index",
                          "commitment",
                          "status"
                        ]
                      },
                      {
                        "title": "unattested",
                        "type": "object",
                        "properties": {
                          "slot_level": {
                            "type": "integer",
                            "minimum": -2147483648,
                            "maximum": 2147483647
                          },
                          "slot_index": {
                            "type": "integer",
                            "minimum": 0,
                            "maximum": 255
                          },
                          "commitment": {
                            "$ref": "#/components/schemas/DAL_commitment"
                          },
                          "status": {
                            "type": "string",
                            "enum": [
                              "unattested"
                            ]
                          }
                        },
                        "required": [
                          "slot_level",
                          "slot_index",
                          "commitment",
                          "status"
                        ]
                      },
                      {
                        "title": "not_selected",
                        "type": "object",
                        "properties": {
                          "slot_level": {
                            "type": "integer",
                            "minimum": -2147483648,
                            "maximum": 2147483647
                          },
                          "slot_index": {
                            "type": "integer",
                            "minimum": 0,
                            "maximum": 255
                          },
                          "commitment": {
                            "$ref": "#/components/schemas/DAL_commitment"
                          },
                          "status": {
                            "type": "string",
                            "enum": [
                              "not_selected"
                            ]
                          }
                        },
                        "required": [
                          "slot_level",
                          "slot_index",
                          "commitment",
                          "status"
                        ]
                      },
                      {
                        "title": "unseen_or_not_finalized",
                        "type": "object",
                        "properties": {
                          "slot_level": {
                            "type": "integer",
                            "minimum": -2147483648,
                            "maximum": 2147483647
                          },
                          "slot_index": {
                            "type": "integer",
                            "minimum": 0,
                            "maximum": 255
                          },
                          "commitment": {
                            "$ref": "#/components/schemas/DAL_commitment"
                          },
                          "status": {
                            "type": "string",
                            "enum": [
                              "unseen"
                            ]
                          }
                        },
                        "required": [
                          "slot_level",
                          "slot_index",
                          "commitment",
                          "status"
                        ]
                      }
                    ]
                  }
                }
              }
            }
          },
          "default": {
            "description": "",
            "content": {
              "application/json": {
                "schema": {
                  "description": "The full list of errors is available with the global RPC `GET errors`"
                }
              }
            }
          }
        }
      }
    },
    "/levels/{int32}/slot_indices/{int}/commitment": {
      "get": {
        "description": "Return the accepted commitment associated to the given slot index and published at the given level.",
        "parameters": [
          {
            "name": "int32",
            "in": "path",
            "required": true,
            "schema": {
              "type": "string"
            }
          },
          {
            "name": "int",
            "in": "path",
            "required": true,
            "schema": {
              "type": "string"
            }
          }
        ],
        "responses": {
          "200": {
            "description": "",
            "content": {
              "application/json": {
                "schema": {
                  "title": "Commitment representation for the DAL (Base58Check-encoded)",
                  "oneOf": [
                    {
                      "$ref": "#/components/schemas/unistring"
                    }
                  ]
                }
              }
            }
          },
          "default": {
            "description": "",
            "content": {
              "application/json": {
                "schema": {
                  "description": "The full list of errors is available with the global RPC `GET errors`"
                }
              }
            }
          }
        }
      }
    },
    "/p2p/connect": {
      "post": {
        "description": "Connect to a new peer.",
        "parameters": [
          {
            "name": "timeout",
            "in": "query",
            "description": "A span of time in seconds",
            "required": false,
            "schema": {
              "type": "string"
            }
          }
        ],
        "requestBody": {
          "content": {
            "application/json": {
              "schema": {
                "description": "Identifier for a peer point",
                "oneOf": [
                  {
                    "$ref": "#/components/schemas/unistring"
                  }
                ]
              }
            }
          }
        },
        "responses": {
          "200": {
            "description": "",
            "content": {
              "application/json": {
                "schema": {}
              }
            }
          },
          "default": {
            "description": "",
            "content": {
              "application/json": {
                "schema": {
                  "description": "The full list of errors is available with the global RPC `GET errors`"
                }
              }
            }
          }
        }
      }
    },
    "/p2p/gossipsub/backoffs": {
      "get": {
        "description": "Get the backoffs of the peers with a backoff, per topic.",
        "responses": {
          "200": {
            "description": "",
            "content": {
              "application/json": {
                "schema": {
                  "type": "array",
                  "items": {
                    "type": "object",
                    "properties": {
                      "topic": {
                        "type": "object",
                        "properties": {
                          "slot_index": {
                            "type": "integer",
                            "minimum": 0,
                            "maximum": 255
                          },
                          "pkh": {
                            "$ref": "#/components/schemas/Signature.Public_key_hash"
                          }
                        },
                        "required": [
                          "slot_index",
                          "pkh"
                        ]
                      },
                      "backoffs": {
                        "type": "array",
                        "items": {
                          "type": "object",
                          "properties": {
                            "peer": {
                              "$ref": "#/components/schemas/Crypto_box.Public_key_hash"
                            },
                            "backoff": {
                              "$ref": "#/components/schemas/timestamp.system"
                            }
                          },
                          "required": [
                            "peer",
                            "backoff"
                          ]
                        }
                      }
                    },
                    "required": [
                      "topic",
                      "backoffs"
                    ]
                  }
                }
              }
            }
          },
          "default": {
            "description": "",
            "content": {
              "application/json": {
                "schema": {
                  "description": "The full list of errors is available with the global RPC `GET errors`"
                }
              }
            }
          }
        }
      }
    },
    "/p2p/gossipsub/connections": {
      "get": {
        "description": "Get this node's currently active connections.",
        "responses": {
          "200": {
            "description": "",
            "content": {
              "application/json": {
                "schema": {
                  "type": "array",
                  "items": {
                    "type": "object",
                    "properties": {
                      "peer": {
                        "$ref": "#/components/schemas/Crypto_box.Public_key_hash"
                      },
                      "connection": {
                        "type": "object",
                        "properties": {
                          "topics": {
                            "type": "array",
                            "items": {
                              "type": "object",
                              "properties": {
                                "slot_index": {
                                  "type": "integer",
                                  "minimum": 0,
                                  "maximum": 255
                                },
                                "pkh": {
                                  "$ref": "#/components/schemas/Signature.Public_key_hash"
                                }
                              },
                              "required": [
                                "slot_index",
                                "pkh"
                              ]
                            }
                          },
                          "direct": {
                            "type": "boolean"
                          },
                          "outbound": {
                            "type": "boolean"
                          }
                        },
                        "required": [
                          "topics",
                          "direct",
                          "outbound"
                        ]
                      }
                    },
                    "required": [
                      "peer",
                      "connection"
                    ]
                  }
                }
              }
            }
          },
          "default": {
            "description": "",
            "content": {
              "application/json": {
                "schema": {
                  "description": "The full list of errors is available with the global RPC `GET errors`"
                }
              }
            }
          }
        }
      }
    },
    "/p2p/gossipsub/message_cache": {
      "get": {
        "description": "Get the number of message ids in the message cache, grouped by heartbeat tick and topic.",
        "responses": {
          "200": {
            "description": "",
            "content": {
              "application/json": {
                "schema": {
                  "type": "array",
                  "items": {
                    "type": "object",
                    "properties": {
                      "tick": {
                        "$ref": "#/components/schemas/int64"
                      },
                      "per_topic_cache_size": {
                        "type": "array",
                        "items": {
                          "type": "object",
                          "properties": {
                            "topic": {
                              "type": "object",
                              "properties": {
                                "slot_index": {
                                  "type": "integer",
                                  "minimum": 0,
                                  "maximum": 255
                                },
                                "pkh": {
                                  "$ref": "#/components/schemas/Signature.Public_key_hash"
                                }
                              },
                              "required": [
                                "slot_index",
                                "pkh"
                              ]
                            },
                            "num_ids": {
                              "type": "integer",
                              "minimum": -1073741824,
                              "maximum": 1073741823
                            }
                          },
                          "required": [
                            "topic",
                            "num_ids"
                          ]
                        }
                      }
                    },
                    "required": [
                      "tick",
                      "per_topic_cache_size"
                    ]
                  }
                }
              }
            }
          },
          "default": {
            "description": "",
            "content": {
              "application/json": {
                "schema": {
                  "description": "The full list of errors is available with the global RPC `GET errors`"
                }
              }
            }
          }
        }
      }
    },
    "/p2p/gossipsub/scores": {
      "get": {
        "description": "Get the scores of the peers with a known score.",
        "responses": {
          "200": {
            "description": "",
            "content": {
              "application/json": {
                "schema": {
                  "type": "array",
                  "items": {
                    "type": "object",
                    "properties": {
                      "peer": {
                        "$ref": "#/components/schemas/Crypto_box.Public_key_hash"
                      },
                      "score": {
                        "type": "number"
                      }
                    },
                    "required": [
                      "peer",
                      "score"
                    ]
                  }
                }
              }
            }
          },
          "default": {
            "description": "",
            "content": {
              "application/json": {
                "schema": {
                  "description": "The full list of errors is available with the global RPC `GET errors`"
                }
              }
            }
          }
        }
      }
    },
    "/p2p/gossipsub/topics": {
      "get": {
        "description": "Get the topics this node is currently subscribed to.",
        "responses": {
          "200": {
            "description": "",
            "content": {
              "application/json": {
                "schema": {
                  "type": "array",
                  "items": {
                    "type": "object",
                    "properties": {
                      "slot_index": {
                        "type": "integer",
                        "minimum": 0,
                        "maximum": 255
                      },
                      "pkh": {
                        "$ref": "#/components/schemas/Signature.Public_key_hash"
                      }
                    },
                    "required": [
                      "slot_index",
                      "pkh"
                    ]
                  }
                }
              }
            }
          },
          "default": {
            "description": "",
            "content": {
              "application/json": {
                "schema": {
                  "description": "The full list of errors is available with the global RPC `GET errors`"
                }
              }
            }
          }
        }
      }
    },
    "/p2p/gossipsub/topics/peers": {
      "get": {
        "description": "Get an association list between each topic subscribed to by the connected peers and the remote peers subscribed to that topic. If the 'subscribed' flag is given, then restrict the output to the topics this node is subscribed to.",
        "parameters": [
          {
            "name": "subscribed",
            "in": "query",
            "required": false,
            "schema": {
              "type": "string"
            }
          }
        ],
        "responses": {
          "200": {
            "description": "",
            "content": {
              "application/json": {
                "schema": {
                  "type": "array",
                  "items": {
                    "type": "object",
                    "properties": {
                      "topic": {
                        "type": "object",
                        "properties": {
                          "slot_index": {
                            "type": "integer",
                            "minimum": 0,
                            "maximum": 255
                          },
                          "pkh": {
                            "$ref": "#/components/schemas/Signature.Public_key_hash"
                          }
                        },
                        "required": [
                          "slot_index",
                          "pkh"
                        ]
                      },
                      "peers": {
                        "type": "array",
                        "items": {
                          "$ref": "#/components/schemas/Crypto_box.Public_key_hash"
                        }
                      }
                    },
                    "required": [
                      "topic",
                      "peers"
                    ]
                  }
                }
              }
            }
          },
          "default": {
            "description": "",
            "content": {
              "application/json": {
                "schema": {
                  "description": "The full list of errors is available with the global RPC `GET errors`"
                }
              }
            }
          }
        }
      }
    },
    "/p2p/peers/by-id/{peer_id}": {
      "get": {
        "description": "Get info of the requested peer",
        "parameters": [
          {
            "name": "peer_id",
            "in": "path",
            "description": "A cryptographic node identity (Base58Check-encoded)",
            "required": true,
            "schema": {
              "type": "string"
            }
          }
        ],
        "responses": {
          "200": {
            "description": "",
            "content": {
              "application/json": {
                "schema": {
                  "type": "object",
                  "properties": {
                    "info": {
                      "type": "object",
                      "properties": {
                        "score": {
                          "type": "number"
                        },
                        "trusted": {
                          "type": "boolean"
                        },
                        "conn_metadata": {
                          "type": "object",
                          "properties": {
                            "advertised_net_addr": {
                              "$ref": "#/components/schemas/p2p_address"
                            },
                            "advertised_net_port": {
                              "type": "integer",
                              "minimum": 0,
                              "maximum": 65535
                            },
                            "is_bootstrap_peer": {
                              "type": "boolean"
                            }
                          },
                          "required": [
                            "is_bootstrap_peer"
                          ]
                        },
                        "peer_metadata": {},
                        "state": {
                          "$ref": "#/components/schemas/p2p_peer.state"
                        },
                        "reachable_at": {
                          "$ref": "#/components/schemas/p2p_connection.id"
                        },
                        "stat": {
                          "$ref": "#/components/schemas/p2p_stat"
                        },
                        "last_failed_connection": {
                          "type": "array",
                          "items": {
                            "oneOf": [
                              {
                                "$ref": "#/components/schemas/p2p_connection.id"
                              },
                              {
                                "$ref": "#/components/schemas/timestamp.system"
                              }
                            ]
                          }
                        },
                        "last_rejected_connection": {
                          "type": "array",
                          "items": {
                            "oneOf": [
                              {
                                "$ref": "#/components/schemas/p2p_connection.id"
                              },
                              {
                                "$ref": "#/components/schemas/timestamp.system"
                              }
                            ]
                          }
                        },
                        "last_established_connection": {
                          "type": "array",
                          "items": {
                            "oneOf": [
                              {
                                "$ref": "#/components/schemas/p2p_connection.id"
                              },
                              {
                                "$ref": "#/components/schemas/timestamp.system"
                              }
                            ]
                          }
                        },
                        "last_disconnection": {
                          "type": "array",
                          "items": {
                            "oneOf": [
                              {
                                "$ref": "#/components/schemas/p2p_connection.id"
                              },
                              {
                                "$ref": "#/components/schemas/timestamp.system"
                              }
                            ]
                          }
                        },
                        "last_seen": {
                          "type": "array",
                          "items": {
                            "oneOf": [
                              {
                                "$ref": "#/components/schemas/p2p_connection.id"
                              },
                              {
                                "$ref": "#/components/schemas/timestamp.system"
                              }
                            ]
                          }
                        },
                        "last_miss": {
                          "type": "array",
                          "items": {
                            "oneOf": [
                              {
                                "$ref": "#/components/schemas/p2p_connection.id"
                              },
                              {
                                "$ref": "#/components/schemas/timestamp.system"
                              }
                            ]
                          }
                        }
                      },
                      "required": [
                        "score",
                        "trusted",
                        "peer_metadata",
                        "state",
                        "stat"
                      ]
                    }
                  },
                  "required": [
                    "info"
                  ]
                }
              }
            }
          },
          "default": {
            "description": "",
            "content": {
              "application/json": {
                "schema": {
                  "description": "The full list of errors is available with the global RPC `GET errors`"
                }
              }
            }
          }
        }
      },
      "patch": {
        "description": "Change the permissions of a given peer. With `{acl: ban}`: blacklist the given peer and remove it from the whitelist if present. With `{acl: open}`: removes the peer from the blacklist and whitelist. With `{acl: trust}`: trust the given peer permanently and remove it from the blacklist if present. The peer cannot be blocked (but its host IP still can). In all cases, the updated information for the peer is returned. If input is omitted, this is equivalent to using the `GET` version of this RPC.",
        "parameters": [
          {
            "name": "peer_id",
            "in": "path",
            "description": "A cryptographic node identity (Base58Check-encoded)",
            "required": true,
            "schema": {
              "type": "string"
            }
          }
        ],
        "requestBody": {
          "content": {
            "application/json": {
              "schema": {
                "type": "object",
                "properties": {
                  "acl": {
                    "type": "string",
                    "enum": [
                      "open",
                      "trust",
                      "ban"
                    ]
                  }
                }
              }
            }
          }
        },
        "responses": {
          "200": {
            "description": "",
            "content": {
              "application/json": {
                "schema": {
                  "type": "object",
                  "properties": {
                    "info": {
                      "type": "object",
                      "properties": {
                        "score": {
                          "type": "number"
                        },
                        "trusted": {
                          "type": "boolean"
                        },
                        "conn_metadata": {
                          "type": "object",
                          "properties": {
                            "advertised_net_addr": {
                              "$ref": "#/components/schemas/p2p_address"
                            },
                            "advertised_net_port": {
                              "type": "integer",
                              "minimum": 0,
                              "maximum": 65535
                            },
                            "is_bootstrap_peer": {
                              "type": "boolean"
                            }
                          },
                          "required": [
                            "is_bootstrap_peer"
                          ]
                        },
                        "peer_metadata": {},
                        "state": {
                          "$ref": "#/components/schemas/p2p_peer.state"
                        },
                        "reachable_at": {
                          "$ref": "#/components/schemas/p2p_connection.id"
                        },
                        "stat": {
                          "$ref": "#/components/schemas/p2p_stat"
                        },
                        "last_failed_connection": {
                          "type": "array",
                          "items": {
                            "oneOf": [
                              {
                                "$ref": "#/components/schemas/p2p_connection.id"
                              },
                              {
                                "$ref": "#/components/schemas/timestamp.system"
                              }
                            ]
                          }
                        },
                        "last_rejected_connection": {
                          "type": "array",
                          "items": {
                            "oneOf": [
                              {
                                "$ref": "#/components/schemas/p2p_connection.id"
                              },
                              {
                                "$ref": "#/components/schemas/timestamp.system"
                              }
                            ]
                          }
                        },
                        "last_established_connection": {
                          "type": "array",
                          "items": {
                            "oneOf": [
                              {
                                "$ref": "#/components/schemas/p2p_connection.id"
                              },
                              {
                                "$ref": "#/components/schemas/timestamp.system"
                              }
                            ]
                          }
                        },
                        "last_disconnection": {
                          "type": "array",
                          "items": {
                            "oneOf": [
                              {
                                "$ref": "#/components/schemas/p2p_connection.id"
                              },
                              {
                                "$ref": "#/components/schemas/timestamp.system"
                              }
                            ]
                          }
                        },
                        "last_seen": {
                          "type": "array",
                          "items": {
                            "oneOf": [
                              {
                                "$ref": "#/components/schemas/p2p_connection.id"
                              },
                              {
                                "$ref": "#/components/schemas/timestamp.system"
                              }
                            ]
                          }
                        },
                        "last_miss": {
                          "type": "array",
                          "items": {
                            "oneOf": [
                              {
                                "$ref": "#/components/schemas/p2p_connection.id"
                              },
                              {
                                "$ref": "#/components/schemas/timestamp.system"
                              }
                            ]
                          }
                        }
                      },
                      "required": [
                        "score",
                        "trusted",
                        "peer_metadata",
                        "state",
                        "stat"
                      ]
                    }
                  },
                  "required": [
                    "info"
                  ]
                }
              }
            }
          },
          "default": {
            "description": "",
            "content": {
              "application/json": {
                "schema": {
                  "description": "The full list of errors is available with the global RPC `GET errors`"
                }
              }
            }
          }
        }
      }
    },
    "/p2p/peers/disconnect/{peer_id}": {
      "delete": {
        "description": "Disconnect from a peer.",
        "parameters": [
          {
            "name": "peer_id",
            "in": "path",
            "description": "A cryptographic node identity (Base58Check-encoded)",
            "required": true,
            "schema": {
              "type": "string"
            }
          },
          {
            "name": "wait",
            "in": "query",
            "required": false,
            "schema": {
              "type": "string"
            }
          }
        ],
        "responses": {
          "200": {
            "description": "",
            "content": {
              "application/json": {
                "schema": {}
              }
            }
          },
          "default": {
            "description": "",
            "content": {
              "application/json": {
                "schema": {
                  "description": "The full list of errors is available with the global RPC `GET errors`"
                }
              }
            }
          }
        }
      }
    },
    "/p2p/peers/info": {
      "get": {
        "description": "Get list of known peers and their corresponding info.",
        "parameters": [
          {
            "name": "connected",
            "in": "query",
            "required": false,
            "schema": {
              "type": "string"
            }
          }
        ],
        "responses": {
          "200": {
            "description": "",
            "content": {
              "application/json": {
                "schema": {
                  "type": "array",
                  "items": {
                    "type": "object",
                    "properties": {
                      "point": {
                        "$ref": "#/components/schemas/Crypto_box.Public_key_hash"
                      },
                      "info": {
                        "type": "object",
                        "properties": {
                          "score": {
                            "type": "number"
                          },
                          "trusted": {
                            "type": "boolean"
                          },
                          "conn_metadata": {
                            "type": "object",
                            "properties": {
                              "advertised_net_addr": {
                                "$ref": "#/components/schemas/p2p_address"
                              },
                              "advertised_net_port": {
                                "type": "integer",
                                "minimum": 0,
                                "maximum": 65535
                              },
                              "is_bootstrap_peer": {
                                "type": "boolean"
                              }
                            },
                            "required": [
                              "is_bootstrap_peer"
                            ]
                          },
                          "peer_metadata": {},
                          "state": {
                            "$ref": "#/components/schemas/p2p_peer.state"
                          },
                          "reachable_at": {
                            "$ref": "#/components/schemas/p2p_connection.id"
                          },
                          "stat": {
                            "$ref": "#/components/schemas/p2p_stat"
                          },
                          "last_failed_connection": {
                            "type": "array",
                            "items": {
                              "oneOf": [
                                {
                                  "$ref": "#/components/schemas/p2p_connection.id"
                                },
                                {
                                  "$ref": "#/components/schemas/timestamp.system"
                                }
                              ]
                            }
                          },
                          "last_rejected_connection": {
                            "type": "array",
                            "items": {
                              "oneOf": [
                                {
                                  "$ref": "#/components/schemas/p2p_connection.id"
                                },
                                {
                                  "$ref": "#/components/schemas/timestamp.system"
                                }
                              ]
                            }
                          },
                          "last_established_connection": {
                            "type": "array",
                            "items": {
                              "oneOf": [
                                {
                                  "$ref": "#/components/schemas/p2p_connection.id"
                                },
                                {
                                  "$ref": "#/components/schemas/timestamp.system"
                                }
                              ]
                            }
                          },
                          "last_disconnection": {
                            "type": "array",
                            "items": {
                              "oneOf": [
                                {
                                  "$ref": "#/components/schemas/p2p_connection.id"
                                },
                                {
                                  "$ref": "#/components/schemas/timestamp.system"
                                }
                              ]
                            }
                          },
                          "last_seen": {
                            "type": "array",
                            "items": {
                              "oneOf": [
                                {
                                  "$ref": "#/components/schemas/p2p_connection.id"
                                },
                                {
                                  "$ref": "#/components/schemas/timestamp.system"
                                }
                              ]
                            }
                          },
                          "last_miss": {
                            "type": "array",
                            "items": {
                              "oneOf": [
                                {
                                  "$ref": "#/components/schemas/p2p_connection.id"
                                },
                                {
                                  "$ref": "#/components/schemas/timestamp.system"
                                }
                              ]
                            }
                          }
                        },
                        "required": [
                          "score",
                          "trusted",
                          "peer_metadata",
                          "state",
                          "stat"
                        ]
                      }
                    },
                    "required": [
                      "point",
                      "info"
                    ]
                  }
                }
              }
            }
          },
          "default": {
            "description": "",
            "content": {
              "application/json": {
                "schema": {
                  "description": "The full list of errors is available with the global RPC `GET errors`"
                }
              }
            }
          }
        }
      }
    },
    "/p2p/peers/list": {
      "get": {
        "description": "By default, get the list of known peers. When the 'connected' flag is given, then only get the connected peers.",
        "parameters": [
          {
            "name": "connected",
            "in": "query",
            "required": false,
            "schema": {
              "type": "string"
            }
          }
        ],
        "responses": {
          "200": {
            "description": "",
            "content": {
              "application/json": {
                "schema": {
                  "type": "array",
                  "items": {
                    "type": "object",
                    "properties": {
                      "peer": {
                        "$ref": "#/components/schemas/Crypto_box.Public_key_hash"
                      }
                    },
                    "required": [
                      "peer"
                    ]
                  }
                }
              }
            }
          },
          "default": {
            "description": "",
            "content": {
              "application/json": {
                "schema": {
                  "description": "The full list of errors is available with the global RPC `GET errors`"
                }
              }
            }
          }
        }
      }
    },
    "/p2p/points": {
      "get": {
        "description": "By default, get the list of known points. When the 'connected' flag is given, only get the connected points.",
        "parameters": [
          {
            "name": "connected",
            "in": "query",
            "required": false,
            "schema": {
              "type": "string"
            }
          }
        ],
        "responses": {
          "200": {
            "description": "",
            "content": {
              "application/json": {
                "schema": {
                  "type": "array",
                  "items": {
                    "type": "object",
                    "properties": {
                      "point": {
                        "$ref": "#/components/schemas/p2p_point.id"
                      }
                    },
                    "required": [
                      "point"
                    ]
                  }
                }
              }
            }
          },
          "default": {
            "description": "",
            "content": {
              "application/json": {
                "schema": {
                  "description": "The full list of errors is available with the global RPC `GET errors`"
                }
              }
            }
          }
        }
      }
    },
    "/p2p/points/by-id/{point}": {
      "get": {
        "description": "Get info of the requested point",
        "parameters": [
          {
            "name": "point",
            "in": "path",
            "description": "A network point (ipv4:port or [ipv6]:port).",
            "required": true,
            "schema": {
              "type": "string"
            }
          }
        ],
        "responses": {
          "200": {
            "description": "",
            "content": {
              "application/json": {
                "schema": {
                  "type": "object",
                  "properties": {
                    "info": {
                      "$ref": "#/components/schemas/p2p_point.info"
                    }
                  },
                  "required": [
                    "info"
                  ]
                }
              }
            }
          },
          "default": {
            "description": "",
            "content": {
              "application/json": {
                "schema": {
                  "description": "The full list of errors is available with the global RPC `GET errors`"
                }
              }
            }
          }
        }
      }
    },
    "/p2p/points/disconnect/{point}": {
      "delete": {
        "description": "Disconnect from a point.",
        "parameters": [
          {
            "name": "point",
            "in": "path",
            "description": "A network point (ipv4:port or [ipv6]:port).",
            "required": true,
            "schema": {
              "type": "string"
            }
          },
          {
            "name": "wait",
            "in": "query",
            "required": false,
            "schema": {
              "type": "string"
            }
          }
        ],
        "responses": {
          "200": {
            "description": "",
            "content": {
              "application/json": {
                "schema": {}
              }
            }
          },
          "default": {
            "description": "",
            "content": {
              "application/json": {
                "schema": {
                  "description": "The full list of errors is available with the global RPC `GET errors`"
                }
              }
            }
          }
        }
      }
    },
    "/p2p/points/info": {
      "get": {
        "description": "By default, get the list of known points and their corresponding info. When the 'connected' flag is given, then only get the connected points.",
        "parameters": [
          {
            "name": "connected",
            "in": "query",
            "required": false,
            "schema": {
              "type": "string"
            }
          }
        ],
        "responses": {
          "200": {
            "description": "",
            "content": {
              "application/json": {
                "schema": {
                  "type": "array",
                  "items": {
                    "type": "object",
                    "properties": {
                      "point": {
                        "$ref": "#/components/schemas/p2p_point.id"
                      },
                      "info": {
                        "$ref": "#/components/schemas/p2p_point.info"
                      }
                    },
                    "required": [
                      "point",
                      "info"
                    ]
                  }
                }
              }
            }
          },
          "default": {
            "description": "",
            "content": {
              "application/json": {
                "schema": {
                  "description": "The full list of errors is available with the global RPC `GET errors`"
                }
              }
            }
          }
        }
      }
    },
    "/pages/{int}/proof": {
      "post": {
        "description": "Compute the proof associated with a page of a given slot.",
        "parameters": [
          {
            "name": "int",
            "in": "path",
            "required": true,
            "schema": {
              "type": "string"
            }
          }
        ],
        "requestBody": {
          "content": {
            "application/json": {
              "schema": {
                "type": "string",
                "pattern": "^([a-zA-Z0-9][a-zA-Z0-9])*$"
              }
            }
          }
        },
        "responses": {
          "200": {
            "description": "",
            "content": {
              "application/json": {
                "schema": {
                  "title": "Commitment representation for the DAL (Base58Check-encoded)",
                  "oneOf": [
                    {
                      "$ref": "#/components/schemas/unistring"
                    }
                  ]
                }
              }
            }
          },
          "default": {
            "description": "",
            "content": {
              "application/json": {
                "schema": {
                  "description": "The full list of errors is available with the global RPC `GET errors`"
                }
              }
            }
          }
        }
      }
    },
    "/profiles": {
      "get": {
        "description": "Return the list of current profiles tracked by the DAL node.",
        "responses": {
          "200": {
            "description": "",
            "content": {
              "application/json": {
                "schema": {
                  "oneOf": [
                    {
                      "title": "Boostrap node",
                      "type": "object",
                      "properties": {
                        "kind": {
                          "type": "string",
                          "enum": [
                            "bootstrap"
                          ]
                        }
                      },
                      "required": [
                        "kind"
                      ]
                    },
                    {
                      "title": "Operator",
                      "type": "object",
                      "properties": {
                        "kind": {
                          "type": "string",
                          "enum": [
                            "operator"
                          ]
                        },
                        "operator_profiles": {
                          "type": "array",
                          "items": {
                            "oneOf": [
                              {
                                "title": "Attester with pkh",
                                "type": "object",
                                "properties": {
                                  "kind": {
                                    "type": "string",
                                    "enum": [
                                      "attester"
                                    ]
                                  },
                                  "public_key_hash": {
                                    "$ref": "#/components/schemas/Signature.Public_key_hash"
                                  }
                                },
                                "required": [
                                  "kind",
                                  "public_key_hash"
                                ]
                              },
                              {
                                "title": "Slot producer",
                                "type": "object",
                                "properties": {
                                  "kind": {
                                    "type": "string",
                                    "enum": [
                                      "producer"
                                    ]
                                  },
                                  "slot_index": {
                                    "type": "integer",
                                    "minimum": -1073741824,
                                    "maximum": 1073741823
                                  }
                                },
                                "required": [
                                  "kind",
                                  "slot_index"
                                ]
                              },
                              {
                                "title": "observer",
                                "type": "object",
                                "properties": {
                                  "kind": {
                                    "type": "string",
                                    "enum": [
                                      "observer"
                                    ]
                                  },
                                  "slot_index": {
                                    "type": "integer",
                                    "minimum": -1073741824,
                                    "maximum": 1073741823
                                  }
                                },
                                "required": [
                                  "kind",
                                  "slot_index"
                                ]
                              }
                            ]
                          }
                        }
                      },
                      "required": [
                        "kind",
                        "operator_profiles"
                      ]
                    },
                    {
                      "title": "Random_observer",
                      "type": "object",
                      "properties": {
                        "kind": {
                          "type": "string",
                          "enum": [
                            "random_observer"
                          ]
                        }
                      },
                      "required": [
                        "kind"
                      ]
                    }
                  ]
                }
              }
            }
          },
          "default": {
            "description": "",
            "content": {
              "application/json": {
                "schema": {
                  "description": "The full list of errors is available with the global RPC `GET errors`"
                }
              }
            }
          }
        }
      },
      "patch": {
        "description": "Update the list of profiles tracked by the DAL node. Note that it does not take the bootstrap profile as it is incompatible with other profiles.",
        "requestBody": {
          "content": {
            "application/json": {
              "schema": {
                "type": "array",
                "items": {
                  "oneOf": [
                    {
                      "title": "Attester with pkh",
                      "type": "object",
                      "properties": {
                        "kind": {
                          "type": "string",
                          "enum": [
                            "attester"
                          ]
                        },
                        "public_key_hash": {
                          "$ref": "#/components/schemas/Signature.Public_key_hash"
                        }
                      },
                      "required": [
                        "kind",
                        "public_key_hash"
                      ]
                    },
                    {
                      "title": "Slot producer",
                      "type": "object",
                      "properties": {
                        "kind": {
                          "type": "string",
                          "enum": [
                            "producer"
                          ]
                        },
                        "slot_index": {
                          "type": "integer",
                          "minimum": -1073741824,
                          "maximum": 1073741823
                        }
                      },
                      "required": [
                        "kind",
                        "slot_index"
                      ]
                    },
                    {
                      "title": "observer",
                      "type": "object",
                      "properties": {
                        "kind": {
                          "type": "string",
                          "enum": [
                            "observer"
                          ]
                        },
                        "slot_index": {
                          "type": "integer",
                          "minimum": -1073741824,
                          "maximum": 1073741823
                        }
                      },
                      "required": [
                        "kind",
                        "slot_index"
                      ]
                    }
                  ]
                }
              }
            }
          }
        },
        "responses": {
          "200": {
            "description": "",
            "content": {
              "application/json": {
                "schema": {}
              }
            }
          },
          "default": {
            "description": "",
            "content": {
              "application/json": {
                "schema": {
                  "description": "The full list of errors is available with the global RPC `GET errors`"
                }
              }
            }
          }
        }
      }
    },
    "/profiles/{pkh}/attested_levels/{int32}/assigned_shard_indices": {
      "get": {
        "description": "Return the shard indexes assigned to the given public key hash at the given level.",
        "parameters": [
          {
            "name": "pkh",
            "in": "path",
            "description": "A Secp256k1 of a Ed25519 public key hash (Base58Check-encoded)",
            "required": true,
            "schema": {
              "type": "string"
            }
          },
          {
            "name": "int32",
            "in": "path",
            "required": true,
            "schema": {
              "type": "string"
            }
          }
        ],
        "responses": {
          "200": {
            "description": "",
            "content": {
              "application/json": {
                "schema": {
                  "type": "array",
                  "items": {
                    "type": "integer",
                    "minimum": -32768,
                    "maximum": 32767
                  }
                }
              }
            }
          },
          "default": {
            "description": "",
            "content": {
              "application/json": {
                "schema": {
                  "description": "The full list of errors is available with the global RPC `GET errors`"
                }
              }
            }
          }
        }
      }
    },
    "/profiles/{pkh}/attested_levels/{int32}/attestable_slots": {
      "get": {
        "description": "Return the currently attestable slots at the given attested level by the given public key hash. A slot is attestable at level [l] if it is published at level [l - attestation_lag] and *all* the shards assigned at level [l] to the given public key hash are available in the DAL node's store.",
        "parameters": [
          {
            "name": "pkh",
            "in": "path",
            "description": "A Secp256k1 of a Ed25519 public key hash (Base58Check-encoded)",
            "required": true,
            "schema": {
              "type": "string"
            }
          },
          {
            "name": "int32",
            "in": "path",
            "required": true,
            "schema": {
              "type": "string"
            }
          }
        ],
        "responses": {
          "200": {
            "description": "",
            "content": {
              "application/json": {
                "schema": {
                  "oneOf": [
                    {
                      "title": "attestable_slots_set",
                      "type": "object",
                      "properties": {
                        "kind": {
                          "type": "string",
                          "enum": [
                            "attestable_slots_set"
                          ]
                        },
                        "attestable_slots_set": {
                          "type": "array",
                          "items": {
                            "type": "boolean"
                          }
                        },
                        "published_level": {
                          "type": "integer",
                          "minimum": -2147483648,
                          "maximum": 2147483647
                        }
                      },
                      "required": [
                        "kind",
                        "attestable_slots_set",
                        "published_level"
                      ]
                    },
                    {
                      "title": "not_in_committee",
                      "type": "object",
                      "properties": {
                        "kind": {
                          "type": "string",
                          "enum": [
                            "not_in_committee"
                          ]
                        }
                      },
                      "required": [
                        "kind"
                      ]
                    }
                  ]
                }
              }
            }
          },
          "default": {
            "description": "",
            "content": {
              "application/json": {
                "schema": {
                  "description": "The full list of errors is available with the global RPC `GET errors`"
                }
              }
            }
          }
        }
      }
    },
    "/shard/{DAL_commitment}/{int}": {
      "get": {
        "description": "Fetch shard as bytes",
        "parameters": [
          {
            "name": "DAL_commitment",
            "in": "path",
            "description": "DAL_commitment (Base58Check-encoded)",
            "required": true,
            "schema": {
              "type": "string"
            }
          },
          {
            "name": "int",
            "in": "path",
            "required": true,
            "schema": {
              "type": "string"
            }
          }
        ],
        "responses": {
          "200": {
            "description": "",
            "content": {
              "application/json": {
                "schema": {
                  "type": "array",
                  "items": {
                    "oneOf": [
                      {
                        "type": "integer",
                        "minimum": -1073741824,
                        "maximum": 1073741823
                      },
                      {
                        "type": "array",
                        "items": {
                          "type": "string",
                          "pattern": "^([a-zA-Z0-9][a-zA-Z0-9])*$"
                        }
                      }
                    ]
                  }
                }
              }
            }
          },
          "default": {
            "description": "",
            "content": {
              "application/json": {
                "schema": {
                  "description": "The full list of errors is available with the global RPC `GET errors`"
                }
              }
            }
          }
        }
      }
    },
    "/slot": {
      "post": {
        "description": "Post a slot to the DAL node, computes its commitment and commitment proof, then computes the correspoding shards with their proof. The result of this RPC can be directly used to publish a slot header.",
        "parameters": [
          {
            "name": "padding",
            "in": "query",
            "required": true,
            "schema": {
              "type": "string"
            }
          }
        ],
        "requestBody": {
          "content": {
            "application/json": {
              "schema": {
                "title": "Universal string representation",
                "description": "Either a plain UTF8 string, or a sequence of bytes for strings that contain invalid byte sequences.",
                "oneOf": [
                  {
                    "type": "string"
                  },
                  {
                    "type": "object",
                    "properties": {
                      "invalid_utf8_string": {
                        "type": "array",
                        "items": {
                          "type": "integer",
                          "minimum": 0,
                          "maximum": 255
                        }
                      }
                    },
                    "required": [
                      "invalid_utf8_string"
                    ]
                  }
                ]
              }
            }
          }
        },
        "responses": {
          "200": {
            "description": "",
            "content": {
              "application/json": {
                "schema": {
                  "type": "object",
                  "properties": {
                    "commitment": {
                      "$ref": "#/components/schemas/DAL_commitment"
                    },
                    "commitment_proof": {
                      "type": "string",
                      "pattern": "^([a-zA-Z0-9][a-zA-Z0-9])*$"
                    }
                  },
                  "required": [
                    "commitment",
                    "commitment_proof"
                  ]
                }
              }
            }
          },
          "default": {
            "description": "",
            "content": {
              "application/json": {
                "schema": {
                  "description": "The full list of errors is available with the global RPC `GET errors`"
                }
              }
            }
          }
        }
      }
    },
    "/slot/pages/{DAL_commitment}": {
      "get": {
        "description": "Fetch slot as list of pages",
        "parameters": [
          {
            "name": "DAL_commitment",
            "in": "path",
            "description": "DAL_commitment (Base58Check-encoded)",
            "required": true,
            "schema": {
              "type": "string"
            }
          }
        ],
        "responses": {
          "200": {
            "description": "",
            "content": {
              "application/json": {
                "schema": {
                  "type": "array",
                  "items": {
                    "type": "string",
                    "pattern": "^([a-zA-Z0-9][a-zA-Z0-9])*$"
                  }
                }
              }
            }
          },
          "default": {
            "description": "",
            "content": {
              "application/json": {
                "schema": {
                  "description": "The full list of errors is available with the global RPC `GET errors`"
                }
              }
            }
          }
        }
      }
    },
    "/version": {
      "get": {
        "description": "version",
        "responses": {
          "200": {
            "description": "",
            "content": {
              "application/json": {
                "schema": {
                  "type": "object",
                  "properties": {
                    "network_version": {
                      "type": "object",
                      "properties": {
                        "chain_name": {
                          "$ref": "#/components/schemas/distributed_db_version.name"
                        },
                        "gossipsub": {
                          "$ref": "#/components/schemas/distributed_db_version"
                        },
                        "p2p_version": {
                          "$ref": "#/components/schemas/p2p_version"
                        }
                      },
                      "required": [
                        "chain_name",
                        "gossipsub",
                        "p2p_version"
                      ]
                    }
                  },
                  "required": [
                    "network_version"
                  ]
                }
              }
            }
          },
          "default": {
            "description": "",
            "content": {
              "application/json": {
                "schema": {
                  "description": "The full list of errors is available with the global RPC `GET errors`"
                }
              }
            }
          }
        }
      }
    }
  },
  "components": {
    "schemas": {
      "Crypto_box.Public_key_hash": {
        "title": "A Cryptobox public key ID (Base58Check-encoded)",
        "oneOf": [
          {
            "$ref": "#/components/schemas/unistring"
          }
        ]
      },
      "DAL_commitment": {
        "title": "Commitment representation for the DAL (Base58Check-encoded)",
        "oneOf": [
          {
            "$ref": "#/components/schemas/unistring"
          }
        ]
      },
      "Signature.Public_key_hash": {
        "title": "A Ed25519, Secp256k1, P256, or BLS public key hash (Base58Check-encoded)",
        "oneOf": [
          {
            "$ref": "#/components/schemas/unistring"
          }
        ]
      },
      "distributed_db_version": {
        "description": "A version number for the distributed DB protocol",
        "type": "integer",
        "minimum": 0,
        "maximum": 65535
      },
      "distributed_db_version.name": {
        "description": "A name for the distributed DB protocol",
        "oneOf": [
          {
            "$ref": "#/components/schemas/unistring"
          }
        ]
      },
      "int64": {
        "title": "64 bit integers",
        "description": "Decimal representation of 64 bit integers",
        "type": "string"
      },
      "p2p_address": {
        "description": "An address for locating peers.",
        "oneOf": [
          {
            "$ref": "#/components/schemas/unistring"
          }
        ]
      },
      "p2p_connection.id": {
        "description": "The identifier for a p2p connection. It includes an address and a port number.",
        "type": "object",
        "properties": {
          "addr": {
            "$ref": "#/components/schemas/p2p_address"
          },
          "port": {
            "type": "integer",
            "minimum": 0,
            "maximum": 65535
          }
        },
        "required": [
          "addr"
        ]
      },
      "p2p_peer.state": {
        "description": "The state a peer connection can be in: accepted (when the connection is being established), running (when the connection is already established), disconnected (otherwise).",
        "type": "string",
        "enum": [
          "running",
          "accepted",
          "disconnected"
        ]
      },
      "p2p_point.id": {
        "description": "Identifier for a peer point",
        "oneOf": [
          {
            "$ref": "#/components/schemas/unistring"
          }
        ]
      },
      "p2p_point.info": {
        "description": "Information about a peer point. Includes flags, state, and records about past events.",
        "type": "object",
        "properties": {
          "trusted": {
            "type": "boolean"
          },
          "greylisted_until": {
            "$ref": "#/components/schemas/timestamp.system"
          },
          "state": {
            "$ref": "#/components/schemas/p2p_point.state"
          },
          "p2p_peer_id": {
            "$ref": "#/components/schemas/Crypto_box.Public_key_hash"
          },
          "last_failed_connection": {
            "$ref": "#/components/schemas/timestamp.system"
          },
          "last_rejected_connection": {
            "type": "array",
            "items": {
              "oneOf": [
                {
                  "$ref": "#/components/schemas/Crypto_box.Public_key_hash"
                },
                {
                  "$ref": "#/components/schemas/timestamp.system"
                }
              ]
            }
          },
          "last_established_connection": {
            "type": "array",
            "items": {
              "oneOf": [
                {
                  "$ref": "#/components/schemas/Crypto_box.Public_key_hash"
                },
                {
                  "$ref": "#/components/schemas/timestamp.system"
                }
              ]
            }
          },
          "last_disconnection": {
            "type": "array",
            "items": {
              "oneOf": [
                {
                  "$ref": "#/components/schemas/Crypto_box.Public_key_hash"
                },
                {
                  "$ref": "#/components/schemas/timestamp.system"
                }
              ]
            }
          },
          "last_seen": {
            "type": "array",
            "items": {
              "oneOf": [
                {
                  "$ref": "#/components/schemas/Crypto_box.Public_key_hash"
                },
                {
                  "$ref": "#/components/schemas/timestamp.system"
                }
              ]
            }
          },
          "last_miss": {
            "$ref": "#/components/schemas/timestamp.system"
          },
          "expected_peer_id": {
            "$ref": "#/components/schemas/Crypto_box.Public_key_hash"
          }
        },
        "required": [
          "trusted",
          "state"
        ]
      },
      "p2p_point.state": {
        "description": "The state a connection to a peer point can be in: requested (connection open from here), accepted (handshake), running (connection already established), disconnected (no connection).",
        "oneOf": [
          {
            "title": "Requested",
            "type": "object",
            "properties": {
              "event_kind": {
                "type": "string",
                "enum": [
                  "requested"
                ]
              }
            },
            "required": [
              "event_kind"
            ]
          },
          {
            "title": "Accepted",
            "type": "object",
            "properties": {
              "event_kind": {
                "type": "string",
                "enum": [
                  "accepted"
                ]
              },
              "p2p_peer_id": {
                "$ref": "#/components/schemas/Crypto_box.Public_key_hash"
              }
            },
            "required": [
              "event_kind",
              "p2p_peer_id"
            ]
          },
          {
            "title": "Running",
            "type": "object",
            "properties": {
              "event_kind": {
                "type": "string",
                "enum": [
                  "running"
                ]
              },
              "p2p_peer_id": {
                "$ref": "#/components/schemas/Crypto_box.Public_key_hash"
              }
            },
            "required": [
              "event_kind",
              "p2p_peer_id"
            ]
          },
          {
            "title": "Disconnected",
            "type": "object",
            "properties": {
              "event_kind": {
                "type": "string",
                "enum": [
                  "disconnected"
                ]
              }
            },
            "required": [
              "event_kind"
            ]
          }
        ]
      },
      "p2p_stat": {
        "description": "Statistics about the p2p network.",
        "type": "object",
        "properties": {
          "total_sent": {
            "$ref": "#/components/schemas/int64"
          },
          "total_recv": {
            "$ref": "#/components/schemas/int64"
          },
          "current_inflow": {
            "type": "integer",
            "minimum": -1073741824,
            "maximum": 1073741823
          },
          "current_outflow": {
            "type": "integer",
            "minimum": -1073741824,
            "maximum": 1073741823
          }
        },
        "required": [
          "total_sent",
          "total_recv",
          "current_inflow",
          "current_outflow"
        ]
      },
      "p2p_version": {
        "description": "A version number for the p2p layer.",
        "type": "integer",
        "minimum": 0,
        "maximum": 65535
      },
      "timestamp.rfc": {
        "title": "RFC 3339 formatted timestamp",
        "description": "A date in RFC 3339 notation.",
        "oneOf": [
          {
            "$ref": "#/components/schemas/unistring"
          }
        ]
      },
      "timestamp.system": {
        "description": "A timestamp as seen by the underlying, local computer: subsecond-level precision, epoch or rfc3339 based.",
        "oneOf": [
          {
            "title": "RFC encoding",
            "oneOf": [
              {
                "$ref": "#/components/schemas/timestamp.rfc"
              }
            ]
          },
          {
            "title": "Second since epoch",
            "oneOf": [
              {
                "$ref": "#/components/schemas/int64"
              }
            ]
          }
        ]
      },
      "unistring": {
        "title": "Universal string representation",
        "description": "Either a plain UTF8 string, or a sequence of bytes for strings that contain invalid byte sequences.",
        "oneOf": [
          {
            "type": "string"
          },
          {
            "type": "object",
            "properties": {
              "invalid_utf8_string": {
                "type": "array",
                "items": {
                  "type": "integer",
                  "minimum": 0,
                  "maximum": 255
                }
              }
            },
            "required": [
              "invalid_utf8_string"
            ]
          }
        ]
      }
    }
  }
}
