{
  "type": "service_account",
  "project_id": "ferrous-acronym-233311",
  "private_key_id": "ad804d51d098f063aa3f82e54110f0a8fa7de999",
  "private_key": "-----BEGIN PRIVATE KEY-----\nMIIEvgIBADANBgkqhkiG9w0BAQEFAASCBKgwggSkAgEAAoIBAQDMjdfB0yCfqpVW\nusIcVAbJ5U0QEmpkq/2zxIVw27EL2dMEWAj5n5YC1wkawcFxrYWcPPz7wnCYpPSo\n0ZAMYeusrwfg24NxegvHPYDlk46FEwe8B6T0k08t5WRbXfZ/Hr6KKFK5+Hm5SGZ7\nEqqOjlFD00mUYg03zmQbghG8updnUlApo8W+nEucUBWfI6hrUY2gszDkrjOsiHZO\nXxKUEPkL45daoBBWkMUqj+AbtvKR1h/JcYk64kN+O1SfaIsxVQ6amOW1XOT5Hkl+\ndj9e50bzAO9CFpNAb/U3evJtQ66bicq81ZmT0aPq21XoxWpbRa6Kc3iGPCko9kOd\nlLpfgE5PAgMBAAECggEAAUohopYEqM0IAlMiFyX2dv5hlSjbOoWVD2A9S8quxo7Z\n1DdZMyMCQe6oyYjlgc8gvlfqFmI8QydtvW9jc5iIcP8Xfco/KA98vzBQPYzybedX\n+fj9srxdAu06dpL/Pf+WdEOF0Kiph8qrjroS5jGCf1Aihh4fduBvuXar9Z8i241i\nk3guLNb1o9kLhvOmHM6upuOkWEkWMWTGcS9y5N/AnfTQ4aJ4yLbWSK5HOjyyomM9\nE5Pv0NoE41fQE3VwiTjwyFN12WgfRCgpki2odzLYelDW1vDX9Pumynjic/l/JefB\nQi1BZvUi1waOW5qyGwWEnyhIH4LvRP0bmypnP4VVTQKBgQDqSdS8kLrtB532kHwq\nzH20+J+/0m0kBlhIw3jwu5XJ56LsyzdiIUiO2h1oj0jMtGMZ6/quVtzPVI6cYhll\nDSyHFWmTsKJYRB3qalkRNmILVZWzReMGQYyotFzoyYaamqHg847R1agAQePcXfam\n18fp7bERupiXMAk0RMNUAqhvqwKBgQDfgpsbIqTeB2oeO6xN8B92nIjQo32W1qPw\nbsZG0majtForrNPsKBeTCZExuvJo75mQW3E9vtgS+GUaLOFGkfI1J3lbmffIiFSz\n9bb1qBHGGY50m9e0wf8C6Loe//zSSG1WJ/bNZNAGfXPHGZfm5yvJxTJgUIIk3b1K\nqNgqaUnH7QKBgQC/Y7rOo6if8yX+gr98MvrJ+IR/rgWMdUZvgodsmMDfZEN7DvNa\nTXg5gkKd5NcCqqV+SoDJJJpTIG8znwvBugZS/5H0nUmxs0uA8Il7/yIOwkZ9Yaz4\nslmWg2iWnfJAn+t3mV9lWRVZyHm8zmGsn/9mwM5yfi0i7JHIShgKq/Uu6wKBgCaY\nkho0eE3S7/M6kL2Aqp4717BXmxdSB0s8hcazDIBWY3/JP2s3XSLJ8yWoR7XxMg5o\ni/yCmSNle2fyuhAKoc2l/GHiC5S4XhAZbTeshy0zOpNOWghfu56P+5vgzpKtaRwI\nmKjNMNL+FOEbvUxlPP2BrPpOzLp7A/YBhBqGxfPdAoGBAN7u773iYRcBNzNxUO7Q\ndz7uzuYJS+nIkYEeoYFifVIIacaGuddqelQomON0cGa2zekrggFRw7G7HAK7ciKL\nbNEoJX46S93qbSnqGD9n15OukfuJDHbpq0QRhyFVKwz/dbhijU8BsuYiueOziGId\n0q3Hl7ZZbabWy9ylt2RKH4S3\n-----END PRIVATE KEY-----\n",
  "client_email": "botiq-309@ferrous-acronym-233311.iam.gserviceaccount.com",
  "client_id": "104813456298825178402",
  "auth_uri": "https://accounts.google.com/o/oauth2/auth",
  "token_uri": "https://oauth2.googleapis.com/token",
  "auth_provider_x509_cert_url": "https://www.googleapis.com/oauth2/v1/certs",
  "client_x509_cert_url": "https://www.googleapis.com/robot/v1/metadata/x509/botiq-309%40ferrous-acronym-233311.iam.gserviceaccount.com"
}
