<?xml version="1.0" encoding="utf-8"?>
<COLLADA xmlns="http://www.collada.org/2005/11/COLLADASchema" version="1.4.1" xmlns:xsi="http://www.w3.org/2001/XMLSchema-instance">
  <asset>
    <contributor>
      <author>Blender User</author>
      <authoring_tool>Blender 2.82.7</authoring_tool>
    </contributor>
    <created>2023-03-09T07:08:49</created>
    <modified>2023-03-09T07:08:49</modified>
    <unit name="meter" meter="1"/>
    <up_axis>Z_UP</up_axis>
  </asset>
  <library_effects>
    <effect id="Material_001-effect">
      <profile_COMMON>
        <newparam sid="kartofan_jpg-surface">
          <surface type="2D">
            <init_from>kartofan_jpg</init_from>
          </surface>
        </newparam>
        <newparam sid="kartofan_jpg-sampler">
          <sampler2D>
            <source>kartofan_jpg-surface</source>
          </sampler2D>
        </newparam>
        <technique sid="common">
          <lambert>
            <emission>
              <color sid="emission">0 0 0 1</color>
            </emission>
            <diffuse>
              <texture texture="kartofan_jpg-sampler" texcoord="UVMap"/>
            </diffuse>
            <index_of_refraction>
              <float sid="ior">1.45</float>
            </index_of_refraction>
          </lambert>
        </technique>
      </profile_COMMON>
    </effect>
    <effect id="Material-effect">
      <profile_COMMON>
        <newparam sid="pallete_2_png-surface">
          <surface type="2D">
            <init_from>pallete_2_png</init_from>
          </surface>
        </newparam>
        <newparam sid="pallete_2_png-sampler">
          <sampler2D>
            <source>pallete_2_png-surface</source>
          </sampler2D>
        </newparam>
        <technique sid="common">
          <lambert>
            <emission>
              <color sid="emission">0 0 0 1</color>
            </emission>
            <diffuse>
              <texture texture="pallete_2_png-sampler" texcoord="UVMap"/>
            </diffuse>
            <index_of_refraction>
              <float sid="ior">1.45</float>
            </index_of_refraction>
          </lambert>
        </technique>
      </profile_COMMON>
    </effect>
  </library_effects>
  <library_images>
    <image id="kartofan_jpg" name="kartofan_jpg">
      <init_from>kartofan.jpg</init_from>
    </image>
    <image id="pallete_2_png" name="pallete_2_png">
      <init_from>pallete_2.png</init_from>
    </image>
  </library_images>
  <library_materials>
    <material id="Material_001-material" name="Material.001">
      <instance_effect url="#Material_001-effect"/>
    </material>
    <material id="Material-material" name="Material">
      <instance_effect url="#Material-effect"/>
    </material>
  </library_materials>
  <library_geometries>
    <geometry id="Cube_001-mesh" name="Cube.001">
      <mesh>
        <source id="Cube_001-mesh-positions">
          <float_array id="Cube_001-mesh-positions-array" count="48">-0.5 -0.5 -0.5 -0.5 -0.5 0.5 -0.5 0.5 -0.5 -0.5 0.5 0.5 0.5 -0.5 -0.5 0.5 -0.5 0.5 0.5 0.5 -0.5 0.5 0.5 0.5 0.07801306 0.5 -0.5 -0.07801306 0.5 -0.5 -0.07801306 0.5 0.5 0.07801306 0.5 0.5 -0.07801306 -0.5 -0.5 0.07801306 -0.5 -0.5 0.07801306 -0.5 0.5 -0.07801306 -0.5 0.5</float_array>
          <technique_common>
            <accessor source="#Cube_001-mesh-positions-array" count="16" stride="3">
              <param name="X" type="float"/>
              <param name="Y" type="float"/>
              <param name="Z" type="float"/>
            </accessor>
          </technique_common>
        </source>
        <source id="Cube_001-mesh-normals">
          <float_array id="Cube_001-mesh-normals-array" count="18">-1 0 0 0 1 0 1 0 0 0 -1 0 0 0 -1 0 0 1</float_array>
          <technique_common>
            <accessor source="#Cube_001-mesh-normals-array" count="6" stride="3">
              <param name="X" type="float"/>
              <param name="Y" type="float"/>
              <param name="Z" type="float"/>
            </accessor>
          </technique_common>
        </source>
        <source id="Cube_001-mesh-map">
          <float_array id="Cube_001-mesh-map-array" count="168">0.05626815 0.1840737 0.230876 0.8097702 0.05136704 0.8048691 0.3306884 0.847641 0.2660658 0.1265711 0.3306884 0.1265711 0.5527772 0.2634828 0.8586509 0.8323007 0.5527772 0.8323006 0.1851511 0.04497092 0.2751806 0.8739815 0.185151 0.8739815 0.4750905 0.8718224 0.2568519 0.6399047 0.4750905 0.6399047 0.2694028 0.1734312 0.4973475 0.3998235 0.2678468 0.3868038 0.2662909 0.6001765 0.4942356 0.8265689 0.2647349 0.8135491 0.2916928 0.6448462 0.2995294 0.5470809 0.301869 0.6224064 0.4750905 0.407987 0.2568519 0.1760693 0.4750905 0.1760693 0.3421881 0.6139827 0.3500247 0.5162174 0.3500247 0.6262729 0.005092024 0.04497087 0.0951215 0.8739815 0.005091965 0.8739815 0.2995294 0.5470809 0.3500247 0.5162174 0.3398486 0.538657 0.4599334 0.847641 0.3953109 0.1265712 0.4599334 0.1265712 0.2916928 0.6448462 0.3421881 0.6139827 0.3500247 0.6262729 0.05626815 0.1840737 0.2357771 0.1889748 0.230876 0.8097702 0.3306884 0.847641 0.2660658 0.847641 0.2660658 0.1265711 0.5527772 0.2634828 0.858651 0.2634828 0.8586509 0.8323007 0.1851511 0.04497092 0.2751806 0.04497098 0.2751806 0.8739815 0.4750905 0.8718224 0.2568519 0.8718224 0.2568519 0.6399047 0.2694028 0.1734312 0.4989036 0.1864508 0.4973475 0.3998235 0.2662909 0.6001765 0.4957916 0.6131961 0.4942356 0.8265689 0.2916928 0.6448462 0.2916928 0.5347907 0.2995294 0.5470809 0.4750905 0.407987 0.2568519 0.407987 0.2568519 0.1760693 0.3421881 0.6139827 0.3398486 0.538657 0.3500247 0.5162174 0.005092024 0.04497087 0.09512156 0.04497092 0.0951215 0.8739815 0.2995294 0.5470809 0.2916928 0.5347907 0.3500247 0.5162174 0.4599334 0.847641 0.3953108 0.8476409 0.3953109 0.1265712 0.2916928 0.6448462 0.301869 0.6224064 0.3421881 0.6139827</float_array>
          <technique_common>
            <accessor source="#Cube_001-mesh-map-array" count="84" stride="2">
              <param name="S" type="float"/>
              <param name="T" type="float"/>
            </accessor>
          </technique_common>
        </source>
        <vertices id="Cube_001-mesh-vertices">
          <input semantic="POSITION" source="#Cube_001-mesh-positions"/>
        </vertices>
        <triangles material="Material_001-material" count="20">
          <input semantic="VERTEX" source="#Cube_001-mesh-vertices" offset="0"/>
          <input semantic="NORMAL" source="#Cube_001-mesh-normals" offset="1"/>
          <input semantic="TEXCOORD" source="#Cube_001-mesh-map" offset="2" set="0"/>
          <p>1 0 0 2 0 1 0 0 2 11 1 3 6 1 4 8 1 5 7 2 6 4 2 7 6 2 8 15 3 9 0 3 10 12 3 11 6 4 12 13 4 13 8 4 14 3 5 15 15 5 16 10 5 17 11 5 18 5 5 19 7 5 20 9 4 24 0 4 25 2 4 26 5 3 30 13 3 31 4 3 32 3 1 36 9 1 37 2 1 38 1 0 42 3 0 43 2 0 44 11 1 45 7 1 46 6 1 47 7 2 48 5 2 49 4 2 50 15 3 51 1 3 52 0 3 53 6 4 54 4 4 55 13 4 56 3 5 57 1 5 58 15 5 59 11 5 60 14 5 61 5 5 62 9 4 66 12 4 67 0 4 68 5 3 72 14 3 73 13 3 74 3 1 78 10 1 79 9 1 80</p>
        </triangles>
        <triangles material="Material-material" count="8">
          <input semantic="VERTEX" source="#Cube_001-mesh-vertices" offset="0"/>
          <input semantic="NORMAL" source="#Cube_001-mesh-normals" offset="1"/>
          <input semantic="TEXCOORD" source="#Cube_001-mesh-map" offset="2" set="0"/>
          <p>10 5 21 14 5 22 11 5 23 8 4 27 12 4 28 9 4 29 14 3 33 12 3 34 13 3 35 10 1 39 8 1 40 9 1 41 10 5 63 15 5 64 14 5 65 8 4 69 13 4 70 12 4 71 14 3 75 15 3 76 12 3 77 10 1 81 11 1 82 8 1 83</p>
        </triangles>
      </mesh>
    </geometry>
  </library_geometries>
  <library_visual_scenes>
    <visual_scene id="Scene" name="Scene">
      <node id="Cube_001" name="Cube.001" type="NODE">
        <matrix sid="transform">1 0 0 0 0 0.5 0 0 0 0 0.25 0 0 0 0 1</matrix>
        <instance_geometry url="#Cube_001-mesh" name="Cube.001">
          <bind_material>
            <technique_common>
              <instance_material symbol="Material_001-material" target="#Material_001-material">
                <bind_vertex_input semantic="UVMap" input_semantic="TEXCOORD" input_set="0"/>
              </instance_material>
              <instance_material symbol="Material-material" target="#Material-material">
                <bind_vertex_input semantic="UVMap" input_semantic="TEXCOORD" input_set="0"/>
              </instance_material>
            </technique_common>
          </bind_material>
        </instance_geometry>
      </node>
    </visual_scene>
  </library_visual_scenes>
  <scene>
    <instance_visual_scene url="#Scene"/>
  </scene>
</COLLADA>