<?xml version="1.0"?>
<robot name="bag_5">
  <link name="bag">
    <inertial>
      <mass value="1"/>
      <inertia ixx="0.0108" ixy="0" ixz="0" iyy="0.0083" iyz="0" izz="0.0042"/>
    </inertial>
    <visual>
      <geometry>
        <mesh filename="package://local_referee/models/master/bag_5.dae" scale="0.6 0.6 0.6"/>
      </geometry>
    </visual>
    <collision name="bag">
      <geometry>
        <mesh filename="package://local_referee/models/master/bag_5.dae" scale="0.6 0.6 0.6"/>
      </geometry>
    </collision>
  </link>
  <gazebo reference="bag">
    <!-- <static>true</static> -->
    <!-- <material>Gazebo/Red</material> -->
    <mu1>0.1</mu1>
    <mu2>0.1</mu2>
    <kd>1e5</kd>
  </gazebo>  
</robot>