<?xml version="1.0"?>
<robot name="angar">
  <link name="angar">
    <inertial>
      <mass value="1"/>
      <inertia ixx="0.0108" ixy="0" ixz="0" iyy="0.0083" iyz="0" izz="0.0042"/>
    </inertial>
    <visual>
      <!-- <geometry>
        <box size="10.5 10.6 0.1"/>
      </geometry> -->
    </visual>
    <!-- <collision name="angar">
      <geometry>
        <box size="8.1 8.6 0.1"/>
      </geometry>
    </collision> -->
  </link>
<gazebo>
    <static>true</static>
</gazebo>
</robot>