{
    "date-x": [
        {
            "date": 0,
            "x": 0
        },
        {
            "date": 149.610227,
            "x": 2860
        }
    ],
    "staffs": [
        {
            "bottom": 55.0,
            "top": 5.0
        },
        {
            "bottom": 115.0,
            "top": 65.0
        },
        {
            "bottom": 175.0,
            "top": 125.0
        },
        {
            "bottom": 235.0,
            "top": 185.0
        },
        {
            "bottom": 295.0,
            "top": 245.0
        }
    ]
}