<?xml version="1.0" encoding="UTF-8" standalone="no"?>
<!-- Created with Inkscape (http://www.inkscape.org/) -->

<svg
   xmlns:dc="http://purl.org/dc/elements/1.1/"
   xmlns:cc="http://creativecommons.org/ns#"
   xmlns:rdf="http://www.w3.org/1999/02/22-rdf-syntax-ns#"
   xmlns:svg="http://www.w3.org/2000/svg"
   xmlns="http://www.w3.org/2000/svg"
   xmlns:xlink="http://www.w3.org/1999/xlink"
   xmlns:sodipodi="http://sodipodi.sourceforge.net/DTD/sodipodi-0.dtd"
   xmlns:inkscape="http://www.inkscape.org/namespaces/inkscape"
   width="300"
   height="300"
   viewBox="0 0 300 300"
   id="svg2"
   version="1.1"
   inkscape:version="0.91 r13725"
   sodipodi:docname="dezrann-logo.svg"
   inkscape:export-filename="/Volumes/22/magiraud/git/dezrann/code/sc-client/images/dezrann-logo.png"
   inkscape:export-xdpi="52.756664"
   inkscape:export-ydpi="52.756664">
  <defs
     id="defs4">
    <linearGradient
       inkscape:collect="always"
       id="linearGradient4183">
      <stop
         style="stop-color:#000000;stop-opacity:1;"
         offset="0"
         id="stop4185" />
      <stop
         style="stop-color:#000000;stop-opacity:0;"
         offset="1"
         id="stop4187" />
    </linearGradient>
    <linearGradient
       inkscape:collect="always"
       xlink:href="#linearGradient4183"
       id="linearGradient4189"
       x1="223.53215"
       y1="-313.34946"
       x2="470.77502"
       y2="-313.34946"
       gradientUnits="userSpaceOnUse"
       gradientTransform="translate(555.9125,347.98139)" />
  </defs>
  <sodipodi:namedview
     id="base"
     pagecolor="#ffffff"
     bordercolor="#666666"
     borderopacity="1.0"
     inkscape:pageopacity="0"
     inkscape:pageshadow="2"
     inkscape:zoom="0.37741825"
     inkscape:cx="150"
     inkscape:cy="-389.05874"
     inkscape:document-units="px"
     inkscape:current-layer="layer1"
     showgrid="false"
     units="px"
     inkscape:window-width="1920"
     inkscape:window-height="1036"
     inkscape:window-x="-4"
     inkscape:window-y="0"
     inkscape:window-maximized="0"
     inkscape:showpageshadow="false" />
  <metadata
     id="metadata7">
    <rdf:RDF>
      <cc:Work
         rdf:about="">
        <dc:format>image/svg+xml</dc:format>
        <dc:type
           rdf:resource="http://purl.org/dc/dcmitype/StillImage" />
        <dc:title />
      </cc:Work>
    </rdf:RDF>
  </metadata>
  <g
     inkscape:label="Calque 1"
     inkscape:groupmode="layer"
     id="layer1"
     transform="translate(0,-752.36216)">
    <rect
       style="opacity:1;fill:#ffffff;fill-opacity:1;stroke:none;stroke-width:2;stroke-linecap:round;stroke-linejoin:round;stroke-miterlimit:4;stroke-dasharray:none;stroke-dashoffset:0;stroke-opacity:1"
       id="rect9146"
       width="1269.149"
       height="1854.7062"
       x="-68.889091"
       y="196.54768"
       ry="0.57426286"
       inkscape:export-xdpi="52"
       inkscape:export-ydpi="52" />
    <path
       sodipodi:nodetypes="csccscc"
       style="fill:#000000"
       inkscape:connector-curvature="0"
       d="m 85.510433,595.32111 c 0,4.1664 -3.74971,7.9161 -7.91592,7.9161 -4.16639,0 -7.4994,-3.7497 -7.4994,-7.9161 l 0,-278.3104 c 0,-4.1664 3.33301,-7.9159 7.4994,-7.9159 4.16621,0 7.91592,3.7495 7.91592,7.9159 0,92.7702 0,185.5403 0,278.3104 z"
       id="path8956" />
    <rect
       style="opacity:1;fill:#80ff80;stroke:#000000;stroke-width:0.11246857;stroke-miterlimit:4;stroke-dasharray:none;stroke-opacity:1"
       id="rect4195"
       width="159.85852"
       height="58.941792"
       x="-233.69936"
       y="857.42615"
       rx="10"
       transform="matrix(0.92352779,-0.38353152,0.38217237,0.92409106,0,0)" />
    <rect
       style="opacity:1;fill:#5599ff;stroke:#000000;stroke-width:0.10526828;stroke-miterlimit:4;stroke-dasharray:none;stroke-opacity:1"
       id="rect4195-5"
       width="140.02785"
       height="58.949127"
       x="-327.40738"
       y="938.95459"
       rx="10"
       transform="matrix(0.92262706,-0.38569329,0.38505591,0.92289325,0,0)" />
    <rect
       style="opacity:1;fill:#ff8080;stroke:#000000;stroke-width:0.12442477;stroke-miterlimit:4;stroke-dasharray:none;stroke-opacity:1"
       id="rect4195-3"
       width="195.69252"
       height="58.929974"
       x="-305.40762"
       y="777.23267"
       rx="10"
       transform="matrix(0.92219165,-0.38673319,0.38725401,0.92197307,0,0)" />
    <rect
       style="fill:#000000"
       id="rect3336"
       width="247.14285"
       height="10"
       x="791.80914"
       y="113.45051"
       transform="matrix(0.2492954,0.96842749,-0.96842749,0.2492954,0,0)"
       rx="5" />
    <rect
       style="fill:#000000;stroke:url(#linearGradient4189);stroke-width:0.1;stroke-miterlimit:4;stroke-dasharray:none;stroke-opacity:1"
       id="rect3336-3"
       width="247.14285"
       height="10"
       x="779.49463"
       y="29.631918"
       transform="matrix(0.2492954,0.96842749,-0.96842749,0.2492954,0,0)"
       rx="5" />
    <rect
       style="fill:#000000"
       id="rect3336-3-6"
       width="247.14285"
       height="10"
       x="76.70462"
       y="-851.39624"
       transform="matrix(-0.92262295,0.38570311,-0.38570311,-0.92262295,0,0)"
       rx="5" />
    <rect
       style="fill:#000000"
       id="rect3336-3-6-7"
       width="247.14285"
       height="10"
       x="86.994476"
       y="-932.42731"
       transform="matrix(-0.92262295,0.38570311,-0.38570311,-0.92262295,0,0)"
       rx="5" />
    <text
       style="font-size:13.69924927px;font-family:serif;text-anchor:start;fill:currentColor"
       font-size="2.2001"
       id="text8701"
       x="837.8891"
       y="170.55508">
      <tspan
         id="tspan8703" />
    </text>
    <g
       id="g8797"
       transform="translate(-101.42857,0)">
      <path
         sodipodi:nodetypes="csssccssscc"
         style="fill:#000000"
         inkscape:connector-curvature="0"
         d="m 523.90577,989.69152 c -0.83305,0.41648 -2.08311,0.41648 -2.91649,0.41648 -4.58291,0 -8.33261,-3.74963 -8.33261,-8.33254 l 0,-24.998 c 0,-3.33302 2.08311,-6.66619 5.41629,-7.91592 32.86404,-11.17177 65.08484,-24.13025 97.90851,-35.41371 0.83301,-0.41652 2.08311,-0.41652 2.9163,-0.41652 4.5831,0 8.33278,3.74971 8.33278,8.33261 l 0,24.99799 c 0,3.33301 -2.08329,6.24933 -5.41629,7.49923 -33.2606,12.38528 -68.9971,25.0069 -97.90849,35.83038 z"
         id="path8789" />
      <path
         sodipodi:nodetypes="csccscc"
         style="fill:#000000"
         inkscape:connector-curvature="0"
         d="m 552.65329,1045.1036 c 0,4.1664 -3.74971,7.9161 -7.91592,7.9161 -4.16639,0 -7.4994,-3.7497 -7.4994,-7.9161 l 0,-278.31033 c 0,-4.16639 3.33301,-7.91592 7.4994,-7.91592 4.16621,0 7.91592,3.74953 7.91592,7.91592 0,92.77011 0,185.54022 0,278.31033 z"
         id="path8791" />
      <path
         sodipodi:nodetypes="csccscc"
         style="fill:#000000"
         inkscape:connector-curvature="0"
         d="m 602.64925,1026.7718 c 0,4.1664 -3.33316,7.9159 -7.49941,7.9159 -4.16639,0 -7.91607,-3.7495 -7.91607,-7.9159 l 0,-278.31033 c 0,-4.1664 3.74968,-7.91609 7.91607,-7.91609 4.16625,0 7.49941,3.74969 7.49941,7.91609 0,92.77011 0,185.54022 0,278.31033 z"
         id="path8793" />
      <path
         sodipodi:nodetypes="csssccccssscc"
         style="fill:#000000"
         inkscape:connector-curvature="0"
         d="m 523.90577,880.11724 -2.91649,0.41653 c -4.53687,0.64795 -8.33261,-3.7497 -8.33261,-8.33261 l 0,-24.99798 c 0,-3.33302 2.08311,-6.24933 5.41629,-7.49923 l 19.16501,-7.08288 15.41532,-5.41612 c 20.97494,-8.1487 42.26322,-15.432 63.32818,-23.3314 0.83301,-0.41652 2.08311,-0.41652 2.9163,-0.41652 4.5831,0 8.33278,3.7497 8.33278,8.33261 l 0,24.99799 c 0,3.333 -2.08329,6.66619 -5.41629,7.91591 -32.86403,11.17176 -65.08482,24.13025 -97.90849,35.4137 z"
         id="path8795" />
    </g>
    <path
       sodipodi:nodetypes="csssccssscc"
       style="fill:#000000"
       inkscape:connector-curvature="0"
       d="m 700.59687,989.69152 c -0.83305,0.41648 -2.08311,0.41648 -2.91649,0.41648 -4.58291,0 -8.33261,-3.74963 -8.33261,-8.33254 l 0,-24.998 c 0,-3.33302 2.08311,-6.66619 5.41629,-7.91592 32.86404,-11.17177 65.08484,-24.13025 97.90851,-35.41371 0.83301,-0.41652 2.08311,-0.41652 2.9163,-0.41652 4.5831,0 8.33278,3.74971 8.33278,8.33261 l 0,24.99799 c 0,3.33301 -2.08329,6.24933 -5.41629,7.49923 -33.2606,12.38528 -68.9971,25.0069 -97.90849,35.83038 z"
       id="path8805" />
    <path
       id="path8821"
       d="m 654.1683,1060.5458 -2.91649,0.4166 c -4.53687,0.6479 -8.33261,-3.7497 -8.33261,-8.3326 l 0,-24.998 c 0,-3.333 2.08311,-6.2494 5.41629,-7.4993 l 19.16501,-7.0828 15.41532,-5.4162 c 20.97494,-8.14868 42.26322,-15.43198 63.32818,-23.33138 0.83301,-0.41652 2.08311,-0.41652 2.9163,-0.41652 4.5831,0 8.33278,3.7497 8.33278,8.33261 l 0,24.99799 c 0,3.333 -2.08329,6.6662 -5.41629,7.9159 -32.86403,11.1718 -65.08482,24.1303 -97.90849,35.4137 z"
       inkscape:connector-curvature="0"
       style="fill:#5599ff;fill-opacity:1"
       sodipodi:nodetypes="csssccccssscc" />
    <path
       sodipodi:nodetypes="csssccccssscc"
       style="fill:#ff8080;fill-opacity:1"
       inkscape:connector-curvature="0"
       d="m 686.02545,832.26009 -2.91649,0.41653 c -4.53687,0.64795 -8.33261,-3.7497 -8.33261,-8.33261 l 0,-24.99798 c 0,-3.33302 2.08311,-6.24933 5.41629,-7.49923 l 19.16501,-7.08288 15.41532,-5.41612 c 20.97494,-8.1487 42.26322,-15.432 63.32818,-23.3314 0.83301,-0.41652 2.08311,-0.41652 2.9163,-0.41652 4.5831,0 8.33278,3.7497 8.33278,8.33261 l 0,24.99799 c 0,3.333 -2.08329,6.66619 -5.41629,7.91591 -32.86403,11.17176 -65.08482,24.13025 -97.90849,35.4137 z"
       id="path8819" />
    <path
       sodipodi:nodetypes="csccscc"
       style="fill:#000000"
       inkscape:connector-curvature="0"
       d="m 729.34439,1045.1036 c 0,4.1664 -3.74971,7.9161 -7.91592,7.9161 -4.16639,0 -7.4994,-3.7497 -7.4994,-7.9161 l 0,-278.31033 c 0,-4.16639 3.33301,-7.91592 7.4994,-7.91592 4.16621,0 7.91592,3.74953 7.91592,7.91592 0,92.77011 0,185.54022 0,278.31033 z"
       id="path8807" />
    <path
       id="path8817"
       d="m 750.31116,917.10708 -2.91649,0.41653 c -4.53687,0.64795 -8.33261,-3.7497 -8.33261,-8.33261 l 0,-24.99798 c 0,-3.33302 2.08311,-6.24933 5.41629,-7.49923 l 19.16501,-7.08288 15.41532,-5.41612 c 20.97494,-8.1487 42.26322,-15.432 63.32818,-23.3314 0.83301,-0.41652 2.08311,-0.41652 2.9163,-0.41652 4.5831,0 8.33278,3.7497 8.33278,8.33261 l 0,24.99799 c 0,3.333 -2.08329,6.66619 -5.41629,7.91591 -32.86403,11.17176 -65.08482,24.13025 -97.90849,35.4137 z"
       inkscape:connector-curvature="0"
       style="fill:#80ff80;fill-opacity:1"
       sodipodi:nodetypes="csssccccssscc" />
    <path
       sodipodi:nodetypes="csccscc"
       style="fill:#000000"
       inkscape:connector-curvature="0"
       d="m 779.34035,1026.7718 c 0,4.1664 -3.33316,7.9159 -7.49941,7.9159 -4.16639,0 -7.91607,-3.7495 -7.91607,-7.9159 l 0,-278.31033 c 0,-4.1664 3.74968,-7.91609 7.91607,-7.91609 4.16625,0 7.49941,3.74969 7.49941,7.91609 0,92.77011 0,185.54022 0,278.31033 z"
       id="path8809" />
    <path
       sodipodi:nodetypes="csssccccssscc"
       style="fill:#000000"
       inkscape:connector-curvature="0"
       d="m 700.59687,880.11724 -2.91649,0.41653 c -4.53687,0.64795 -8.33261,-3.7497 -8.33261,-8.33261 l 0,-24.99798 c 0,-3.33302 2.08311,-6.24933 5.41629,-7.49923 l 19.16501,-7.08288 15.41532,-5.41612 c 20.97494,-8.1487 42.26322,-15.432 63.32818,-23.3314 0.83301,-0.41652 2.08311,-0.41652 2.9163,-0.41652 4.5831,0 8.33278,3.7497 8.33278,8.33261 l 0,24.99799 c 0,3.333 -2.08329,6.66619 -5.41629,7.91591 -32.86403,11.17176 -65.08482,24.13025 -97.90849,35.4137 z"
       id="path8811" />
    <text
       xml:space="preserve"
       style="font-style:normal;font-variant:normal;font-weight:normal;font-stretch:normal;font-size:21.76249695px;line-height:100%;font-family:Helvetica;-inkscape-font-specification:Helvetica;text-align:center;letter-spacing:0px;word-spacing:0px;writing-mode:lr-tb;text-anchor:middle;fill:#000000;fill-opacity:1;stroke:none;stroke-width:1px;stroke-linecap:butt;stroke-linejoin:miter;stroke-opacity:1"
       x="465.64032"
       y="693.75806"
       id="text8827"
       sodipodi:linespacing="100%"><tspan
         sodipodi:role="line"
         id="tspan8829"
         x="468.65817"
         y="693.75806">Emmentaler </tspan><tspan
         sodipodi:role="line"
         x="465.64032"
         y="715.52057"
         id="tspan9042">(Lilypond)</tspan></text>
    <path
       id="path8831"
       d="m 991.31775,989.69152 c -0.83305,0.41648 -2.08311,0.41648 -2.91649,0.41648 -4.58291,0 -8.33261,-3.74963 -8.33261,-8.33254 l 0,-24.998 c 0,-3.33302 2.08311,-6.66619 5.41629,-7.91592 32.86406,-11.17177 65.08486,-24.13025 97.90856,-35.41371 0.833,-0.41652 2.0831,-0.41652 2.9163,-0.41652 4.5831,0 8.3327,3.74971 8.3327,8.33261 l 0,24.99799 c 0,3.33301 -2.0833,6.24933 -5.4163,7.49923 -33.2606,12.38528 -68.9971,25.0069 -97.90845,35.83038 z"
       inkscape:connector-curvature="0"
       style="fill:#000000"
       sodipodi:nodetypes="csssccssscc" />
    <path
       sodipodi:nodetypes="csssccccssscc"
       style="fill:#cccccc;fill-opacity:1"
       inkscape:connector-curvature="0"
       d="m 944.88918,1060.5458 -2.91649,0.4166 c -4.53687,0.6479 -8.33261,-3.7497 -8.33261,-8.3326 l 0,-24.998 c 0,-3.333 2.08311,-6.2494 5.41629,-7.4993 l 19.16501,-7.0828 15.41532,-5.4162 c 20.97494,-8.14868 42.2632,-15.43198 63.3282,-23.33138 0.833,-0.41652 2.0831,-0.41652 2.9163,-0.41652 4.5831,0 8.3328,3.7497 8.3328,8.33261 l 0,24.99799 c 0,3.333 -2.0833,6.6662 -5.4163,7.9159 -32.8641,11.1718 -65.08485,24.1303 -97.90852,35.4137 z"
       id="path8833" />
    <path
       id="path8835"
       d="m 976.74633,832.26009 -2.91649,0.41653 c -4.53687,0.64795 -8.33261,-3.7497 -8.33261,-8.33261 l 0,-24.99798 c 0,-3.33302 2.08311,-6.24933 5.41629,-7.49923 l 19.16501,-7.08288 15.41527,-5.41612 c 20.975,-8.1487 42.2633,-15.432 63.3282,-23.3314 0.833,-0.41652 2.0831,-0.41652 2.9163,-0.41652 4.5831,0 8.3328,3.7497 8.3328,8.33261 l 0,24.99799 c 0,3.333 -2.0833,6.66619 -5.4163,7.91591 -32.864,11.17176 -65.0848,24.13025 -97.90847,35.4137 z"
       inkscape:connector-curvature="0"
       style="fill:#cccccc;fill-opacity:1"
       sodipodi:nodetypes="csssccccssscc" />
    <path
       id="path8837"
       d="m 1020.0653,1045.1036 c 0,4.1664 -3.7497,7.9161 -7.9159,7.9161 -4.1664,0 -7.4995,-3.7497 -7.4995,-7.9161 l 0,-278.31033 c 0,-4.16639 3.3331,-7.91592 7.4995,-7.91592 4.1662,0 7.9159,3.74953 7.9159,7.91592 0,92.77011 0,185.54022 0,278.31033 z"
       inkscape:connector-curvature="0"
       style="fill:#000000"
       sodipodi:nodetypes="csccscc" />
    <path
       sodipodi:nodetypes="csssccccssscc"
       style="fill:#cccccc;fill-opacity:1"
       inkscape:connector-curvature="0"
       d="m 1041.032,917.10708 -2.9164,0.41653 c -4.5369,0.64795 -8.3327,-3.7497 -8.3327,-8.33261 l 0,-24.99798 c 0,-3.33302 2.0832,-6.24933 5.4163,-7.49923 l 19.165,-7.08288 15.4154,-5.41612 c 20.9749,-8.1487 42.2632,-15.432 63.3281,-23.3314 0.833,-0.41652 2.0831,-0.41652 2.9163,-0.41652 4.5831,0 8.3328,3.7497 8.3328,8.33261 l 0,24.99799 c 0,3.333 -2.0833,6.66619 -5.4163,7.91591 -32.864,11.17176 -65.0848,24.13025 -97.9085,35.4137 z"
       id="path8839" />
    <path
       id="path8841"
       d="m 1070.0612,1026.7718 c 0,4.1664 -3.3331,7.9159 -7.4994,7.9159 -4.1664,0 -7.916,-3.7495 -7.916,-7.9159 l 0,-278.31033 c 0,-4.1664 3.7496,-7.91609 7.916,-7.91609 4.1663,0 7.4994,3.74969 7.4994,7.91609 0,92.77011 0,185.54022 0,278.31033 z"
       inkscape:connector-curvature="0"
       style="fill:#000000"
       sodipodi:nodetypes="csccscc" />
    <path
       id="path8843"
       d="m 991.31775,880.11724 -2.91649,0.41653 c -4.53687,0.64795 -8.33261,-3.7497 -8.33261,-8.33261 l 0,-24.99798 c 0,-3.33302 2.08311,-6.24933 5.41629,-7.49923 l 19.16506,-7.08288 15.4153,-5.41612 c 20.9749,-8.1487 42.2632,-15.432 63.3282,-23.3314 0.833,-0.41652 2.0831,-0.41652 2.9163,-0.41652 4.5831,0 8.3327,3.7497 8.3327,8.33261 l 0,24.99799 c 0,3.333 -2.0833,6.66619 -5.4163,7.91591 -32.864,11.17176 -65.0848,24.13025 -97.90845,35.4137 z"
       inkscape:connector-curvature="0"
       style="fill:#000000"
       sodipodi:nodetypes="csssccccssscc" />
    <g
       id="g8873"
       transform="translate(-300,100)">
      <path
         id="path8851"
         d="m 461.22068,1372.244 c 0,4.1664 -3.33316,7.9159 -7.49941,7.9159 -4.16639,0 -7.91607,-3.7495 -7.91607,-7.9159 l 0,-278.3104 c 0,-4.1664 3.74968,-7.916 7.91607,-7.916 4.16625,0 7.49941,3.7496 7.49941,7.916 0,92.7702 0,185.5403 0,278.3104 z"
         inkscape:connector-curvature="0"
         style="fill:#000000"
         sodipodi:nodetypes="csccscc" />
      <path
         id="path8847"
         d="m 382.4772,1335.1637 c -0.83305,0.4165 -2.08311,0.4165 -2.91649,0.4165 -4.58291,0 -8.33261,-3.7497 -8.33261,-8.3326 l 0,-24.998 c 0,-3.333 2.08311,-6.6662 5.41629,-7.9159 32.86404,-11.1718 65.08484,-24.1302 97.90851,-35.4137 0.83301,-0.4165 2.08311,-0.4165 2.9163,-0.4165 4.5831,0 8.33278,3.7497 8.33278,8.3326 l 0,24.998 c 0,3.333 -2.08329,6.2493 -5.41629,7.4992 -33.2606,12.3853 -68.9971,25.0069 -97.90849,35.8304 z"
         inkscape:connector-curvature="0"
         style="fill:#80ff80;fill-opacity:1"
         sodipodi:nodetypes="csssccssscc" />
      <path
         id="path8849"
         d="m 411.22472,1390.5758 c 0,4.1664 -3.74971,7.9161 -7.91592,7.9161 -4.16639,0 -7.4994,-3.7497 -7.4994,-7.9161 l 0,-278.3104 c 0,-4.1664 3.33301,-7.9159 7.4994,-7.9159 4.16621,0 7.91592,3.7495 7.91592,7.9159 0,92.7702 0,185.5403 0,278.3104 z"
         inkscape:connector-curvature="0"
         style="fill:#000000"
         sodipodi:nodetypes="csccscc" />
      <path
         id="path8853"
         d="m 382.4772,1225.5894 -2.91649,0.4165 c -4.53687,0.648 -8.33261,-3.7497 -8.33261,-8.3326 l 0,-24.9979 c 0,-3.3331 2.08311,-6.2494 5.41629,-7.4993 l 19.16501,-7.0829 15.41532,-5.4161 c 20.97494,-8.1487 42.26322,-15.432 63.32818,-23.3314 0.83301,-0.4165 2.08311,-0.4165 2.9163,-0.4165 4.5831,0 8.33278,3.7497 8.33278,8.3326 l 0,24.998 c 0,3.333 -2.08329,6.6662 -5.41629,7.9159 -32.86403,11.1718 -65.08482,24.1303 -97.90849,35.4137 z"
         inkscape:connector-curvature="0"
         style="fill:#ff8080;fill-opacity:1"
         sodipodi:nodetypes="csssccccssscc" />
      <path
         sodipodi:nodetypes="csccscc"
         style="fill:#000000"
         inkscape:connector-curvature="0"
         d="m 461.22068,1232.244 c 0,4.1664 -3.33316,7.9159 -7.49941,7.9159 -4.16639,0 -7.91607,-3.7495 -7.91607,-7.9159 l 0,-138.3104 c 0,-4.1664 3.74968,-7.916 7.91607,-7.916 4.16625,0 7.49941,3.7496 7.49941,7.916 z"
         id="path8861" />
    </g>
    <g
       id="g8880"
       transform="translate(38.57143,100)">
      <path
         sodipodi:nodetypes="csccscc"
         style="fill:#000000"
         inkscape:connector-curvature="0"
         d="m 461.22068,1372.244 c 0,4.1664 -3.33316,7.9159 -7.49941,7.9159 -4.16639,0 -7.91607,-3.7495 -7.91607,-7.9159 l 0,-278.3104 c 0,-4.1664 3.74968,-7.916 7.91607,-7.916 4.16625,0 7.49941,3.7496 7.49941,7.916 0,92.7702 0,185.5403 0,278.3104 z"
         id="path8882" />
      <path
         sodipodi:nodetypes="csssccssscc"
         style="fill:#80ff80;fill-opacity:1"
         inkscape:connector-curvature="0"
         d="m 382.4772,1335.1637 c -0.83305,0.4165 -2.08311,0.4165 -2.91649,0.4165 -4.58291,0 -8.33261,-3.7497 -8.33261,-8.3326 l 0,-24.998 c 0,-3.333 2.08311,-6.6662 5.41629,-7.9159 32.86404,-11.1718 65.08484,-24.1302 97.90851,-35.4137 0.83301,-0.4165 2.08311,-0.4165 2.9163,-0.4165 4.5831,0 8.33278,3.7497 8.33278,8.3326 l 0,24.998 c 0,3.333 -2.08329,6.2493 -5.41629,7.4992 -33.2606,12.3853 -68.9971,25.0069 -97.90849,35.8304 z"
         id="path8884" />
      <path
         sodipodi:nodetypes="csccscc"
         style="fill:#000000"
         inkscape:connector-curvature="0"
         d="m 411.22472,1390.5758 c 0,4.1664 -3.74971,7.9161 -7.91592,7.9161 -4.16639,0 -7.4994,-3.7497 -7.4994,-7.9161 l 0,-278.3104 c 0,-4.1664 3.33301,-7.9159 7.4994,-7.9159 4.16621,0 7.91592,3.7495 7.91592,7.9159 0,92.7702 0,185.5403 0,278.3104 z"
         id="path8886" />
      <path
         sodipodi:nodetypes="csssccccssscc"
         style="fill:#ff8080;fill-opacity:1"
         inkscape:connector-curvature="0"
         d="m 382.4772,1225.5894 -2.91649,0.4165 c -4.53687,0.648 -8.33261,-3.7497 -8.33261,-8.3326 l 0,-24.9979 c 0,-3.3331 2.08311,-6.2494 5.41629,-7.4993 l 19.16501,-7.0829 15.41532,-5.4161 c 20.97494,-8.1487 42.26322,-15.432 63.32818,-23.3314 0.83301,-0.4165 2.08311,-0.4165 2.9163,-0.4165 4.5831,0 8.33278,3.7497 8.33278,8.3326 l 0,24.998 c 0,3.333 -2.08329,6.6662 -5.41629,7.9159 -32.86403,11.1718 -65.08482,24.1303 -97.90849,35.4137 z"
         id="path8888" />
      <path
         id="path8890"
         d="m 461.22068,1232.244 c 0,4.1664 -3.33316,7.9159 -7.49941,7.9159 -4.16639,0 -7.91607,-3.7495 -7.91607,-7.9159 l 0,-138.3104 c 0,-4.1664 3.74968,-7.916 7.91607,-7.916 4.16625,0 7.49941,3.7496 7.49941,7.916 z"
         inkscape:connector-curvature="0"
         style="fill:#000000"
         sodipodi:nodetypes="csccscc" />
    </g>
    <path
       sodipodi:nodetypes="csssccccssscc"
       style="fill:#5599ff;fill-opacity:1"
       inkscape:connector-curvature="0"
       d="m 465.59687,1362.8315 -2.91649,0.4166 c -4.53687,0.6479 -8.33261,-3.7497 -8.33261,-8.3326 l 0,-24.998 c 0,-3.333 2.08311,-6.2494 5.41629,-7.4993 l 19.16501,-7.0828 15.41532,-5.4162 c 20.97494,-8.1487 42.26322,-15.432 63.32818,-23.3314 0.83301,-0.4165 2.08311,-0.4165 2.9163,-0.4165 4.5831,0 8.33278,3.7497 8.33278,8.3326 l 0,24.998 c 0,3.333 -2.08329,6.6662 -5.41629,7.9159 -32.86403,11.1718 -65.08482,24.1303 -97.90849,35.4137 z"
       id="path8892" />
    <g
       id="g8913"
       transform="translate(60,100)">
      <path
         id="path8898"
         d="m 906.76292,1335.1637 c -0.83305,0.4165 -2.08311,0.4165 -2.91649,0.4165 -4.58291,0 -8.33261,-3.7497 -8.33261,-8.3326 l 0,-24.998 c 0,-3.333 2.08311,-6.6662 5.41629,-7.9159 32.86404,-11.1718 65.08484,-24.1302 97.90851,-35.4137 0.83301,-0.4165 2.08308,-0.4165 2.91628,-0.4165 4.5831,0 8.3328,3.7497 8.3328,8.3326 l 0,24.998 c 0,3.333 -2.0833,6.2493 -5.4163,7.4992 -33.26059,12.3853 -68.99709,25.0069 -97.90848,35.8304 z"
         inkscape:connector-curvature="0"
         style="fill:#80ff80;fill-opacity:1"
         sodipodi:nodetypes="csssccssscc" />
      <path
         id="path8902"
         d="m 906.76292,1225.5894 -2.91649,0.4165 c -4.53687,0.648 -8.33261,-3.7497 -8.33261,-8.3326 l 0,-24.9979 c 0,-3.3331 2.08311,-6.2494 5.41629,-7.4993 l 19.16501,-7.0829 15.41532,-5.4161 c 20.97494,-8.1487 42.26322,-15.432 63.32818,-23.3314 0.83301,-0.4165 2.08308,-0.4165 2.91628,-0.4165 4.5831,0 8.3328,3.7497 8.3328,8.3326 l 0,24.998 c 0,3.333 -2.0833,6.6662 -5.4163,7.9159 -32.86402,11.1718 -65.08481,24.1303 -97.90848,35.4137 z"
         inkscape:connector-curvature="0"
         style="fill:#ff8080;fill-opacity:1"
         sodipodi:nodetypes="csssccccssscc" />
      <path
         sodipodi:nodetypes="csssccccssscc"
         style="fill:#5599ff;fill-opacity:1"
         inkscape:connector-curvature="0"
         d="m 951.31116,1262.8315 -2.91649,0.4166 c -4.53687,0.6479 -8.33261,-3.7497 -8.33261,-8.3326 l 0,-24.998 c 0,-3.333 2.08311,-6.2494 5.41629,-7.4993 l 19.16501,-7.0828 15.41532,-5.4162 c 20.97492,-8.1487 42.26322,-15.432 63.32822,-23.3314 0.833,-0.4165 2.0831,-0.4165 2.9163,-0.4165 4.5831,0 8.3327,3.7497 8.3327,8.3326 l 0,24.998 c 0,3.333 -2.0833,6.6662 -5.4163,7.9159 -32.864,11.1718 -65.08477,24.1303 -97.90844,35.4137 z"
         id="path8906" />
    </g>
    <text
       sodipodi:linespacing="100%"
       id="text8918"
       y="721.84698"
       x="744.32324"
       style="font-style:normal;font-variant:normal;font-weight:normal;font-stretch:normal;font-size:33.67016602px;line-height:100%;font-family:Helvetica;-inkscape-font-specification:Helvetica;text-align:center;letter-spacing:0px;word-spacing:0px;writing-mode:lr-tb;text-anchor:middle;fill:#000000;fill-opacity:1;stroke:none;stroke-width:1px;stroke-linecap:butt;stroke-linejoin:miter;stroke-opacity:1"
       xml:space="preserve"><tspan
         y="721.84698"
         x="744.32324"
         id="tspan8920"
         sodipodi:role="line">1a</tspan></text>
    <text
       xml:space="preserve"
       style="font-style:normal;font-variant:normal;font-weight:normal;font-stretch:normal;font-size:33.67016602px;line-height:100%;font-family:Helvetica;-inkscape-font-specification:Helvetica;text-align:center;letter-spacing:0px;word-spacing:0px;writing-mode:lr-tb;text-anchor:middle;fill:#000000;fill-opacity:1;stroke:none;stroke-width:1px;stroke-linecap:butt;stroke-linejoin:miter;stroke-opacity:1"
       x="1034.3232"
       y="721.84698"
       id="text8922"
       sodipodi:linespacing="100%"><tspan
         sodipodi:role="line"
         id="tspan8924"
         x="1034.3232"
         y="721.84698">1n</tspan></text>
    <text
       xml:space="preserve"
       style="font-style:normal;font-variant:normal;font-weight:normal;font-stretch:normal;font-size:33.67016602px;line-height:100%;font-family:Helvetica;-inkscape-font-specification:Helvetica;text-align:center;letter-spacing:0px;word-spacing:0px;writing-mode:lr-tb;text-anchor:middle;fill:#000000;fill-opacity:1;stroke:none;stroke-width:1px;stroke-linecap:butt;stroke-linejoin:miter;stroke-opacity:1"
       x="124.32324"
       y="1538.9899"
       id="text8926"
       sodipodi:linespacing="100%"><tspan
         sodipodi:role="line"
         id="tspan8928"
         x="124.32324"
         y="1538.9899">2a</tspan></text>
    <g
       transform="translate(311.42857,100)"
       id="g8930">
      <path
         id="path8932"
         d="m 461.22068,1372.244 c 0,4.1664 -3.33316,7.9159 -7.49941,7.9159 -4.16639,0 -7.91607,-3.7495 -7.91607,-7.9159 l 0,-278.3104 c 0,-4.1664 3.74968,-7.916 7.91607,-7.916 4.16625,0 7.49941,3.7496 7.49941,7.916 0,92.7702 0,185.5403 0,278.3104 z"
         inkscape:connector-curvature="0"
         style="fill:#000000"
         sodipodi:nodetypes="csccscc" />
      <path
         id="path8934"
         d="m 382.4772,1335.1637 c -0.83305,0.4165 -2.08311,0.4165 -2.91649,0.4165 -4.58291,0 -8.33261,-3.7497 -8.33261,-8.3326 l 0,-24.998 c 0,-3.333 2.08311,-6.6662 5.41629,-7.9159 32.86404,-11.1718 65.08484,-24.1302 97.90851,-35.4137 0.83301,-0.4165 2.08311,-0.4165 2.9163,-0.4165 4.5831,0 8.33278,3.7497 8.33278,8.3326 l 0,24.998 c 0,3.333 -2.08329,6.2493 -5.41629,7.4992 -33.2606,12.3853 -68.9971,25.0069 -97.90849,35.8304 z"
         inkscape:connector-curvature="0"
         style="fill:#cccccc;fill-opacity:1"
         sodipodi:nodetypes="csssccssscc" />
      <path
         id="path8936"
         d="m 411.22472,1390.5758 c 0,4.1664 -3.74971,7.9161 -7.91592,7.9161 -4.16639,0 -7.4994,-3.7497 -7.4994,-7.9161 l 0,-278.3104 c 0,-4.1664 3.33301,-7.9159 7.4994,-7.9159 4.16621,0 7.91592,3.7495 7.91592,7.9159 0,92.7702 0,185.5403 0,278.3104 z"
         inkscape:connector-curvature="0"
         style="fill:#000000"
         sodipodi:nodetypes="csccscc" />
      <path
         id="path8938"
         d="m 382.4772,1225.5894 -2.91649,0.4165 c -4.53687,0.648 -8.33261,-3.7497 -8.33261,-8.3326 l 0,-24.9979 c 0,-3.3331 2.08311,-6.2494 5.41629,-7.4993 l 19.16501,-7.0829 15.41532,-5.4161 c 20.97494,-8.1487 42.26322,-15.432 63.32818,-23.3314 0.83301,-0.4165 2.08311,-0.4165 2.9163,-0.4165 4.5831,0 8.33278,3.7497 8.33278,8.3326 l 0,24.998 c 0,3.333 -2.08329,6.6662 -5.41629,7.9159 -32.86403,11.1718 -65.08482,24.1303 -97.90849,35.4137 z"
         inkscape:connector-curvature="0"
         style="fill:#cccccc;fill-opacity:1"
         sodipodi:nodetypes="csssccccssscc" />
      <path
         sodipodi:nodetypes="csccscc"
         style="fill:#000000"
         inkscape:connector-curvature="0"
         d="m 461.22068,1232.244 c 0,4.1664 -3.33316,7.9159 -7.49941,7.9159 -4.16639,0 -7.91607,-3.7495 -7.91607,-7.9159 l 0,-138.3104 c 0,-4.1664 3.74968,-7.916 7.91607,-7.916 4.16625,0 7.49941,3.7496 7.49941,7.916 z"
         id="path8940" />
    </g>
    <path
       id="path8942"
       d="m 738.454,1362.8315 -2.9165,0.4166 c -4.5368,0.6479 -8.3326,-3.7497 -8.3326,-8.3326 l 0,-24.998 c 0,-3.333 2.0831,-6.2494 5.4163,-7.4993 l 19.165,-7.0828 15.4153,-5.4162 c 20.975,-8.1487 42.2633,-15.432 63.3282,-23.3314 0.833,-0.4165 2.0831,-0.4165 2.9163,-0.4165 4.5831,0 8.3328,3.7497 8.3328,8.3326 l 0,24.998 c 0,3.333 -2.0833,6.6662 -5.4163,7.9159 -32.864,11.1718 -65.0848,24.1303 -97.9085,35.4137 z"
       inkscape:connector-curvature="0"
       style="fill:#cccccc;fill-opacity:1"
       sodipodi:nodetypes="csssccccssscc" />
    <text
       sodipodi:linespacing="100%"
       id="text8944"
       y="1538.9899"
       x="470.03754"
       style="font-style:normal;font-variant:normal;font-weight:normal;font-stretch:normal;font-size:33.67016602px;line-height:100%;font-family:Helvetica;-inkscape-font-specification:Helvetica;text-align:center;letter-spacing:0px;word-spacing:0px;writing-mode:lr-tb;text-anchor:middle;fill:#000000;fill-opacity:1;stroke:none;stroke-width:1px;stroke-linecap:butt;stroke-linejoin:miter;stroke-opacity:1"
       xml:space="preserve"><tspan
         y="1538.9899"
         x="470.03754"
         id="tspan8946"
         sodipodi:role="line">2b</tspan></text>
    <text
       xml:space="preserve"
       style="font-style:normal;font-variant:normal;font-weight:normal;font-stretch:normal;font-size:33.67016602px;line-height:100%;font-family:Helvetica;-inkscape-font-specification:Helvetica;text-align:center;letter-spacing:0px;word-spacing:0px;writing-mode:lr-tb;text-anchor:middle;fill:#000000;fill-opacity:1;stroke:none;stroke-width:1px;stroke-linecap:butt;stroke-linejoin:miter;stroke-opacity:1"
       x="751.46613"
       y="1538.9899"
       id="text8948"
       sodipodi:linespacing="100%"><tspan
         sodipodi:role="line"
         id="tspan8950"
         x="751.46613"
         y="1538.9899">2n</tspan></text>
    <path
       sodipodi:nodetypes="csssccssscc"
       style="fill:#000000"
       inkscape:connector-curvature="0"
       d="m 56.762913,539.90901 c -0.83305,0.4165 -2.08311,0.4165 -2.91649,0.4165 -4.58291,0 -8.33261,-3.7497 -8.33261,-8.3326 l 0,-24.998 c 0,-3.333 2.08311,-6.6662 5.41629,-7.9159 32.86404,-11.1718 65.084837,-24.1302 97.908507,-35.4137 0.83301,-0.4165 2.08311,-0.4165 2.9163,-0.4165 4.5831,0 8.33278,3.7497 8.33278,8.3326 l 0,24.998 c 0,3.333 -2.08329,6.2493 -5.41629,7.4992 -33.2606,12.3853 -68.997097,25.0069 -97.908487,35.8304 z"
       id="path8954" />
    <path
       id="path8968"
       d="m 44.168283,600.19191 -2.91649,0.4166 c -4.53687,0.6479 -8.33261,-3.7497 -8.33261,-8.3326 l 0,-24.998 c 0,-3.333 2.08311,-6.2494 5.41629,-7.4993 l 19.16501,-7.0828 15.41532,-5.4162 c 20.97497,-8.1487 42.263267,-15.432 63.328167,-23.3314 0.833,-0.4165 2.0831,-0.4165 2.9163,-0.4165 4.5831,0 8.3328,3.7497 8.3328,8.3326 l 0,24.998 c 0,3.333 -2.0833,6.6662 -5.4163,7.9159 -32.864,11.1718 -65.084817,24.1303 -97.908487,35.4137 z"
       inkscape:connector-curvature="0"
       style="fill:#80ff80;fill-opacity:1"
       sodipodi:nodetypes="csssccccssscc" />
    <path
       sodipodi:nodetypes="csccscc"
       style="fill:#000000"
       inkscape:connector-curvature="0"
       d="m 135.50639,576.98931 c 0,4.1664 -3.33316,7.9159 -7.49941,7.9159 -4.16639,0 -7.91607,-3.7495 -7.91607,-7.9159 l 0,-278.3104 c 0,-4.1664 3.74968,-7.916 7.91607,-7.916 4.16625,0 7.49941,3.7496 7.49941,7.916 0,92.7702 0,185.5403 0,278.3104 z"
       id="path8958" />
    <path
       sodipodi:nodetypes="csssccccssscc"
       style="fill:#000000"
       inkscape:connector-curvature="0"
       d="m 56.762913,430.33471 -2.91649,0.4165 c -4.53687,0.648 -8.33261,-3.7497 -8.33261,-8.3326 l 0,-24.9979 c 0,-3.3331 2.08311,-6.2494 5.41629,-7.4993 l 19.16501,-7.0829 15.41532,-5.4161 c 20.974937,-8.1487 42.263217,-15.432 63.328177,-23.3314 0.83301,-0.4165 2.08311,-0.4165 2.9163,-0.4165 4.5831,0 8.33278,3.7497 8.33278,8.3326 l 0,24.998 c 0,3.333 -2.08329,6.6662 -5.41629,7.9159 -32.86403,11.1718 -65.084817,24.1303 -97.908487,35.4137 z"
       id="path8960" />
    <path
       sodipodi:nodetypes="csssccccssscc"
       style="fill:#ff8080;fill-opacity:1"
       inkscape:connector-curvature="0"
       d="m 72.739713,373.04901 -2.91649,0.4166 c -4.53687,0.6479 -8.33261,-3.7497 -8.33261,-8.3326 l 0,-24.998 c 0,-3.333 2.08311,-6.2494 5.41629,-7.4993 l 19.16501,-7.0828 15.415317,-5.4162 c 20.97497,-8.1487 42.26327,-15.432 63.32817,-23.3314 0.833,-0.4165 2.0831,-0.4165 2.9163,-0.4165 4.5831,0 8.3328,3.7497 8.3328,8.3326 l 0,24.998 c 0,3.333 -2.0833,6.6662 -5.4163,7.9159 -32.864,11.1718 -65.08482,24.1303 -97.908487,35.4137 z"
       id="path8962" />
    <path
       id="path8972"
       d="m 85.510433,491.06171 c 0,2.6488 -3.74971,5.0326 -7.91592,5.0326 -4.16639,0 -7.4994,-2.3838 -7.4994,-5.0326 l 0,-176.9344 c 0,-2.6488 3.33301,-5.0325 7.4994,-5.0325 4.16621,0 7.91592,2.3837 7.91592,5.0325 0,58.9782 0,117.9563 0,176.9344 z"
       inkscape:connector-curvature="0"
       style="fill:#000000"
       sodipodi:nodetypes="csccscc" />
    <path
       sodipodi:nodetypes="csssccssscc"
       style="fill:#000000"
       inkscape:connector-curvature="0"
       d="m 700.59687,563.44796 c -0.83305,0.41648 -2.08311,0.41648 -2.91649,0.41648 -4.58291,0 -8.33261,-3.74963 -8.33261,-8.33254 l 0,-24.998 c 0,-3.33302 2.08311,-6.66619 5.41629,-7.91592 32.86404,-11.17177 65.08484,-24.13025 97.90851,-35.41371 0.83301,-0.41652 2.08311,-0.41652 2.9163,-0.41652 4.5831,0 8.33278,3.74971 8.33278,8.33261 l 0,24.99799 c 0,3.33301 -2.08329,6.24933 -5.41629,7.49923 -33.2606,12.38528 -68.9971,25.0069 -97.90849,35.83038 z"
       id="path9010" />
    <path
       id="path9012"
       d="m 750.31116,490.86352 -2.91649,0.41653 c -4.53687,0.64795 -8.33261,-3.7497 -8.33261,-8.33261 l 0,-24.99798 c 0,-3.33302 2.08311,-6.24933 5.41629,-7.49923 l 19.16501,-7.08288 15.41532,-5.41612 c 20.97494,-8.1487 42.26322,-15.432 63.32818,-23.3314 0.83301,-0.41652 2.08311,-0.41652 2.9163,-0.41652 4.5831,0 8.33278,3.7497 8.33278,8.33261 l 0,24.99799 c 0,3.333 -2.08329,6.66619 -5.41629,7.91591 -32.86403,11.17176 -65.08482,24.13025 -97.90849,35.4137 z"
       inkscape:connector-curvature="0"
       style="fill:#80ff80;fill-opacity:1"
       sodipodi:nodetypes="csssccccssscc" />
    <path
       sodipodi:nodetypes="csccscc"
       style="fill:#000000"
       inkscape:connector-curvature="0"
       d="m 779.34035,600.52824 c 0,4.1664 -3.33316,7.9159 -7.49941,7.9159 -4.16639,0 -7.91607,-3.7495 -7.91607,-7.9159 l 0,-278.31033 c 0,-4.1664 3.74968,-7.91609 7.91607,-7.91609 4.16625,0 7.49941,3.74969 7.49941,7.91609 0,92.77011 0,185.54022 0,278.31033 z"
       id="path9016" />
    <path
       sodipodi:nodetypes="csssccccssscc"
       style="fill:#ff8080;fill-opacity:1"
       inkscape:connector-curvature="0"
       d="m 686.02545,406.01653 -2.91649,0.41653 c -4.53687,0.64795 -8.33261,-3.7497 -8.33261,-8.33261 l 0,-24.99798 c 0,-3.33302 2.08311,-6.24933 5.41629,-7.49923 l 19.16501,-7.08288 15.41532,-5.41612 c 20.97494,-8.1487 42.26322,-15.432 63.32818,-23.3314 0.83301,-0.41652 2.08311,-0.41652 2.9163,-0.41652 4.5831,0 8.33278,3.7497 8.33278,8.33261 l 0,24.99799 c 0,3.333 -2.08329,6.66619 -5.41629,7.91591 -32.86403,11.17176 -65.08482,24.13025 -97.90849,35.4137 z"
       id="path9014" />
    <path
       sodipodi:nodetypes="csccscc"
       style="fill:#000000"
       inkscape:connector-curvature="0"
       d="m 729.34439,618.86004 c 0,4.1664 -3.74971,7.9161 -7.91592,7.9161 -4.16639,0 -7.4994,-3.7497 -7.4994,-7.9161 l 0,-278.31033 c 0,-4.16639 3.33301,-7.91592 7.4994,-7.91592 4.16621,0 7.91592,3.74953 7.91592,7.91592 0,92.77011 0,185.54022 0,278.31033 z"
       id="path9018" />
    <path
       sodipodi:nodetypes="csssccccssscc"
       style="fill:#000000"
       inkscape:connector-curvature="0"
       d="m 700.59687,453.87368 -2.91649,0.41653 c -4.53687,0.64795 -8.33261,-3.7497 -8.33261,-8.33261 l 0,-24.99798 c 0,-3.33302 2.08311,-6.24933 5.41629,-7.49923 l 19.16501,-7.08288 15.41532,-5.41612 c 20.97494,-8.1487 42.26322,-15.432 63.32818,-23.3314 0.83301,-0.41652 2.08311,-0.41652 2.9163,-0.41652 4.5831,0 8.33278,3.7497 8.33278,8.33261 l 0,24.99799 c 0,3.333 -2.08329,6.66619 -5.41629,7.91591 -32.86403,11.17176 -65.08482,24.13025 -97.90849,35.4137 z"
       id="path9020" />
    <path
       id="path9022"
       d="m 991.31775,563.44796 c -0.83305,0.41648 -2.08311,0.41648 -2.91649,0.41648 -4.58291,0 -8.33261,-3.74963 -8.33261,-8.33254 l 0,-24.998 c 0,-3.33302 2.08311,-6.66619 5.41629,-7.91592 32.86406,-11.17177 65.08486,-24.13025 97.90856,-35.41371 0.833,-0.41652 2.0831,-0.41652 2.9163,-0.41652 4.5831,0 8.3327,3.74971 8.3327,8.33261 l 0,24.99799 c 0,3.33301 -2.0833,6.24933 -5.4163,7.49923 -33.2606,12.38528 -68.9971,25.0069 -97.90845,35.83038 z"
       inkscape:connector-curvature="0"
       style="fill:#000000"
       sodipodi:nodetypes="csssccssscc" />
    <path
       sodipodi:nodetypes="csssccccssscc"
       style="fill:#cccccc;fill-opacity:1"
       inkscape:connector-curvature="0"
       d="m 1041.032,490.86352 -2.9164,0.41653 c -4.5369,0.64795 -8.3327,-3.7497 -8.3327,-8.33261 l 0,-24.99798 c 0,-3.33302 2.0832,-6.24933 5.4163,-7.49923 l 19.165,-7.08288 15.4154,-5.41612 c 20.9749,-8.1487 42.2632,-15.432 63.3281,-23.3314 0.833,-0.41652 2.0831,-0.41652 2.9163,-0.41652 4.5831,0 8.3328,3.7497 8.3328,8.33261 l 0,24.99799 c 0,3.333 -2.0833,6.66619 -5.4163,7.91591 -32.864,11.17176 -65.0848,24.13025 -97.9085,35.4137 z"
       id="path9028" />
    <path
       id="path9030"
       d="m 1070.0612,600.52824 c 0,4.1664 -3.3331,7.9159 -7.4994,7.9159 -4.1664,0 -7.916,-3.7495 -7.916,-7.9159 l 0,-278.31033 c 0,-4.1664 3.7496,-7.91609 7.916,-7.91609 4.1663,0 7.4994,3.74969 7.4994,7.91609 0,92.77011 0,185.54022 0,278.31033 z"
       inkscape:connector-curvature="0"
       style="fill:#000000"
       sodipodi:nodetypes="csccscc" />
    <path
       id="path9024"
       d="m 976.74633,406.01653 -2.91649,0.41653 c -4.53687,0.64795 -8.33261,-3.7497 -8.33261,-8.33261 l 0,-24.99798 c 0,-3.33302 2.08311,-6.24933 5.41629,-7.49923 l 19.16501,-7.08288 15.41527,-5.41612 c 20.975,-8.1487 42.2633,-15.432 63.3282,-23.3314 0.833,-0.41652 2.0831,-0.41652 2.9163,-0.41652 4.5831,0 8.3328,3.7497 8.3328,8.33261 l 0,24.99799 c 0,3.333 -2.0833,6.66619 -5.4163,7.91591 -32.864,11.17176 -65.0848,24.13025 -97.90847,35.4137 z"
       inkscape:connector-curvature="0"
       style="fill:#cccccc;fill-opacity:1"
       sodipodi:nodetypes="csssccccssscc" />
    <path
       id="path9032"
       d="m 991.31775,453.87368 -2.91649,0.41653 c -4.53687,0.64795 -8.33261,-3.7497 -8.33261,-8.33261 l 0,-24.99798 c 0,-3.33302 2.08311,-6.24933 5.41629,-7.49923 l 19.16506,-7.08288 15.4153,-5.41612 c 20.9749,-8.1487 42.2632,-15.432 63.3282,-23.3314 0.833,-0.41652 2.0831,-0.41652 2.9163,-0.41652 4.5831,0 8.3327,3.7497 8.3327,8.33261 l 0,24.99799 c 0,3.333 -2.0833,6.66619 -5.4163,7.91591 -32.864,11.17176 -65.0848,24.13025 -97.90845,35.4137 z"
       inkscape:connector-curvature="0"
       style="fill:#000000"
       sodipodi:nodetypes="csssccccssscc" />
    <text
       sodipodi:linespacing="100%"
       id="text9034"
       y="295.60342"
       x="744.32324"
       style="font-style:normal;font-variant:normal;font-weight:normal;font-stretch:normal;font-size:33.67016602px;line-height:100%;font-family:Helvetica;-inkscape-font-specification:Helvetica;text-align:center;letter-spacing:0px;word-spacing:0px;writing-mode:lr-tb;text-anchor:middle;fill:#000000;fill-opacity:1;stroke:none;stroke-width:1px;stroke-linecap:butt;stroke-linejoin:miter;stroke-opacity:1"
       xml:space="preserve"><tspan
         y="295.60342"
         x="744.32324"
         id="tspan9036"
         sodipodi:role="line">0a</tspan></text>
    <text
       xml:space="preserve"
       style="font-style:normal;font-variant:normal;font-weight:normal;font-stretch:normal;font-size:33.67016602px;line-height:100%;font-family:Helvetica;-inkscape-font-specification:Helvetica;text-align:center;letter-spacing:0px;word-spacing:0px;writing-mode:lr-tb;text-anchor:middle;fill:#000000;fill-opacity:1;stroke:none;stroke-width:1px;stroke-linecap:butt;stroke-linejoin:miter;stroke-opacity:1"
       x="1034.3232"
       y="295.60342"
       id="text9038"
       sodipodi:linespacing="100%"><tspan
         sodipodi:role="line"
         id="tspan9040"
         x="1034.3232"
         y="295.60342">0n</tspan></text>
    <path
       id="path9026"
       d="m 1020.0653,618.86004 c 0,4.1664 -3.7497,7.9161 -7.9159,7.9161 -4.1664,0 -7.4995,-3.7497 -7.4995,-7.9161 l 0,-278.31033 c 0,-4.16639 3.3331,-7.91592 7.4995,-7.91592 4.1662,0 7.9159,3.74953 7.9159,7.91592 0,92.77011 0,185.54022 0,278.31033 z"
       inkscape:connector-curvature="0"
       style="fill:#000000"
       sodipodi:nodetypes="csccscc" />
    <path
       sodipodi:nodetypes="csssccccssscc"
       style="fill:#ff8080;fill-opacity:1"
       inkscape:connector-curvature="0"
       d="m 326.39663,1855.571 -5.64758,0.8066 c -8.78531,1.2548 -16.13548,-7.2611 -16.13548,-16.1355 l 0,-48.4067 c 0,-6.4541 4.03378,-12.1014 10.48824,-14.5217 l 37.11163,-13.7156 29.85063,-10.4878 c 40.61643,-15.7794 81.83975,-29.8829 122.63051,-45.1796 1.61294,-0.8064 4.03374,-0.8064 5.64718,-0.8064 8.87477,0 16.13574,7.2609 16.13574,16.1354 l 0,48.4068 c 0,6.454 -4.03408,12.9086 -10.48812,15.3285 -63.63891,21.6335 -126.03214,46.7267 -189.59275,68.576 z"
       id="path9070" />
    <path
       id="path9072"
       d="m 372.65762,1867.8093 c -0.72709,0.3636 -1.81816,0.3636 -2.54554,0.3636 -4.00001,0 -7.27278,-3.2728 -7.27278,-7.2728 l 0,-21.8185 c 0,-2.9091 1.81815,-5.8183 4.72739,-6.9091 28.68405,-9.7508 56.80668,-21.0611 85.45552,-30.9094 0.72705,-0.3635 1.81815,-0.3635 2.54538,-0.3635 4.00017,0 7.27286,3.2727 7.27286,7.2727 l 0,21.8185 c 0,2.9091 -1.81824,5.4545 -4.72731,6.5454 -29.03021,10.81 -60.22138,21.8263 -85.45552,31.2731 z"
       inkscape:connector-curvature="0"
       style="fill:#000000"
       sodipodi:nodetypes="csssccssscc" />
    <path
       id="path9074"
       d="m 397.74873,1916.1736 c 0,3.6364 -3.27278,6.9092 -6.90909,6.9092 -3.63646,0 -6.54555,-3.2728 -6.54555,-6.9092 l 0,-242.9121 c 0,-3.6364 2.90909,-6.909 6.54555,-6.909 3.63631,0 6.90909,3.2726 6.90909,6.909 0,80.9707 0,161.9414 0,242.9121 z"
       inkscape:connector-curvature="0"
       style="fill:#000000"
       sodipodi:nodetypes="csccscc" />
    <path
       id="path9076"
       d="m 441.38574,1900.1734 c 0,3.6365 -2.90926,6.9091 -6.5456,6.9091 -3.63647,0 -6.90923,-3.2726 -6.90923,-6.9091 l 0,-242.912 c 0,-3.6365 3.27276,-6.9093 6.90923,-6.9093 3.63634,0 6.5456,3.2728 6.5456,6.9093 0,80.9706 0,161.9413 0,242.912 z"
       inkscape:connector-curvature="0"
       style="fill:#000000"
       sodipodi:nodetypes="csccscc" />
    <path
       id="path9078"
       d="m 372.65762,1772.1718 -2.54554,0.3635 c -3.95983,0.5656 -7.27278,-3.2727 -7.27278,-7.2727 l 0,-21.8184 c 0,-2.9092 1.81815,-5.4546 4.72739,-6.5455 l 16.7274,-6.182 13.45464,-4.7273 c 18.30714,-7.1122 36.88775,-13.4692 55.27348,-20.3638 0.72705,-0.3636 1.81815,-0.3636 2.54538,-0.3636 4.00017,0 7.27286,3.2728 7.27286,7.2728 l 0,21.8185 c 0,2.9091 -1.81824,5.8183 -4.72731,6.9091 -28.68408,9.7509 -56.8067,21.0612 -85.45552,30.9094 z"
       inkscape:connector-curvature="0"
       style="fill:#000000"
       sodipodi:nodetypes="csssccccssscc" />
    <path
       id="path9080"
       d="m 633.12657,1855.571 -5.64757,0.8066 c -8.78531,1.2548 -16.13549,-7.2611 -16.13549,-16.1355 l 0,-48.4067 c 0,-6.4541 4.03379,-12.1014 10.48824,-14.5217 l 37.11164,-13.7156 29.85063,-10.4878 c 40.61643,-15.7794 81.83974,-29.8829 122.63051,-45.1796 1.61293,-0.8064 4.03374,-0.8064 5.64718,-0.8064 8.87476,0 16.13574,7.2609 16.13574,16.1354 l 0,48.4068 c 0,6.454 -4.03408,12.9086 -10.48812,15.3285 -63.63891,21.6335 -126.03214,46.7267 -189.59276,68.576 z"
       inkscape:connector-curvature="0"
       style="fill:#5599ff;fill-opacity:1"
       sodipodi:nodetypes="csssccccssscc" />
    <path
       sodipodi:nodetypes="csssccssscc"
       style="fill:#000000"
       inkscape:connector-curvature="0"
       d="m 679.38757,1867.8093 c -0.7271,0.3636 -1.81816,0.3636 -2.54555,0.3636 -4,0 -7.27278,-3.2728 -7.27278,-7.2728 l 0,-21.8185 c 0,-2.9091 1.81816,-5.8183 4.72739,-6.9091 28.68406,-9.7508 56.80668,-21.0611 85.45553,-30.9094 0.72705,-0.3635 1.81815,-0.3635 2.54537,-0.3635 4.00018,0 7.27286,3.2727 7.27286,7.2727 l 0,21.8185 c 0,2.9091 -1.81823,5.4545 -4.72731,6.5454 -29.03021,10.81 -60.22137,21.8263 -85.45551,31.2731 z"
       id="path9082" />
    <path
       sodipodi:nodetypes="csccscc"
       style="fill:#000000"
       inkscape:connector-curvature="0"
       d="m 704.47868,1916.1736 c 0,3.6364 -3.27278,6.9092 -6.90909,6.9092 -3.63647,0 -6.54555,-3.2728 -6.54555,-6.9092 l 0,-242.9121 c 0,-3.6364 2.90908,-6.909 6.54555,-6.909 3.63631,0 6.90909,3.2726 6.90909,6.909 0,80.9707 0,161.9414 0,242.9121 z"
       id="path9084" />
    <path
       sodipodi:nodetypes="csccscc"
       style="fill:#000000"
       inkscape:connector-curvature="0"
       d="m 748.11568,1900.1734 c 0,3.6365 -2.90925,6.9091 -6.5456,6.9091 -3.63646,0 -6.90922,-3.2726 -6.90922,-6.9091 l 0,-242.912 c 0,-3.6365 3.27276,-6.9093 6.90922,-6.9093 3.63635,0 6.5456,3.2728 6.5456,6.9093 0,80.9706 0,161.9413 0,242.912 z"
       id="path9086" />
    <path
       sodipodi:nodetypes="csssccccssscc"
       style="fill:#000000"
       inkscape:connector-curvature="0"
       d="m 679.38757,1772.1718 -2.54555,0.3635 c -3.95982,0.5656 -7.27278,-3.2727 -7.27278,-7.2727 l 0,-21.8184 c 0,-2.9092 1.81816,-5.4546 4.72739,-6.5455 l 16.72741,-6.182 13.45464,-4.7273 c 18.30713,-7.1122 36.88775,-13.4692 55.27348,-20.3638 0.72705,-0.3636 1.81815,-0.3636 2.54537,-0.3636 4.00018,0 7.27286,3.2728 7.27286,7.2728 l 0,21.8185 c 0,2.9091 -1.81823,5.8183 -4.72731,6.9091 -28.68408,9.7509 -56.8067,21.0612 -85.45551,30.9094 z"
       id="path9088" />
    <path
       sodipodi:nodetypes="csssccccssscc"
       style="fill:#cccccc;fill-opacity:1"
       inkscape:connector-curvature="0"
       d="m 934.55736,1855.571 -5.64758,0.8066 c -8.78531,1.2548 -16.13548,-7.2611 -16.13548,-16.1355 l 0,-48.4067 c 0,-6.4541 4.03378,-12.1014 10.48824,-14.5217 l 37.11163,-13.7156 29.85061,-10.4878 c 40.61652,-15.7794 81.83982,-29.8829 122.63052,-45.1796 1.613,-0.8064 4.0337,-0.8064 5.6472,-0.8064 8.8747,0 16.1357,7.2609 16.1357,16.1354 l 0,48.4068 c 0,6.454 -4.034,12.9086 -10.4881,15.3285 -63.6389,21.6335 -126.03212,46.7267 -189.59274,68.576 z"
       id="path9090" />
    <path
       id="path9092"
       d="m 980.81838,1867.8093 c -0.7271,0.3636 -1.8182,0.3636 -2.5456,0.3636 -3.99998,0 -7.27275,-3.2728 -7.27275,-7.2728 l 0,-21.8185 c 0,-2.9091 1.81816,-5.8183 4.72739,-6.9091 28.68408,-9.7508 56.80678,-21.0611 85.45558,-30.9094 0.7271,-0.3635 1.8182,-0.3635 2.5454,-0.3635 4.0002,0 7.2728,3.2727 7.2728,7.2727 l 0,21.8185 c 0,2.9091 -1.8182,5.4545 -4.7273,6.5454 -29.0302,10.81 -60.2214,21.8263 -85.45552,31.2731 z"
       inkscape:connector-curvature="0"
       style="fill:#000000"
       sodipodi:nodetypes="csssccssscc" />
    <path
       id="path9094"
       d="m 1005.9094,1916.1736 c 0,3.6364 -3.2727,6.9092 -6.90902,6.9092 -3.6365,0 -6.5456,-3.2728 -6.5456,-6.9092 l 0,-242.9121 c 0,-3.6364 2.9091,-6.909 6.5456,-6.909 3.63632,0 6.90902,3.2726 6.90902,6.909 0,80.9707 0,161.9414 0,242.9121 z"
       inkscape:connector-curvature="0"
       style="fill:#000000"
       sodipodi:nodetypes="csccscc" />
    <path
       id="path9096"
       d="m 1049.5465,1900.1734 c 0,3.6365 -2.9093,6.9091 -6.5456,6.9091 -3.6365,0 -6.9093,-3.2726 -6.9093,-6.9091 l 0,-242.912 c 0,-3.6365 3.2728,-6.9093 6.9093,-6.9093 3.6363,0 6.5456,3.2728 6.5456,6.9093 0,80.9706 0,161.9413 0,242.912 z"
       inkscape:connector-curvature="0"
       style="fill:#000000"
       sodipodi:nodetypes="csccscc" />
    <path
       id="path9098"
       d="m 980.81838,1772.1718 -2.5456,0.3635 c -3.95979,0.5656 -7.27275,-3.2727 -7.27275,-7.2727 l 0,-21.8184 c 0,-2.9092 1.81816,-5.4546 4.72739,-6.5455 l 16.72736,-6.182 13.45462,-4.7273 c 18.3072,-7.1122 36.8879,-13.4692 55.2736,-20.3638 0.7271,-0.3636 1.8182,-0.3636 2.5454,-0.3636 4.0002,0 7.2728,3.2728 7.2728,7.2728 l 0,21.8185 c 0,2.9091 -1.8182,5.8183 -4.7273,6.9091 -28.6841,9.7509 -56.8067,21.0612 -85.45552,30.9094 z"
       inkscape:connector-curvature="0"
       style="fill:#000000"
       sodipodi:nodetypes="csssccccssscc" />
    <path
       id="path9100"
       d="m 21.38091,1855.571 -5.647576,0.8066 c -8.7853096,1.2548 -16.1354846,-7.2611 -16.1354846,-16.1355 l 0,-48.4067 c 0,-6.4541 4.033786,-12.1014 10.4882396,-14.5217 l 37.111634,-13.7156 29.850633,-10.4878 c 40.616424,-15.7794 81.839744,-29.8829 122.630504,-45.1796 1.61294,-0.8064 4.03375,-0.8064 5.64719,-0.8064 8.87476,0 16.13574,7.2609 16.13574,16.1354 l 0,48.4068 c 0,6.454 -4.03409,12.9086 -10.48812,15.3285 -63.63892,21.6335 -126.032146,46.7267 -189.59276,68.576 z"
       inkscape:connector-curvature="0"
       style="fill:#80ff80;fill-opacity:1"
       sodipodi:nodetypes="csssccccssscc" />
    <path
       sodipodi:nodetypes="csssccssscc"
       style="fill:#000000"
       inkscape:connector-curvature="0"
       d="m 67.641903,1867.8093 c -0.727094,0.3636 -1.818159,0.3636 -2.545541,0.3636 -4.000008,0 -7.272783,-3.2728 -7.272783,-7.2728 l 0,-21.8185 c 0,-2.9091 1.818159,-5.8183 4.72739,-6.9091 28.684054,-9.7508 56.806681,-21.0611 85.455531,-30.9094 0.72705,-0.3635 1.81815,-0.3635 2.54537,-0.3635 4.00017,0 7.27286,3.2727 7.27286,7.2727 l 0,21.8185 c 0,2.9091 -1.81824,5.4545 -4.72731,6.5454 -29.03021,10.81 -60.221375,21.8263 -85.455517,31.2731 z"
       id="path9102" />
    <path
       sodipodi:nodetypes="csccscc"
       style="fill:#000000"
       inkscape:connector-curvature="0"
       d="m 92.733018,1916.1736 c 0,3.6364 -3.272784,6.9092 -6.909092,6.9092 -3.636466,0 -6.54555,-3.2728 -6.54555,-6.9092 l 0,-242.9121 c 0,-3.6364 2.909084,-6.909 6.54555,-6.909 3.636308,0 6.909092,3.2726 6.909092,6.909 0,80.9707 0,161.9414 0,242.9121 z"
       id="path9104" />
    <path
       sodipodi:nodetypes="csccscc"
       style="fill:#000000"
       inkscape:connector-curvature="0"
       d="m 136.37002,1900.1734 c 0,3.6365 -2.90926,6.9091 -6.5456,6.9091 -3.63647,0 -6.90923,-3.2726 -6.90923,-6.9091 l 0,-242.912 c 0,-3.6365 3.27276,-6.9093 6.90923,-6.9093 3.63634,0 6.5456,3.2728 6.5456,6.9093 0,80.9706 0,161.9413 0,242.912 z"
       id="path9106" />
    <path
       sodipodi:nodetypes="csssccccssscc"
       style="fill:#000000"
       inkscape:connector-curvature="0"
       d="m 67.641903,1772.1718 -2.545541,0.3635 c -3.959824,0.5656 -7.272783,-3.2727 -7.272783,-7.2727 l 0,-21.8184 c 0,-2.9092 1.818159,-5.4546 4.72739,-6.5455 l 16.727407,-6.182 13.454642,-4.7273 c 18.307132,-7.1122 36.887752,-13.4692 55.273482,-20.3638 0.72705,-0.3636 1.81815,-0.3636 2.54537,-0.3636 4.00017,0 7.27286,3.2728 7.27286,7.2728 l 0,21.8185 c 0,2.9091 -1.81824,5.8183 -4.72731,6.9091 -28.68408,9.7509 -56.806699,21.0612 -85.455517,30.9094 z"
       id="path9108" />
    <text
       sodipodi:linespacing="100%"
       id="text9110"
       y="272.91815"
       x="101.14843"
       style="font-style:normal;font-variant:normal;font-weight:normal;font-stretch:normal;font-size:33.67016602px;line-height:100%;font-family:Helvetica;-inkscape-font-specification:Helvetica;text-align:center;letter-spacing:0px;word-spacing:0px;writing-mode:lr-tb;text-anchor:middle;fill:#000000;fill-opacity:1;stroke:none;stroke-width:1px;stroke-linecap:butt;stroke-linejoin:miter;stroke-opacity:1"
       xml:space="preserve"><tspan
         y="272.91815"
         x="101.14843"
         id="tspan9112"
         sodipodi:role="line">4a</tspan></text>
    <text
       sodipodi:linespacing="100%"
       id="text9114"
       y="1538.9899"
       x="1025.7517"
       style="font-style:normal;font-variant:normal;font-weight:normal;font-stretch:normal;font-size:33.67016602px;line-height:100%;font-family:Helvetica;-inkscape-font-specification:Helvetica;text-align:center;letter-spacing:0px;word-spacing:0px;writing-mode:lr-tb;text-anchor:middle;fill:#000000;fill-opacity:1;stroke:none;stroke-width:1px;stroke-linecap:butt;stroke-linejoin:miter;stroke-opacity:1"
       xml:space="preserve"><tspan
         y="1538.9899"
         x="1025.7517"
         id="tspan9116"
         sodipodi:role="line">5</tspan></text>
    <text
       xml:space="preserve"
       style="font-style:normal;font-variant:normal;font-weight:normal;font-stretch:normal;font-size:33.67016602px;line-height:100%;font-family:Helvetica;-inkscape-font-specification:Helvetica;text-align:center;letter-spacing:0px;word-spacing:0px;writing-mode:lr-tb;text-anchor:middle;fill:#000000;fill-opacity:1;stroke:none;stroke-width:1px;stroke-linecap:butt;stroke-linejoin:miter;stroke-opacity:1"
       x="97.045914"
       y="2004.1194"
       id="text9126"
       sodipodi:linespacing="100%"><tspan
         sodipodi:role="line"
         id="tspan9128"
         x="97.045914"
         y="2004.1194">6a</tspan></text>
    <text
       sodipodi:linespacing="100%"
       id="text9130"
       y="2001.4698"
       x="414.99554"
       style="font-style:normal;font-variant:normal;font-weight:normal;font-stretch:normal;font-size:33.67016602px;line-height:100%;font-family:Helvetica;-inkscape-font-specification:Helvetica;text-align:center;letter-spacing:0px;word-spacing:0px;writing-mode:lr-tb;text-anchor:middle;fill:#000000;fill-opacity:1;stroke:none;stroke-width:1px;stroke-linecap:butt;stroke-linejoin:miter;stroke-opacity:1"
       xml:space="preserve"><tspan
         y="2001.4698"
         x="414.99554"
         id="tspan9132"
         sodipodi:role="line">6b</tspan></text>
    <text
       xml:space="preserve"
       style="font-style:normal;font-variant:normal;font-weight:normal;font-stretch:normal;font-size:33.67016602px;line-height:100%;font-family:Helvetica;-inkscape-font-specification:Helvetica;text-align:center;letter-spacing:0px;word-spacing:0px;writing-mode:lr-tb;text-anchor:middle;fill:#000000;fill-opacity:1;stroke:none;stroke-width:1px;stroke-linecap:butt;stroke-linejoin:miter;stroke-opacity:1"
       x="722.34692"
       y="2004.1194"
       id="text9134"
       sodipodi:linespacing="100%"><tspan
         sodipodi:role="line"
         id="tspan9136"
         x="722.34692"
         y="2004.1194">6c</tspan></text>
    <text
       sodipodi:linespacing="100%"
       id="text9138"
       y="2004.1194"
       x="1040.2965"
       style="font-style:normal;font-variant:normal;font-weight:normal;font-stretch:normal;font-size:33.67016602px;line-height:100%;font-family:Helvetica;-inkscape-font-specification:Helvetica;text-align:center;letter-spacing:0px;word-spacing:0px;writing-mode:lr-tb;text-anchor:middle;fill:#000000;fill-opacity:1;stroke:none;stroke-width:1px;stroke-linecap:butt;stroke-linejoin:miter;stroke-opacity:1"
       xml:space="preserve"><tspan
         y="2004.1194"
         x="1040.2965"
         id="tspan9140"
         sodipodi:role="line">6n</tspan></text>
    <text
       xml:space="preserve"
       style="font-style:normal;font-variant:normal;font-weight:normal;font-stretch:normal;font-size:33.67016602px;line-height:100%;font-family:Helvetica;-inkscape-font-specification:Helvetica;text-align:center;letter-spacing:0px;word-spacing:0px;writing-mode:lr-tb;text-anchor:middle;fill:#000000;fill-opacity:1;stroke:none;stroke-width:1px;stroke-linecap:butt;stroke-linejoin:miter;stroke-opacity:1"
       x="127.64423"
       y="728.90234"
       id="text9142"
       sodipodi:linespacing="100%"><tspan
         sodipodi:role="line"
         id="tspan9144"
         x="127.64423"
         y="728.90234">#a</tspan></text>
  </g>
</svg>
