{
    "composer": "J. Haydn",
    "id": "Haydn.17.1.i",
    "sources": {
        "audios": [],
        "images": [
            {
                "image": "Haydn.17.1.i.png",
                "positions": "positions.json",
                "type": "score"
            }
        ]
    },
    "time-signature": "4/4",
    "title": "String Quartet #1, Op 17, quartet 1, mvt. i",
    "title:fr": "Quatuor n\u00b01, Op 17, quatuor 1, mvt. i"
}