[
    455,
    1237,
    1932,
    2790,
    3658,
    4546,
    5425,
    6313,
    7329,
    8088,
    8936,
    9815,
    10653,
    11552,
    12439,
    13317,
    14284,
    15054,
    15845,
    16711,
    17500,
    18359,
    19109,
    19928,
    20854,
    21634,
    22463,
    23351,
    24229,
    25136,
    26034,
    26844,
    27811,
    28639,
    29438,
    30287,
    31096,
    31944,
    32714,
    33563,
    34402,
    35201,
    36039,
    36907,
    37756,
    38615,
    39523,
    40391,
    41251,
    42058,
    42868,
    43647,
    44505,
    45306,
    46094,
    46884,
    47703,
    48551,
    49372,
    50179,
    51058,
    51926,
    52834,
    53692,
    54541,
    55429,
    56278,
    57117,
    57916,
    58735,
    59534,
    60413,
    61241,
    62070,
    62919,
    63728,
    64528,
    65346,
    66195,
    67073,
    67912,
    68790,
    69658,
    70526,
    71375,
    72184,
    73032,
    73832,
    74662,
    75499,
    76319,
    77196,
    77995,
    78775,
    79564,
    80363,
    81232,
    82090,
    83019,
    83847,
    84636,
    85435,
    86223,
    87031,
    87899,
    88777,
    89625,
    90514,
    91402,
    92378,
    93515,
    94862,
    96607,
    97514,
    98352,
    99180,
    100028,
    100896,
    101804,
    102711,
    103589,
    104506,
    106031
]