{
    "bars": [
        280.0,
        295.4087214611872,
        444.6965042400525,
        607.9189249836918,
        785.0089815177215,
        942.1727552728852,
        1132.447717221134,
        1280.6689740160884,
        1440.3335158730138,
        1586.0044058490944,
        1762.8863188736682,
        1956.298438464886,
        2084.71620836051
    ],
    "onset-x": [
        {
            "onset": 0.0,
            "x": 271.17275494672754
        },
        {
            "onset": 1.0,
            "x": 308.74346771037216
        },
        {
            "onset": 1.5,
            "x": 327.8013976951514
        },
        {
            "onset": 2.0,
            "x": 346.85932767993074
        },
        {
            "onset": 3.0,
            "x": 375.04967775603427
        },
        {
            "onset": 4.0,
            "x": 405.72140530550155
        },
        {
            "onset": 4.5,
            "x": 429.87834594477096
        },
        {
            "onset": 5.0,
            "x": 458.46612763644293
        },
        {
            "onset": 5.5,
            "x": 477.5240576212222
        },
        {
            "onset": 6.0,
            "x": 496.5819876060015
        },
        {
            "onset": 7.0,
            "x": 524.2966908023486
        },
        {
            "onset": 7.5,
            "x": 544.3059145466409
        },
        {
            "onset": 8.0,
            "x": 564.315138290933
        },
        {
            "onset": 8.5,
            "x": 593.2985781691675
        },
        {
            "onset": 9.0,
            "x": 631.4228849025151
        },
        {
            "onset": 9.5,
            "x": 652.0488641008911
        },
        {
            "onset": 9.75,
            "x": 666.5405840400092
        },
        {
            "onset": 10.0,
            "x": 681.0323039791264
        },
        {
            "onset": 10.5,
            "x": 705.1892446183954
        },
        {
            "onset": 11.0,
            "x": 724.2471746031744
        },
        {
            "onset": 12.0,
            "x": 751.4862309197654
        },
        {
            "onset": 12.5,
            "x": 770.5441609045442
        },
        {
            "onset": 13.0,
            "x": 798.3437277669057
        },
        {
            "onset": 13.5,
            "x": 817.4016577516849
        },
        {
            "onset": 14.0,
            "x": 841.5585983909543
        },
        {
            "onset": 14.5,
            "x": 860.6165283757337
        },
        {
            "onset": 15.0,
            "x": 879.6744583605129
        },
        {
            "onset": 15.5,
            "x": 898.7323883452923
        },
        {
            "onset": 16.0,
            "x": 917.7903183300717
        },
        {
            "onset": 17.0,
            "x": 954.7078085453356
        },
        {
            "onset": 17.5,
            "x": 973.7657385301142
        },
        {
            "onset": 18.0,
            "x": 992.8236685148935
        },
        {
            "onset": 18.5,
            "x": 1016.980609154163
        },
        {
            "onset": 19.0,
            "x": 1036.0385391389423
        },
        {
            "onset": 19.5,
            "x": 1065.0219790171766
        },
        {
            "onset": 19.75,
            "x": 1074.154399108501
        },
        {
            "onset": 20.0,
            "x": 1088.646119047618
        },
        {
            "onset": 20.5,
            "x": 1117.6295589258525
        },
        {
            "onset": 21.0,
            "x": 1155.951677139957
        },
        {
            "onset": 22.0,
            "x": 1188.3736989562938
        },
        {
            "onset": 22.5,
            "x": 1207.431628941073
        },
        {
            "onset": 23.0,
            "x": 1226.4895589258526
        },
        {
            "onset": 24.0,
            "x": 1256.5824965209817
        },
        {
            "onset": 25.0,
            "x": 1294.003720265274
        },
        {
            "onset": 25.5,
            "x": 1322.9871601435084
        },
        {
            "onset": 26.0,
            "x": 1342.0450901282877
        },
        {
            "onset": 26.5,
            "x": 1361.103020113067
        },
        {
            "onset": 27.0,
            "x": 1386.6297476625343
        },
        {
            "onset": 28.0,
            "x": 1416.247038377907
        },
        {
            "onset": 29.0,
            "x": 1453.4508235485998
        },
        {
            "onset": 29.5,
            "x": 1472.5087535333791
        },
        {
            "onset": 30.0,
            "x": 1491.5666835181582
        },
        {
            "onset": 31.0,
            "x": 1519.2813867145055
        },
        {
            "onset": 32.0,
            "x": 1547.4717367906092
        },
        {
            "onset": 32.5,
            "x": 1571.6286774298783
        },
        {
            "onset": 33.0,
            "x": 1598.6868363774734
        },
        {
            "onset": 33.5,
            "x": 1615.8421788432267
        },
        {
            "onset": 34.0,
            "x": 1636.8026963470322
        },
        {
            "onset": 34.5,
            "x": 1655.8606263318113
        },
        {
            "onset": 35.0,
            "x": 1680.0175669710807
        },
        {
            "onset": 35.5,
            "x": 1699.0754969558602
        },
        {
            "onset": 36.0,
            "x": 1718.1334269406393
        },
        {
            "onset": 36.5,
            "x": 1738.1426506849316
        },
        {
            "onset": 36.75,
            "x": 1752.6343706240489
        },
        {
            "onset": 37.0,
            "x": 1776.6559422700611
        },
        {
            "onset": 37.5,
            "x": 1795.71387225484
        },
        {
            "onset": 37.75,
            "x": 1810.2055921939575
        },
        {
            "onset": 38.0,
            "x": 1824.6973121330745
        },
        {
            "onset": 38.5,
            "x": 1843.7552421178539
        },
        {
            "onset": 39.0,
            "x": 1867.9121827571234
        },
        {
            "onset": 39.5,
            "x": 1893.4389103065907
        },
        {
            "onset": 40.0,
            "x": 1912.4968402913698
        },
        {
            "onset": 40.5,
            "x": 1941.4802801696042
        },
        {
            "onset": 41.0,
            "x": 1979.8023983837088
        },
        {
            "onset": 42.0,
            "x": 2012.2244202000456
        },
        {
            "onset": 42.5,
            "x": 2031.282350184825
        },
        {
            "onset": 43.0,
            "x": 2056.8090777342923
        }
    ],
    "staffs": [
        {
            "bottom": 51.9,
            "notespos": [],
            "top": 0
        },
        {
            "bottom": 102.9,
            "notespos": [],
            "top": 52
        },
        {
            "bottom": 159.9,
            "notespos": [],
            "top": 108
        },
        {
            "bottom": 210.9,
            "notespos": [],
            "top": 160
        }
    ]
}