[
    {
        "date": 0.0,
        "onset": -2
    },
    {
        "date": 1.932040816,
        "onset": 2
    },
    {
        "date": 2.790498866,
        "onset": 3
    },
    {
        "date": 3.658321995,
        "onset": 4
    },
    {
        "date": 4.54648526,
        "onset": 5
    },
    {
        "date": 5.424557823,
        "onset": 6
    },
    {
        "date": 6.312562358,
        "onset": 7
    },
    {
        "date": 7.329070294,
        "onset": 8
    },
    {
        "date": 8.088163265,
        "onset": 9
    },
    {
        "date": 8.936417233,
        "onset": 10
    },
    {
        "date": 9.814648526,
        "onset": 11
    },
    {
        "date": 10.653265306,
        "onset": 12
    },
    {
        "date": 11.551609977,
        "onset": 13
    },
    {
        "date": 12.439115646,
        "onset": 14
    },
    {
        "date": 13.316825396,
        "onset": 15
    },
    {
        "date": 14.284126984,
        "onset": 16
    },
    {
        "date": 15.053628117,
        "onset": 17
    },
    {
        "date": 15.844716553,
        "onset": 18
    },
    {
        "date": 16.710929705,
        "onset": 19
    },
    {
        "date": 17.500136054,
        "onset": 20
    },
    {
        "date": 18.358707482,
        "onset": 21
    },
    {
        "date": 19.108526077,
        "onset": 22
    },
    {
        "date": 19.927936507,
        "onset": 23
    },
    {
        "date": 20.854376417,
        "onset": 24
    },
    {
        "date": 21.634263038,
        "onset": 25
    },
    {
        "date": 22.463129251,
        "onset": 26
    },
    {
        "date": 23.351292517,
        "onset": 27
    },
    {
        "date": 24.228866213,
        "onset": 28
    },
    {
        "date": 25.136417233,
        "onset": 29
    },
    {
        "date": 26.03446712,
        "onset": 30
    },
    {
        "date": 26.843628117,
        "onset": 31
    },
    {
        "date": 27.810907029,
        "onset": 32
    },
    {
        "date": 28.639138321,
        "onset": 33
    },
    {
        "date": 29.438163265,
        "onset": 34
    },
    {
        "date": 30.287029478,
        "onset": 35
    },
    {
        "date": 31.095963718,
        "onset": 36
    },
    {
        "date": 31.944285714,
        "onset": 37
    },
    {
        "date": 32.714104308,
        "onset": 38
    },
    {
        "date": 33.562675736,
        "onset": 39
    },
    {
        "date": 34.40154195,
        "onset": 40
    },
    {
        "date": 35.200521541,
        "onset": 41
    },
    {
        "date": 36.039319727,
        "onset": 42
    },
    {
        "date": 36.90739229,
        "onset": 43
    },
    {
        "date": 37.75600907,
        "onset": 44
    },
    {
        "date": 38.61478458,
        "onset": 45
    },
    {
        "date": 39.522743764,
        "onset": 46
    },
    {
        "date": 40.390861678,
        "onset": 47
    },
    {
        "date": 41.251383219,
        "onset": 48
    },
    {
        "date": 42.058321995,
        "onset": 49
    },
    {
        "date": 42.867596371,
        "onset": 50
    },
    {
        "date": 43.646848072,
        "onset": 51
    },
    {
        "date": 44.505351473,
        "onset": 52
    },
    {
        "date": 45.305691609,
        "onset": 53
    },
    {
        "date": 46.094240362,
        "onset": 54
    },
    {
        "date": 46.88371882,
        "onset": 55
    },
    {
        "date": 47.702675736,
        "onset": 56
    },
    {
        "date": 48.551065759,
        "onset": 57
    },
    {
        "date": 49.371814058,
        "onset": 58
    },
    {
        "date": 50.179319727,
        "onset": 59
    },
    {
        "date": 51.057936507,
        "onset": 60
    },
    {
        "date": 51.925963718,
        "onset": 61
    },
    {
        "date": 52.834104308,
        "onset": 62
    },
    {
        "date": 53.692244897,
        "onset": 63
    },
    {
        "date": 54.54095238,
        "onset": 64
    },
    {
        "date": 55.428979591,
        "onset": 65
    },
    {
        "date": 56.277596371,
        "onset": 66
    },
    {
        "date": 57.116598639,
        "onset": 67
    },
    {
        "date": 57.915759637,
        "onset": 68
    },
    {
        "date": 58.735079365,
        "onset": 69
    },
    {
        "date": 59.534489795,
        "onset": 70
    },
    {
        "date": 60.412630385,
        "onset": 71
    },
    {
        "date": 61.241428571,
        "onset": 72
    },
    {
        "date": 62.070113378,
        "onset": 73
    },
    {
        "date": 62.918911564,
        "onset": 74
    },
    {
        "date": 63.728004535,
        "onset": 75
    },
    {
        "date": 64.527505668,
        "onset": 76
    },
    {
        "date": 65.3461678,
        "onset": 77
    },
    {
        "date": 66.194716553,
        "onset": 78
    },
    {
        "date": 67.072857142,
        "onset": 79
    },
    {
        "date": 67.911678004,
        "onset": 80
    },
    {
        "date": 68.789727891,
        "onset": 81
    },
    {
        "date": 69.657823129,
        "onset": 82
    },
    {
        "date": 70.526099773,
        "onset": 83
    },
    {
        "date": 71.374693877,
        "onset": 84
    },
    {
        "date": 72.183696145,
        "onset": 85
    },
    {
        "date": 73.03217687,
        "onset": 86
    },
    {
        "date": 73.831768707,
        "onset": 87
    },
    {
        "date": 74.661814058,
        "onset": 88
    },
    {
        "date": 75.498979591,
        "onset": 89
    },
    {
        "date": 76.319455782,
        "onset": 90
    },
    {
        "date": 77.195691609,
        "onset": 91
    },
    {
        "date": 77.994897959,
        "onset": 92
    },
    {
        "date": 78.774693877,
        "onset": 93
    },
    {
        "date": 79.564081632,
        "onset": 94
    },
    {
        "date": 80.363265306,
        "onset": 95
    },
    {
        "date": 81.23185941,
        "onset": 96
    },
    {
        "date": 82.089931972,
        "onset": 97
    },
    {
        "date": 83.018979591,
        "onset": 98
    },
    {
        "date": 83.84739229,
        "onset": 99
    },
    {
        "date": 84.63600907,
        "onset": 100
    },
    {
        "date": 85.435283446,
        "onset": 101
    },
    {
        "date": 86.222766439,
        "onset": 102
    },
    {
        "date": 87.030612244,
        "onset": 103
    },
    {
        "date": 87.899229024,
        "onset": 104
    },
    {
        "date": 88.776938775,
        "onset": 105
    },
    {
        "date": 89.624535147,
        "onset": 106
    },
    {
        "date": 90.513832199,
        "onset": 107
    },
    {
        "date": 91.40201814,
        "onset": 108
    },
    {
        "date": 92.378367346,
        "onset": 109
    },
    {
        "date": 93.515351473,
        "onset": 110
    },
    {
        "date": 94.86201814,
        "onset": 111
    },
    {
        "date": 96.60739229,
        "onset": 112
    },
    {
        "date": 97.514126984,
        "onset": 113
    },
    {
        "date": 98.35217687,
        "onset": 114
    },
    {
        "date": 99.180498866,
        "onset": 115
    },
    {
        "date": 100.027845804,
        "onset": 116
    },
    {
        "date": 100.896371882,
        "onset": 117
    },
    {
        "date": 101.803696145,
        "onset": 118
    },
    {
        "date": 102.711065759,
        "onset": 119
    },
    {
        "date": 103.588594104,
        "onset": 120
    },
    {
        "date": 104.505986394,
        "onset": 121
    },
    {
        "date": 106.031337868,
        "onset": 122
    }
]
