{
    "bars": [
        280.0,
        572.5227897434855,
        997.3083692172833,
        1381.1063890041933,
        1808.8648749069255,
        2241.6355778858374,
        2709.1650436392615,
        3132.1630851700224,
        3587.6420084142087,
        4057.608129962367,
        4515.3541584468185,
        4966.909154098052,
        5438.6175022172065,
        5848.685385457077,
        6191.095330010244,
        6555.9197548127395,
        6937.431177513327,
        7352.987645151219,
        7802.116769163684,
        8200.037977034932,
        8661.80871589125,
        9139.439547158903,
        9608.694469750839,
        10032.110792429681,
        10359.969691755554,
        10808.656015956547,
        11267.98778786347,
        11565.321799170244
    ],
    "onset-x": [
        {
            "onset": 0.0,
            "x": 271.91776255707765
        },
        {
            "onset": 0.5,
            "x": 306.18036529680364
        },
        {
            "onset": 1.0,
            "x": 343.5031354642314
        },
        {
            "onset": 1.5,
            "x": 380.8259056316591
        },
        {
            "onset": 2.0,
            "x": 418.14867579908673
        },
        {
            "onset": 2.75,
            "x": 460.81356926077177
        },
        {
            "onset": 2.875,
            "x": 479.871499245551
        },
        {
            "onset": 3.0,
            "x": 498.92942923033024
        },
        {
            "onset": 3.5,
            "x": 538.1547869167838
        },
        {
            "onset": 4.0,
            "x": 585.802850626286
        },
        {
            "onset": 4.5,
            "x": 624.2832007023896
        },
        {
            "onset": 5.0,
            "x": 661.6059708698174
        },
        {
            "onset": 5.25,
            "x": 689.7963209459208
        },
        {
            "onset": 5.5,
            "x": 717.9866710220242
        },
        {
            "onset": 5.75,
            "x": 746.177021098128
        },
        {
            "onset": 6.0,
            "x": 773.2097912655555
        },
        {
            "onset": 6.25,
            "x": 802.5577212503345
        },
        {
            "onset": 6.5,
            "x": 830.7480713264383
        },
        {
            "onset": 6.75,
            "x": 858.9384214025415
        },
        {
            "onset": 7.0,
            "x": 887.1287714786454
        },
        {
            "onset": 7.25,
            "x": 915.3191215547482
        },
        {
            "onset": 7.5,
            "x": 943.509471630852
        },
        {
            "onset": 7.75,
            "x": 971.6998217069558
        },
        {
            "onset": 8.0,
            "x": 1011.1143258745306
        },
        {
            "onset": 8.5,
            "x": 1048.1887601718417
        },
        {
            "onset": 8.75,
            "x": 1066.4536003544902
        },
        {
            "onset": 8.875,
            "x": 1085.5115303392695
        },
        {
            "onset": 9.0,
            "x": 1104.569460324049
        },
        {
            "onset": 9.5,
            "x": 1143.7948180105022
        },
        {
            "onset": 10.0,
            "x": 1179.215000658904
        },
        {
            "onset": 10.5,
            "x": 1217.4890645858445
        },
        {
            "onset": 10.75,
            "x": 1245.6794146619482
        },
        {
            "onset": 11.0,
            "x": 1273.8697647380518
        },
        {
            "onset": 11.25,
            "x": 1302.0601148141554
        },
        {
            "onset": 11.5,
            "x": 1330.2504648902589
        },
        {
            "onset": 11.75,
            "x": 1358.4408149663623
        },
        {
            "onset": 12.0,
            "x": 1393.2555823070854
        },
        {
            "onset": 12.25,
            "x": 1419.9292048337213
        },
        {
            "onset": 12.5,
            "x": 1448.1195549098252
        },
        {
            "onset": 12.75,
            "x": 1476.3099049859286
        },
        {
            "onset": 13.0,
            "x": 1504.6391852642544
        },
        {
            "onset": 13.25,
            "x": 1532.829535340358
        },
        {
            "onset": 13.5,
            "x": 1561.0198854164612
        },
        {
            "onset": 13.75,
            "x": 1589.2102354925646
        },
        {
            "onset": 14.0,
            "x": 1617.400585568668
        },
        {
            "onset": 14.25,
            "x": 1645.5909356447717
        },
        {
            "onset": 14.5,
            "x": 1673.7812857208753
        },
        {
            "onset": 14.75,
            "x": 1701.9716357969787
        },
        {
            "onset": 14.875,
            "x": 1721.0295657817578
        },
        {
            "onset": 15.0,
            "x": 1740.0874957665371
        },
        {
            "onset": 15.5,
            "x": 1776.638545994848
        },
        {
            "onset": 16.0,
            "x": 1822.4224956940564
        },
        {
            "onset": 16.5,
            "x": 1859.7452658614843
        },
        {
            "onset": 16.75,
            "x": 1887.9356159375877
        },
        {
            "onset": 17.0,
            "x": 1916.125966013691
        },
        {
            "onset": 17.25,
            "x": 1944.3163160897946
        },
        {
            "onset": 17.5,
            "x": 1972.506666165898
        },
        {
            "onset": 17.75,
            "x": 2000.6970162420018
        },
        {
            "onset": 18.0,
            "x": 2028.7484361158906
        },
        {
            "onset": 18.25,
            "x": 2056.938786191994
        },
        {
            "onset": 18.5,
            "x": 2085.129136268097
        },
        {
            "onset": 18.75,
            "x": 2103.393976450746
        },
        {
            "onset": 19.0,
            "x": 2131.5843265268495
        },
        {
            "onset": 19.25,
            "x": 2159.7746766029527
        },
        {
            "onset": 19.5,
            "x": 2187.965026679057
        },
        {
            "onset": 19.75,
            "x": 2216.15537675516
        },
        {
            "onset": 20.0,
            "x": 2255.410637246568
        },
        {
            "onset": 20.25,
            "x": 2283.6009873226712
        },
        {
            "onset": 20.5,
            "x": 2311.791337398775
        },
        {
            "onset": 20.75,
            "x": 2339.9816874748785
        },
        {
            "onset": 20.875,
            "x": 2359.039617459657
        },
        {
            "onset": 21.0,
            "x": 2378.0581232942595
        },
        {
            "onset": 21.25,
            "x": 2405.4947772770097
        },
        {
            "onset": 21.5,
            "x": 2433.685127353113
        },
        {
            "onset": 21.75,
            "x": 2461.875477429216
        },
        {
            "onset": 22.0,
            "x": 2490.0658275053197
        },
        {
            "onset": 22.25,
            "x": 2517.4630573378918
        },
        {
            "onset": 22.5,
            "x": 2545.6534074139954
        },
        {
            "onset": 22.75,
            "x": 2573.843757490099
        },
        {
            "onset": 23.0,
            "x": 2602.173037768417
        },
        {
            "onset": 23.25,
            "x": 2630.3633878445207
        },
        {
            "onset": 23.5,
            "x": 2658.5537379206244
        },
        {
            "onset": 23.75,
            "x": 2686.7440879967276
        },
        {
            "onset": 24.0,
            "x": 2722.3368044568265
        },
        {
            "onset": 24.25,
            "x": 2750.9130145024887
        },
        {
            "onset": 24.5,
            "x": 2779.103364578592
        },
        {
            "onset": 24.75,
            "x": 2807.2937146546956
        },
        {
            "onset": 25.0,
            "x": 2834.5099899319334
        },
        {
            "onset": 25.25,
            "x": 2863.535484604688
        },
        {
            "onset": 25.5,
            "x": 2891.7258346807916
        },
        {
            "onset": 25.75,
            "x": 2919.9161847568953
        },
        {
            "onset": 26.0,
            "x": 2948.1065348329985
        },
        {
            "onset": 26.5,
            "x": 2986.380598759939
        },
        {
            "onset": 26.75,
            "x": 3004.6454389425876
        },
        {
            "onset": 26.875,
            "x": 3023.703368927367
        },
        {
            "onset": 27.0,
            "x": 3042.7612989121462
        },
        {
            "onset": 27.5,
            "x": 3081.035362839087
        },
        {
            "onset": 27.75,
            "x": 3099.3002030217353
        },
        {
            "onset": 27.875,
            "x": 3118.358133006515
        },
        {
            "onset": 28.0,
            "x": 3146.1392752113393
        },
        {
            "onset": 28.25,
            "x": 3174.3296252874434
        },
        {
            "onset": 28.5,
            "x": 3202.5199753635466
        },
        {
            "onset": 28.75,
            "x": 3228.807737920624
        },
        {
            "onset": 29.0,
            "x": 3255.2283684924882
        },
        {
            "onset": 29.25,
            "x": 3283.4187185685923
        },
        {
            "onset": 29.5,
            "x": 3311.609068644696
        },
        {
            "onset": 29.75,
            "x": 3339.7994187207996
        },
        {
            "onset": 30.0,
            "x": 3367.9897687969024
        },
        {
            "onset": 30.25,
            "x": 3396.180118873007
        },
        {
            "onset": 30.5,
            "x": 3424.3704689491096
        },
        {
            "onset": 30.75,
            "x": 3452.5608190252133
        },
        {
            "onset": 31.0,
            "x": 3480.7511691013174
        },
        {
            "onset": 31.25,
            "x": 3508.94151917742
        },
        {
            "onset": 31.5,
            "x": 3537.1318692535237
        },
        {
            "onset": 31.75,
            "x": 3565.3222193296274
        },
        {
            "onset": 32.0,
            "x": 3601.325101043037
        },
        {
            "onset": 32.25,
            "x": 3629.808548531621
        },
        {
            "onset": 32.5,
            "x": 3657.998898607725
        },
        {
            "onset": 32.75,
            "x": 3686.1892486838283
        },
        {
            "onset": 33.0,
            "x": 3714.3795987599324
        },
        {
            "onset": 33.25,
            "x": 3742.5699488360356
        },
        {
            "onset": 33.5,
            "x": 3770.7602989121383
        },
        {
            "onset": 33.75,
            "x": 3798.9506489882424
        },
        {
            "onset": 34.0,
            "x": 3829.0435865833724
        },
        {
            "onset": 34.25,
            "x": 3857.2339366594747
        },
        {
            "onset": 34.5,
            "x": 3885.4242867355783
        },
        {
            "onset": 34.75,
            "x": 3911.712049292656
        },
        {
            "onset": 34.875,
            "x": 3930.769979277435
        },
        {
            "onset": 35.0,
            "x": 3949.827909262215
        },
        {
            "onset": 35.25,
            "x": 3978.018259338319
        },
        {
            "onset": 35.5,
            "x": 4006.208609414422
        },
        {
            "onset": 35.75,
            "x": 4034.398959490525
        },
        {
            "onset": 36.0,
            "x": 4071.4641225694604
        },
        {
            "onset": 36.25,
            "x": 4097.751885126538
        },
        {
            "onset": 36.5,
            "x": 4125.94223520264
        },
        {
            "onset": 36.75,
            "x": 4154.132585278741
        },
        {
            "onset": 37.0,
            "x": 4182.32293535484
        },
        {
            "onset": 37.25,
            "x": 4210.513285430943
        },
        {
            "onset": 37.5,
            "x": 4238.703635507047
        },
        {
            "onset": 37.75,
            "x": 4266.893985583151
        },
        {
            "onset": 38.0,
            "x": 4295.084335659254
        },
        {
            "onset": 38.25,
            "x": 4323.274685735358
        },
        {
            "onset": 38.5,
            "x": 4351.465035811461
        },
        {
            "onset": 38.75,
            "x": 4379.655385887565
        },
        {
            "onset": 39.0,
            "x": 4407.010591367017
        },
        {
            "onset": 39.25,
            "x": 4436.036086039772
        },
        {
            "onset": 39.5,
            "x": 4464.226436115875
        },
        {
            "onset": 39.75,
            "x": 4492.416786191979
        },
        {
            "onset": 40.0,
            "x": 4527.88921171927
        },
        {
            "onset": 40.25,
            "x": 4557.982149314399
        },
        {
            "onset": 40.5,
            "x": 4586.172499390503
        },
        {
            "onset": 40.75,
            "x": 4614.362849466606
        },
        {
            "onset": 40.875,
            "x": 4633.420779451385
        },
        {
            "onset": 41.0,
            "x": 4652.4787094361645
        },
        {
            "onset": 41.5,
            "x": 4689.59519345443
        },
        {
            "onset": 41.75,
            "x": 4709.017613545754
        },
        {
            "onset": 41.875,
            "x": 4728.075543530535
        },
        {
            "onset": 42.0,
            "x": 4746.935193454429
        },
        {
            "onset": 42.25,
            "x": 4774.530703347885
        },
        {
            "onset": 42.5,
            "x": 4802.7210534239875
        },
        {
            "onset": 42.75,
            "x": 4830.911403500092
        },
        {
            "onset": 43.0,
            "x": 4859.101753576195
        },
        {
            "onset": 43.25,
            "x": 4887.2921036522985
        },
        {
            "onset": 43.5,
            "x": 4915.482453728402
        },
        {
            "onset": 43.75,
            "x": 4943.672803804507
        },
        {
            "onset": 44.0,
            "x": 4980.684213458782
        },
        {
            "onset": 44.25,
            "x": 5008.874563534887
        },
        {
            "onset": 44.5,
            "x": 5037.06491361099
        },
        {
            "onset": 44.75,
            "x": 5065.255263687093
        },
        {
            "onset": 45.0,
            "x": 5093.376148662085
        },
        {
            "onset": 45.25,
            "x": 5121.566498738189
        },
        {
            "onset": 45.5,
            "x": 5149.756848814292
        },
        {
            "onset": 45.75,
            "x": 5177.947198890396
        },
        {
            "onset": 46.0,
            "x": 5206.1375489665
        },
        {
            "onset": 46.25,
            "x": 5234.327899042603
        },
        {
            "onset": 46.5,
            "x": 5262.518249118707
        },
        {
            "onset": 46.75,
            "x": 5290.70859919481
        },
        {
            "onset": 46.875,
            "x": 5309.76652917959
        },
        {
            "onset": 47.0,
            "x": 5328.824459164369
        },
        {
            "onset": 47.25,
            "x": 5357.014809240472
        },
        {
            "onset": 47.5,
            "x": 5385.205159316575
        },
        {
            "onset": 47.75,
            "x": 5413.395509392681
        },
        {
            "onset": 48.0,
            "x": 5459.904458077176
        },
        {
            "onset": 48.25,
            "x": 5488.09480815328
        },
        {
            "onset": 48.5,
            "x": 5516.285158229384
        },
        {
            "onset": 48.75,
            "x": 5544.475508305488
        },
        {
            "onset": 49.0,
            "x": 5570.763270862566
        },
        {
            "onset": 49.25,
            "x": 5598.953620938668
        },
        {
            "onset": 49.5,
            "x": 5627.1439710147715
        },
        {
            "onset": 49.75,
            "x": 5655.334321090875
        },
        {
            "onset": 50.0,
            "x": 5683.5941362680815
        },
        {
            "onset": 50.5,
            "x": 5720.91690643551
        },
        {
            "onset": 50.75,
            "x": 5749.107256511614
        },
        {
            "onset": 51.0,
            "x": 5777.2976065877165
        },
        {
            "onset": 51.5,
            "x": 5805.212142360753
        },
        {
            "onset": 51.75,
            "x": 5823.476982543401
        },
        {
            "onset": 52.0,
            "x": 5861.220438729529
        },
        {
            "onset": 52.5,
            "x": 5896.228049079605
        },
        {
            "onset": 53.0,
            "x": 5932.7156746503815
        },
        {
            "onset": 53.5,
            "x": 5969.716009505783
        },
        {
            "onset": 54.0,
            "x": 6007.2871155433295
        },
        {
            "onset": 54.5,
            "x": 6044.36154984064
        },
        {
            "onset": 54.75,
            "x": 6062.626390023288
        },
        {
            "onset": 54.875,
            "x": 6081.684320008067
        },
        {
            "onset": 55.0,
            "x": 6100.742249992854
        },
        {
            "onset": 55.5,
            "x": 6139.9676076793085
        },
        {
            "onset": 55.75,
            "x": 6158.232447861957
        },
        {
            "onset": 55.875,
            "x": 6177.290377846734
        },
        {
            "onset": 56.0,
            "x": 6204.466409520283
        },
        {
            "onset": 56.5,
            "x": 6242.037515557831
        },
        {
            "onset": 57.0,
            "x": 6278.726089885579
        },
        {
            "onset": 57.25,
            "x": 6306.916439961682
        },
        {
            "onset": 57.5,
            "x": 6335.106790037785
        },
        {
            "onset": 57.75,
            "x": 6363.297140113888
        },
        {
            "onset": 58.0,
            "x": 6391.101630220434
        },
        {
            "onset": 58.5,
            "x": 6427.404344578631
        },
        {
            "onset": 58.75,
            "x": 6445.669184761279
        },
        {
            "onset": 58.875,
            "x": 6464.727114746057
        },
        {
            "onset": 59.0,
            "x": 6483.7850447308365
        },
        {
            "onset": 59.5,
            "x": 6521.742010737938
        },
        {
            "onset": 60.0,
            "x": 6569.477375599864
        },
        {
            "onset": 60.5,
            "x": 6606.800145767291
        },
        {
            "onset": 60.75,
            "x": 6625.064985949939
        },
        {
            "onset": 60.875,
            "x": 6644.1229159347195
        },
        {
            "onset": 61.0,
            "x": 6663.1808459195045
        },
        {
            "onset": 61.25,
            "x": 6691.371195995609
        },
        {
            "onset": 61.5,
            "x": 6719.561546071709
        },
        {
            "onset": 61.75,
            "x": 6747.751896147809
        },
        {
            "onset": 62.0,
            "x": 6775.803316021697
        },
        {
            "onset": 62.5,
            "x": 6813.126086189125
        },
        {
            "onset": 63.0,
            "x": 6849.870066402215
        },
        {
            "onset": 63.5,
            "x": 6887.192836569642
        },
        {
            "onset": 63.75,
            "x": 6905.45767675229
        },
        {
            "onset": 63.875,
            "x": 6924.515606737071
        },
        {
            "onset": 64.0,
            "x": 6951.423675447664
        },
        {
            "onset": 64.5,
            "x": 6988.608921515647
        },
        {
            "onset": 64.75,
            "x": 7006.873761698296
        },
        {
            "onset": 64.875,
            "x": 7025.931691683074
        },
        {
            "onset": 65.0,
            "x": 7044.989621667855
        },
        {
            "onset": 65.5,
            "x": 7082.788038715037
        },
        {
            "onset": 66.0,
            "x": 7119.669894553266
        },
        {
            "onset": 66.25,
            "x": 7147.860244629368
        },
        {
            "onset": 66.5,
            "x": 7176.050594705472
        },
        {
            "onset": 66.75,
            "x": 7204.240944781575
        },
        {
            "onset": 66.875,
            "x": 7223.298874766355
        },
        {
            "onset": 67.0,
            "x": 7245.751020885076
        },
        {
            "onset": 67.25,
            "x": 7273.94137096118
        },
        {
            "onset": 67.5,
            "x": 7302.131721037284
        },
        {
            "onset": 67.75,
            "x": 7330.322071113388
        },
        {
            "onset": 68.0,
            "x": 7366.980143085557
        },
        {
            "onset": 68.5,
            "x": 7405.571304932329
        },
        {
            "onset": 68.75,
            "x": 7423.836145114978
        },
        {
            "onset": 68.875,
            "x": 7442.894075099756
        },
        {
            "onset": 69.0,
            "x": 7461.952005084537
        },
        {
            "onset": 69.25,
            "x": 7490.142355160639
        },
        {
            "onset": 69.5,
            "x": 7518.332705236743
        },
        {
            "onset": 69.75,
            "x": 7546.523055312847
        },
        {
            "onset": 70.0,
            "x": 7574.7134053889495
        },
        {
            "onset": 70.25,
            "x": 7602.903755465053
        },
        {
            "onset": 70.5,
            "x": 7631.094105541159
        },
        {
            "onset": 70.75,
            "x": 7657.381868098236
        },
        {
            "onset": 71.0,
            "x": 7685.572218174338
        },
        {
            "onset": 71.25,
            "x": 7713.762568250442
        },
        {
            "onset": 71.5,
            "x": 7741.952918326546
        },
        {
            "onset": 71.75,
            "x": 7770.1432684026495
        },
        {
            "onset": 71.875,
            "x": 7789.201198387428
        },
        {
            "onset": 72.0,
            "x": 7816.423946811035
        },
        {
            "onset": 72.25,
            "x": 7844.614296887138
        },
        {
            "onset": 72.5,
            "x": 7872.804646963242
        },
        {
            "onset": 72.75,
            "x": 7900.994997039345
        },
        {
            "onset": 73.0,
            "x": 7929.18534711545
        },
        {
            "onset": 73.5,
            "x": 7965.7363973437605
        },
        {
            "onset": 73.75,
            "x": 7984.001237526409
        },
        {
            "onset": 74.0,
            "x": 8012.1915876025105
        },
        {
            "onset": 74.5,
            "x": 8048.356777861264
        },
        {
            "onset": 74.75,
            "x": 8067.779197952587
        },
        {
            "onset": 74.875,
            "x": 8086.837127937366
        },
        {
            "onset": 75.0,
            "x": 8108.615347115447
        },
        {
            "onset": 75.5,
            "x": 8146.612044223518
        },
        {
            "onset": 75.75,
            "x": 8164.876884406164
        },
        {
            "onset": 75.875,
            "x": 8183.934814390945
        },
        {
            "onset": 76.0,
            "x": 8213.626495118595
        },
        {
            "onset": 76.25,
            "x": 8241.568509324583
        },
        {
            "onset": 76.5,
            "x": 8269.758859400685
        },
        {
            "onset": 76.75,
            "x": 8297.949209476788
        },
        {
            "onset": 77.0,
            "x": 8326.000629350685
        },
        {
            "onset": 77.25,
            "x": 8354.190979426789
        },
        {
            "onset": 77.5,
            "x": 8382.381329502892
        },
        {
            "onset": 77.75,
            "x": 8410.571679578996
        },
        {
            "onset": 78.0,
            "x": 8438.405507585085
        },
        {
            "onset": 78.25,
            "x": 8466.952379731203
        },
        {
            "onset": 78.5,
            "x": 8495.142729807305
        },
        {
            "onset": 78.75,
            "x": 8523.33307988341
        },
        {
            "onset": 79.0,
            "x": 8550.805709802968
        },
        {
            "onset": 79.25,
            "x": 8579.57484983341
        },
        {
            "onset": 79.5,
            "x": 8607.765199909514
        },
        {
            "onset": 79.75,
            "x": 8635.955549985618
        },
        {
            "onset": 80.0,
            "x": 8675.784905932573
        },
        {
            "onset": 80.25,
            "x": 8703.975256008676
        },
        {
            "onset": 80.5,
            "x": 8732.16560608478
        },
        {
            "onset": 80.75,
            "x": 8760.355956160882
        },
        {
            "onset": 81.0,
            "x": 8788.476841135845
        },
        {
            "onset": 81.25,
            "x": 8816.667191211947
        },
        {
            "onset": 81.5,
            "x": 8844.857541288053
        },
        {
            "onset": 81.75,
            "x": 8873.047891364155
        },
        {
            "onset": 81.875,
            "x": 8892.105821348934
        },
        {
            "onset": 82.0,
            "x": 8911.163751333715
        },
        {
            "onset": 82.25,
            "x": 8941.256688928845
        },
        {
            "onset": 82.5,
            "x": 8969.447039004946
        },
        {
            "onset": 82.75,
            "x": 8997.637389081052
        },
        {
            "onset": 83.0,
            "x": 9025.827739157154
        },
        {
            "onset": 83.25,
            "x": 9055.920676752283
        },
        {
            "onset": 83.5,
            "x": 9084.111026828386
        },
        {
            "onset": 83.75,
            "x": 9114.203964423516
        },
        {
            "onset": 84.0,
            "x": 9153.384033786453
        },
        {
            "onset": 84.25,
            "x": 9181.574383862559
        },
        {
            "onset": 84.5,
            "x": 9209.764733938662
        },
        {
            "onset": 84.75,
            "x": 9237.955084014764
        },
        {
            "onset": 84.875,
            "x": 9257.013013999542
        },
        {
            "onset": 85.0,
            "x": 9276.070943984325
        },
        {
            "onset": 85.25,
            "x": 9304.261294060427
        },
        {
            "onset": 85.5,
            "x": 9332.45164413653
        },
        {
            "onset": 85.75,
            "x": 9360.641994212632
        },
        {
            "onset": 86.0,
            "x": 9388.832344288736
        },
        {
            "onset": 86.25,
            "x": 9417.022694364841
        },
        {
            "onset": 86.5,
            "x": 9445.213044440945
        },
        {
            "onset": 86.75,
            "x": 9473.403394517049
        },
        {
            "onset": 87.0,
            "x": 9501.593744593152
        },
        {
            "onset": 87.25,
            "x": 9529.784094669254
        },
        {
            "onset": 87.5,
            "x": 9557.974444745356
        },
        {
            "onset": 87.75,
            "x": 9586.164794821461
        },
        {
            "onset": 88.0,
            "x": 9622.469529111568
        },
        {
            "onset": 88.25,
            "x": 9652.562466706697
        },
        {
            "onset": 88.5,
            "x": 9680.752816782802
        },
        {
            "onset": 88.75,
            "x": 9708.943166858904
        },
        {
            "onset": 89.0,
            "x": 9736.994586732726
        },
        {
            "onset": 89.25,
            "x": 9765.184936808828
        },
        {
            "onset": 89.5,
            "x": 9793.375286884933
        },
        {
            "onset": 89.75,
            "x": 9821.565636961035
        },
        {
            "onset": 90.0,
            "x": 9849.894917239422
        },
        {
            "onset": 90.25,
            "x": 9878.085267315528
        },
        {
            "onset": 90.5,
            "x": 9906.27561739163
        },
        {
            "onset": 90.75,
            "x": 9934.465967467733
        },
        {
            "onset": 91.0,
            "x": 9962.656317543837
        },
        {
            "onset": 91.5,
            "x": 9998.07650019224
        },
        {
            "onset": 92.0,
            "x": 10045.668413216743
        },
        {
            "onset": 92.5,
            "x": 10082.039889624659
        },
        {
            "onset": 93.0,
            "x": 10119.362659792085
        },
        {
            "onset": 93.5,
            "x": 10156.685429959512
        },
        {
            "onset": 94.0,
            "x": 10193.96189005959
        },
        {
            "onset": 94.5,
            "x": 10231.284660227017
        },
        {
            "onset": 94.75,
            "x": 10249.549500409667
        },
        {
            "onset": 94.875,
            "x": 10268.607430394446
        },
        {
            "onset": 95.0,
            "x": 10287.665360379224
        },
        {
            "onset": 95.5,
            "x": 10325.939424306165
        },
        {
            "onset": 96.0,
            "x": 10379.886860705328
        },
        {
            "onset": 96.5,
            "x": 10418.160924632268
        },
        {
            "onset": 96.75,
            "x": 10436.425764814916
        },
        {
            "onset": 96.875,
            "x": 10455.483694799696
        },
        {
            "onset": 97.0,
            "x": 10474.541624784473
        },
        {
            "onset": 97.25,
            "x": 10502.731974860579
        },
        {
            "onset": 97.5,
            "x": 10530.922324936684
        },
        {
            "onset": 97.75,
            "x": 10559.112675012786
        },
        {
            "onset": 98.0,
            "x": 10587.30302508889
        },
        {
            "onset": 98.25,
            "x": 10616.444668924507
        },
        {
            "onset": 98.5,
            "x": 10644.635019000685
        },
        {
            "onset": 98.75,
            "x": 10672.825369076789
        },
        {
            "onset": 99.0,
            "x": 10701.015719152894
        },
        {
            "onset": 99.25,
            "x": 10729.206069228996
        },
        {
            "onset": 99.5,
            "x": 10757.3964193051
        },
        {
            "onset": 99.75,
            "x": 10784.952573541477
        },
        {
            "onset": 100.0,
            "x": 10822.27469588691
        },
        {
            "onset": 100.25,
            "x": 10849.420989646424
        },
        {
            "onset": 100.5,
            "x": 10877.611339722527
        },
        {
            "onset": 100.75,
            "x": 10905.80168979863
        },
        {
            "onset": 101.0,
            "x": 10933.992039874733
        },
        {
            "onset": 101.25,
            "x": 10962.182389950838
        },
        {
            "onset": 101.5,
            "x": 10990.37274002694
        },
        {
            "onset": 101.75,
            "x": 11017.611796343532
        },
        {
            "onset": 102.0,
            "x": 11045.603866358751
        },
        {
            "onset": 102.25,
            "x": 11073.199376252207
        },
        {
            "onset": 102.375,
            "x": 11092.257306236987
        },
        {
            "onset": 102.5,
            "x": 11111.315236221766
        },
        {
            "onset": 102.75,
            "x": 11139.50558629787
        },
        {
            "onset": 103.0,
            "x": 11167.83486657618
        },
        {
            "onset": 103.25,
            "x": 11196.025216652282
        },
        {
            "onset": 103.5,
            "x": 11224.215566728464
        },
        {
            "onset": 103.75,
            "x": 11242.48040691111
        },
        {
            "onset": 104.0,
            "x": 11283.032059734143
        },
        {
            "onset": 104.125,
            "x": 11299.353066837139
        },
        {
            "onset": 104.25,
            "x": 11318.41099682192
        },
        {
            "onset": 104.375,
            "x": 11337.4689268067
        },
        {
            "onset": 104.5,
            "x": 11356.526856791475
        },
        {
            "onset": 104.75,
            "x": 11384.717206867579
        },
        {
            "onset": 105.0,
            "x": 11412.907556943685
        },
        {
            "onset": 105.25,
            "x": 11440.304786776256
        },
        {
            "onset": 105.5,
            "x": 11466.592549333332
        },
        {
            "onset": 105.75,
            "x": 11484.857389515983
        },
        {
            "onset": 106.0,
            "x": 11513.326027263322
        }
    ],
    "staffs": [
        {
            "bottom": 102.9,
            "notespos": [],
            "top": 0
        },
        {
            "bottom": 210.9,
            "notespos": [],
            "top": 108
        },
        {
            "bottom": 318.9,
            "notespos": [],
            "top": 216
        },
        {
            "bottom": 427.9,
            "notespos": [],
            "top": 324
        }
    ]
}