{
  "admin" : ["manu"],
  "algomus" : ["mathieu", "laurent"],
  "edmus" : ["mathieu"],
  "edmus-eleves" : ["amiens-eleves", "soissons-eleves"],
  "amiens-eleves" : ["amiens-4e2", "amiens-5e4"],
  "soissons-eleves" : ["soissons-5e2"],
  "amiens-4e2" : ["noam", "marie"],
  "amiens-5e4" : ["camille", "mathis"],
  "soissons-5e2" : ["colin", "claire"]
}
