@startuml

component piece {
    [score] as score_main
}

note top of [score_main] : tap/click on label

component minimap {
    [score] as score_minimap
}

score_main -down-> label_selected
[schema] <-left- label_selected
score_minimap <-up- label_selected
[schema] -right-> show_label_data
[editor] <-left- show_label_data

@enduml
