@startuml

note top of [score] : tap/click on label
note top of [score] : drag/scale label
note top of [score] : tap or click
[score] <-down-> add_label
[score] <-down-> label_has_changed
[score] <-- delete_button_pressed
[score] --> delete_label
[score] -down-> edit_label

[schema] <-up-> add_label
[schema] <-up- label_has_changed
[schema] <-- delete_label
[schema] -up-> show_label_label_to_edit
[schema] <-up- edit_label

[minimap] <-up- add_label
[minimap] <-left- label_has_changed
[minimap] --> delete_label

note top of [editor] : press delete button
note top of [editor]
edit
type,
start,
duration,
tag
end note
[editor] -up-> delete_button_pressed
[editor] <-right-> label_has_changed
[editor] <-down- show_label_label_to_edit

@enduml
