#vertices
v 0.000000 0.500000 0.000000
v 0.500000 -0.500000 0.000000
v -0.500000 -0.500000 0.000000


#normals
vn 0.000000 0.000000 -1.000000


#faces (index data)
# format: vertex/Uvcoordinate/normal
f 1//1 2//1 3//1
