1	0.mM.caffeine	25
2	0.mM.caffeine	31
3	0.mM.caffeine	31
4	0.mM.caffeine	35
5	0.mM.caffeine	35
6	0.mM.caffeine	38
7	0.mM.caffeine	38
8	0.mM.caffeine	38
9	0.mM.caffeine	40
10	0.mM.caffeine	40
11	0.mM.caffeine	40
12	0.mM.caffeine	40
13	0.mM.caffeine	42
14	0.mM.caffeine	25
15	0.mM.caffeine	31
16	0.mM.caffeine	31
17	0.mM.caffeine	31
18	0.mM.caffeine	33
19	0.mM.caffeine	33
20	0.mM.caffeine	33
21	0.mM.caffeine	38
22	0.mM.caffeine	38
23	0.mM.caffeine	38
24	0.mM.caffeine	38
25	0.mM.caffeine	38
26	0.mM.caffeine	40
27	0.mM.caffeine	40
28	0.mM.caffeine	40
29	0.mM.caffeine	40
30	0.mM.caffeine	40
31	0.mM.caffeine	40
32	0.mM.caffeine	40
33	0.mM.caffeine	40
34	0.mM.caffeine	31
35	0.mM.caffeine	31
36	0.mM.caffeine	33
37	0.mM.caffeine	33
38	0.mM.caffeine	33
39	0.mM.caffeine	33
40	0.mM.caffeine	33
41	0.mM.caffeine	38
42	0.mM.caffeine	38
43	0.mM.caffeine	38
44	0.mM.caffeine	40
45	0.mM.caffeine	40
46	0.mM.caffeine	40
47	0.mM.caffeine	40
48	0.mM.caffeine	40
49	0.mM.caffeine	42
50	0.mM.caffeine	45
51	0.mM.caffeine	45
52	0.mM.caffeine	45
53	0.mM.caffeine	47
54	0.mM.caffeine	47
