1	rol-6	16
2	rol-6	16
3	rol-6	16
4	rol-6	16
5	rol-6	19
6	rol-6	19
7	rol-6	19
8	rol-6	19
9	rol-6	19
10	rol-6	19
11	rol-6	19
12	rol-6	21
13	rol-6	21
14	rol-6	21
15	rol-6	21
16	rol-6	21
17	rol-6	23
18	rol-6	23
19	rol-6	23
20	rol-6	23
21	rol-6	23
22	rol-6	23
23	rol-6	23
24	rol-6	26
25	rol-6	26
26	rol-6	26
27	rol-6	26
28	rol-6	26
29	rol-6	26
30	rol-6	26
31	rol-6	28
32	rol-6	28
33	rol-6	28
34	rol-6	28
35	rol-6	30
36	rol-6	30
37	rol-6	30
38	rol-6	30
39	rol-6	30
40	rol-6	30
41	rol-6	33
42	rol-6	33
43	rol-6	33
44	rol-6	33
45	rol-6	33
46	rol-6	33
47	rol-6	33
48	rol-6	33
49	rol-6	33
50	rol-6	33
51	rol-6	33
52	rol-6	33
53	rol-6	37
54	rol-6	37
55	rol-6	40
56	rol-6	19
57	rol-6	26
58	rol-6	26
59	rol-6	16
60	rol-6	16
61	rol-6	19
62	rol-6	19
63	rol-6	19
64	rol-6	19
65	rol-6	12
66	rol-6	14
67	rol-6	14
68	rol-6	14
69	rol-6	14
70	rol-6	14
71	rol-6	14
72	rol-6	14
73	rol-6	16
74	rol-6	16
75	rol-6	16
76	rol-6	16
77	rol-6	16
78	rol-6	19
79	rol-6	19
80	rol-6	19
81	rol-6	19
82	rol-6	21
83	rol-6	14
84	rol-6	19
85	rol-6	19
86	rol-6	19
87	rol-6	21
88	rol-6	21
89	rol-6	21
90	rol-6	21
91	rol-6	21
92	rol-6	21
93	rol-6	21
94	rol-6	23
95	rol-6	23
96	rol-6	23
97	rol-6	23
98	rol-6	23
99	rol-6	23
100	rol-6	23
101	rol-6	23
102	rol-6	23
103	rol-6	26
104	rol-6	26
105	rol-6	26
106	rol-6	26
107	rol-6	26
108	rol-6	26
109	rol-6	26
110	rol-6	26
111	rol-6	26
112	rol-6	28
113	rol-6	28
114	rol-6	28
115	rol-6	28
116	rol-6	28
117	rol-6	28
118	rol-6	28
119	rol-6	30
120	rol-6	30
121	rol-6	30
122	rol-6	30
123	rol-6	30
124	rol-6	30
125	rol-6	33
126	rol-6	33
127	rol-6	33
128	rol-6	33
129	rol-6	33
130	rol-6	33
131	rol-6	33
132	rol-6	33
133	rol-6	35
134	rol-6	35
135	rol-6	35
136	rol-6	35
137	rol-6	19
138	rol-6	26
139	rol-6	16
140	rol-6	19
141	rol-6	19
142	rol-6	19
143	rol-6	21
144	rol-6	21
145	rol-6	23
146	rol-6	26
147	rol-6	14
148	rol-6	14
149	rol-6	14
150	rol-6	14
151	rol-6	14
152	rol-6	16
153	rol-6	16
154	rol-6	16
155	rol-6	19
156	rol-6	19
157	rol-6	19
158	rol-6	19
159	rol-6	19
160	rol-6	19
161	rol-6	19
162	rol-6	19
163	rol-6	19
164	rol-6	21
165	rol-6	21
