1	N2.Normoxia	25
2	N2.Normoxia	25
3	N2.Normoxia	29
4	N2.Normoxia	29
5	N2.Normoxia	32
6	N2.Normoxia	32
7	N2.Normoxia	32
8	N2.Normoxia	32
9	N2.Normoxia	34
10	N2.Normoxia	25
11	N2.Normoxia	25
12	N2.Normoxia	27
13	N2.Normoxia	27
14	N2.Normoxia	27
15	N2.Normoxia	29
16	N2.Normoxia	29
17	N2.Normoxia	29
18	N2.Normoxia	29
19	N2.Normoxia	32
20	N2.Normoxia	32
21	N2.Normoxia	32
22	N2.Normoxia	32
23	N2.Normoxia	32
24	N2.Normoxia	32
25	N2.Normoxia	32
26	N2.Normoxia	32
27	N2.Normoxia	32
28	N2.Normoxia	32
29	N2.Normoxia	32
30	N2.Normoxia	32
31	N2.Normoxia	32
32	N2.Normoxia	32
33	N2.Normoxia	32
34	N2.Normoxia	32
35	N2.Normoxia	32
36	N2.Normoxia	32
37	N2.Normoxia	32
38	N2.Normoxia	32
39	N2.Normoxia	34
40	N2.Normoxia	34
41	N2.Normoxia	34
42	N2.Normoxia	34
43	N2.Normoxia	34
44	N2.Normoxia	34
45	N2.Normoxia	34
46	N2.Normoxia	34
47	N2.Normoxia	34
48	N2.Normoxia	34
49	N2.Normoxia	34
50	N2.Normoxia	34
51	N2.Normoxia	34
52	N2.Normoxia	34
53	N2.Normoxia	34
54	N2.Normoxia	34
55	N2.Normoxia	34
56	N2.Normoxia	34
57	N2.Normoxia	36
58	N2.Normoxia	36
59	N2.Normoxia	36
60	N2.Normoxia	36
61	N2.Normoxia	36
62	N2.Normoxia	39
63	N2.Normoxia	29
64	N2.Normoxia	29
65	N2.Normoxia	32
66	N2.Normoxia	32
67	N2.Normoxia	34
68	N2.Normoxia	34
69	N2.Normoxia	34
70	N2.Normoxia	36
71	N2.Normoxia	36
72	N2.Normoxia	20
73	N2.Normoxia	22
74	N2.Normoxia	27
75	N2.Normoxia	27
76	N2.Normoxia	29
77	N2.Normoxia	29
78	N2.Normoxia	29
79	N2.Normoxia	32
80	N2.Normoxia	32
81	N2.Normoxia	32
82	N2.Normoxia	39
83	N2.Normoxia	25
84	N2.Normoxia	27
85	N2.Normoxia	29
86	N2.Normoxia	29
87	N2.Normoxia	29
88	N2.Normoxia	32
89	N2.Normoxia	32
90	N2.Normoxia	32
91	N2.Normoxia	32
92	N2.Normoxia	32
93	N2.Normoxia	32
94	N2.Normoxia	32
95	N2.Normoxia	32
96	N2.Normoxia	32
97	N2.Normoxia	32
98	N2.Normoxia	32
99	N2.Normoxia	32
100	N2.Normoxia	32
101	N2.Normoxia	32
102	N2.Normoxia	34
103	N2.Normoxia	34
104	N2.Normoxia	34
105	N2.Normoxia	34
106	N2.Normoxia	34
107	N2.Normoxia	34
108	N2.Normoxia	34
109	N2.Normoxia	34
110	N2.Normoxia	34
111	N2.Normoxia	34
112	N2.Normoxia	34
113	N2.Normoxia	34
114	N2.Normoxia	34
115	N2.Normoxia	34
116	N2.Normoxia	34
117	N2.Normoxia	34
118	N2.Normoxia	36
119	N2.Normoxia	36
120	N2.Normoxia	25
121	N2.Normoxia	25
122	N2.Normoxia	32
123	N2.Normoxia	32
124	N2.Normoxia	34
125	N2.Normoxia	34
126	N2.Normoxia	36
127	N2.Normoxia	36
128	N2.Normoxia	36
129	N2.Normoxia	36
130	N2.Normoxia	36
131	N2.Normoxia	36
132	N2.Normoxia	36
133	N2.Normoxia	36
134	N2.Normoxia	36
135	N2.Normoxia	36
