1	N2.5.mM.caffeine	46
2	N2.5.mM.caffeine	46
3	N2.5.mM.caffeine	46
4	N2.5.mM.caffeine	50
5	N2.5.mM.caffeine	50
6	N2.5.mM.caffeine	57
7	N2.5.mM.caffeine	60
8	N2.5.mM.caffeine	60
9	N2.5.mM.caffeine	60
10	N2.5.mM.caffeine	60
11	N2.5.mM.caffeine	64
12	N2.5.mM.caffeine	66
13	N2.5.mM.caffeine	70
14	N2.5.mM.caffeine	32
15	N2.5.mM.caffeine	32
16	N2.5.mM.caffeine	39
17	N2.5.mM.caffeine	39
18	N2.5.mM.caffeine	39
19	N2.5.mM.caffeine	39
20	N2.5.mM.caffeine	39
21	N2.5.mM.caffeine	43
22	N2.5.mM.caffeine	43
23	N2.5.mM.caffeine	43
24	N2.5.mM.caffeine	43
25	N2.5.mM.caffeine	43
26	N2.5.mM.caffeine	46
27	N2.5.mM.caffeine	46
28	N2.5.mM.caffeine	46
29	N2.5.mM.caffeine	46
30	N2.5.mM.caffeine	50
31	N2.5.mM.caffeine	50
32	N2.5.mM.caffeine	50
33	N2.5.mM.caffeine	53
34	N2.5.mM.caffeine	64
35	N2.5.mM.caffeine	32
36	N2.5.mM.caffeine	70
37	N2.5.mM.caffeine	39
38	N2.5.mM.caffeine	39
39	N2.5.mM.caffeine	43
40	N2.5.mM.caffeine	46
41	N2.5.mM.caffeine	50
42	N2.5.mM.caffeine	50
43	N2.5.mM.caffeine	53
44	N2.5.mM.caffeine	53
45	N2.5.mM.caffeine	57
46	N2.5.mM.caffeine	57
47	N2.5.mM.caffeine	57
48	N2.5.mM.caffeine	57
49	N2.5.mM.caffeine	57
50	N2.5.mM.caffeine	60
51	N2.5.mM.caffeine	60
52	N2.5.mM.caffeine	64
53	N2.5.mM.caffeine	64
54	N2.5.mM.caffeine	64
55	N2.5.mM.caffeine	36
56	N2.5.mM.caffeine	39
57	N2.5.mM.caffeine	43
58	N2.5.mM.caffeine	46
59	N2.5.mM.caffeine	46
60	N2.5.mM.caffeine	46
61	N2.5.mM.caffeine	57
62	N2.5.mM.caffeine	57
63	N2.5.mM.caffeine	57
64	N2.5.mM.caffeine	57
65	N2.5.mM.caffeine	66
66	N2.5.mM.caffeine	50
67	N2.5.mM.caffeine	36
68	N2.5.mM.caffeine	39
69	N2.5.mM.caffeine	43
70	N2.5.mM.caffeine	46
71	N2.5.mM.caffeine	46
72	N2.5.mM.caffeine	50
73	N2.5.mM.caffeine	53
74	N2.5.mM.caffeine	53
75	N2.5.mM.caffeine	57
76	N2.5.mM.caffeine	57
77	N2.5.mM.caffeine	60
78	N2.5.mM.caffeine	64
79	N2.5.mM.caffeine	64
80	N2.5.mM.caffeine	70
81	N2.5.mM.caffeine	29
82	N2.5.mM.caffeine	36
83	N2.5.mM.caffeine	39
84	N2.5.mM.caffeine	39
85	N2.5.mM.caffeine	39
86	N2.5.mM.caffeine	39
87	N2.5.mM.caffeine	39
88	N2.5.mM.caffeine	39
89	N2.5.mM.caffeine	43
90	N2.5.mM.caffeine	43
91	N2.5.mM.caffeine	43
92	N2.5.mM.caffeine	43
93	N2.5.mM.caffeine	46
94	N2.5.mM.caffeine	46
95	N2.5.mM.caffeine	46
96	N2.5.mM.caffeine	46
97	N2.5.mM.caffeine	64
98	N2.5.mM.caffeine	36
99	N2.5.mM.caffeine	53
