1	vhl-1	16
2	vhl-1	18
3	vhl-1	20
4	vhl-1	20
5	vhl-1	20
6	vhl-1	20
7	vhl-1	20
8	vhl-1	23
9	vhl-1	23
10	vhl-1	23
11	vhl-1	23
12	vhl-1	23
13	vhl-1	23
14	vhl-1	23
15	vhl-1	23
16	vhl-1	23
17	vhl-1	23
18	vhl-1	23
19	vhl-1	23
20	vhl-1	23
21	vhl-1	23
22	vhl-1	25
23	vhl-1	25
24	vhl-1	25
25	vhl-1	25
26	vhl-1	25
27	vhl-1	27
28	vhl-1	27
29	vhl-1	27
30	vhl-1	27
31	vhl-1	27
32	vhl-1	27
33	vhl-1	27
34	vhl-1	27
35	vhl-1	30
36	vhl-1	37
37	vhl-1	18
38	vhl-1	18
39	vhl-1	18
40	vhl-1	18
41	vhl-1	20
42	vhl-1	20
43	vhl-1	20
44	vhl-1	20
45	vhl-1	20
46	vhl-1	20
47	vhl-1	20
48	vhl-1	20
49	vhl-1	20
50	vhl-1	23
51	vhl-1	23
52	vhl-1	23
53	vhl-1	23
54	vhl-1	23
55	vhl-1	23
56	vhl-1	23
57	vhl-1	23
58	vhl-1	23
59	vhl-1	23
60	vhl-1	23
61	vhl-1	23
62	vhl-1	23
63	vhl-1	23
64	vhl-1	23
65	vhl-1	23
66	vhl-1	23
67	vhl-1	25
68	vhl-1	25
69	vhl-1	25
70	vhl-1	25
71	vhl-1	25
72	vhl-1	25
73	vhl-1	25
74	vhl-1	25
75	vhl-1	27
76	vhl-1	27
77	vhl-1	27
78	vhl-1	27
79	vhl-1	27
80	vhl-1	27
81	vhl-1	27
82	vhl-1	37
