1	WT.rpl-6(RNAi).20dgrC	17
2	WT.rpl-6(RNAi).20dgrC	19
3	WT.rpl-6(RNAi).20dgrC	22
4	WT.rpl-6(RNAi).20dgrC	22
5	WT.rpl-6(RNAi).20dgrC	22
6	WT.rpl-6(RNAi).20dgrC	24
7	WT.rpl-6(RNAi).20dgrC	24
8	WT.rpl-6(RNAi).20dgrC	10
9	WT.rpl-6(RNAi).20dgrC	12
10	WT.rpl-6(RNAi).20dgrC	12
11	WT.rpl-6(RNAi).20dgrC	12
12	WT.rpl-6(RNAi).20dgrC	14
13	WT.rpl-6(RNAi).20dgrC	14
14	WT.rpl-6(RNAi).20dgrC	14
15	WT.rpl-6(RNAi).20dgrC	14
16	WT.rpl-6(RNAi).20dgrC	14
17	WT.rpl-6(RNAi).20dgrC	14
18	WT.rpl-6(RNAi).20dgrC	14
19	WT.rpl-6(RNAi).20dgrC	17
20	WT.rpl-6(RNAi).20dgrC	17
21	WT.rpl-6(RNAi).20dgrC	17
22	WT.rpl-6(RNAi).20dgrC	17
23	WT.rpl-6(RNAi).20dgrC	17
24	WT.rpl-6(RNAi).20dgrC	17
25	WT.rpl-6(RNAi).20dgrC	17
26	WT.rpl-6(RNAi).20dgrC	17
27	WT.rpl-6(RNAi).20dgrC	17
28	WT.rpl-6(RNAi).20dgrC	17
29	WT.rpl-6(RNAi).20dgrC	17
30	WT.rpl-6(RNAi).20dgrC	17
31	WT.rpl-6(RNAi).20dgrC	17
32	WT.rpl-6(RNAi).20dgrC	17
33	WT.rpl-6(RNAi).20dgrC	17
34	WT.rpl-6(RNAi).20dgrC	17
35	WT.rpl-6(RNAi).20dgrC	19
36	WT.rpl-6(RNAi).20dgrC	19
37	WT.rpl-6(RNAi).20dgrC	19
38	WT.rpl-6(RNAi).20dgrC	19
39	WT.rpl-6(RNAi).20dgrC	19
40	WT.rpl-6(RNAi).20dgrC	22
