1	N2.HIF-1.(RNAi)	12
2	N2.HIF-1.(RNAi)	12
3	N2.HIF-1.(RNAi)	14
4	N2.HIF-1.(RNAi)	14
5	N2.HIF-1.(RNAi)	14
6	N2.HIF-1.(RNAi)	16
7	N2.HIF-1.(RNAi)	16
8	N2.HIF-1.(RNAi)	16
9	N2.HIF-1.(RNAi)	16
10	N2.HIF-1.(RNAi)	16
11	N2.HIF-1.(RNAi)	16
12	N2.HIF-1.(RNAi)	16
13	N2.HIF-1.(RNAi)	16
14	N2.HIF-1.(RNAi)	16
15	N2.HIF-1.(RNAi)	16
16	N2.HIF-1.(RNAi)	16
17	N2.HIF-1.(RNAi)	16
18	N2.HIF-1.(RNAi)	16
19	N2.HIF-1.(RNAi)	16
20	N2.HIF-1.(RNAi)	16
21	N2.HIF-1.(RNAi)	16
22	N2.HIF-1.(RNAi)	18
23	N2.HIF-1.(RNAi)	18
24	N2.HIF-1.(RNAi)	18
25	N2.HIF-1.(RNAi)	18
26	N2.HIF-1.(RNAi)	18
27	N2.HIF-1.(RNAi)	18
28	N2.HIF-1.(RNAi)	18
29	N2.HIF-1.(RNAi)	18
30	N2.HIF-1.(RNAi)	18
31	N2.HIF-1.(RNAi)	18
32	N2.HIF-1.(RNAi)	18
33	N2.HIF-1.(RNAi)	18
34	N2.HIF-1.(RNAi)	18
35	N2.HIF-1.(RNAi)	18
36	N2.HIF-1.(RNAi)	18
37	N2.HIF-1.(RNAi)	18
38	N2.HIF-1.(RNAi)	18
39	N2.HIF-1.(RNAi)	18
40	N2.HIF-1.(RNAi)	18
41	N2.HIF-1.(RNAi)	21
42	N2.HIF-1.(RNAi)	21
43	N2.HIF-1.(RNAi)	21
44	N2.HIF-1.(RNAi)	21
45	N2.HIF-1.(RNAi)	21
46	N2.HIF-1.(RNAi)	23
47	N2.HIF-1.(RNAi)	23
48	N2.HIF-1.(RNAi)	23
49	N2.HIF-1.(RNAi)	23
50	N2.HIF-1.(RNAi)	25
51	N2.HIF-1.(RNAi)	25
52	N2.HIF-1.(RNAi)	25
53	N2.HIF-1.(RNAi)	25
54	N2.HIF-1.(RNAi)	28
55	N2.HIF-1.(RNAi)	32
56	N2.HIF-1.(RNAi)	14
57	N2.HIF-1.(RNAi)	14
58	N2.HIF-1.(RNAi)	14
59	N2.HIF-1.(RNAi)	14
60	N2.HIF-1.(RNAi)	16
61	N2.HIF-1.(RNAi)	14
62	N2.HIF-1.(RNAi)	18
63	N2.HIF-1.(RNAi)	18
64	N2.HIF-1.(RNAi)	12
65	N2.HIF-1.(RNAi)	14
66	N2.HIF-1.(RNAi)	14
67	N2.HIF-1.(RNAi)	16
68	N2.HIF-1.(RNAi)	16
69	N2.HIF-1.(RNAi)	16
70	N2.HIF-1.(RNAi)	16
71	N2.HIF-1.(RNAi)	16
72	N2.HIF-1.(RNAi)	16
73	N2.HIF-1.(RNAi)	16
74	N2.HIF-1.(RNAi)	16
75	N2.HIF-1.(RNAi)	16
76	N2.HIF-1.(RNAi)	16
77	N2.HIF-1.(RNAi)	16
78	N2.HIF-1.(RNAi)	16
79	N2.HIF-1.(RNAi)	16
80	N2.HIF-1.(RNAi)	16
81	N2.HIF-1.(RNAi)	16
82	N2.HIF-1.(RNAi)	16
83	N2.HIF-1.(RNAi)	16
84	N2.HIF-1.(RNAi)	18
85	N2.HIF-1.(RNAi)	18
86	N2.HIF-1.(RNAi)	18
87	N2.HIF-1.(RNAi)	18
88	N2.HIF-1.(RNAi)	18
89	N2.HIF-1.(RNAi)	18
90	N2.HIF-1.(RNAi)	18
91	N2.HIF-1.(RNAi)	18
92	N2.HIF-1.(RNAi)	18
93	N2.HIF-1.(RNAi)	18
94	N2.HIF-1.(RNAi)	18
95	N2.HIF-1.(RNAi)	18
96	N2.HIF-1.(RNAi)	18
97	N2.HIF-1.(RNAi)	18
98	N2.HIF-1.(RNAi)	18
99	N2.HIF-1.(RNAi)	18
100	N2.HIF-1.(RNAi)	21
101	N2.HIF-1.(RNAi)	21
102	N2.HIF-1.(RNAi)	21
103	N2.HIF-1.(RNAi)	21
104	N2.HIF-1.(RNAi)	21
105	N2.HIF-1.(RNAi)	21
106	N2.HIF-1.(RNAi)	21
107	N2.HIF-1.(RNAi)	23
108	N2.HIF-1.(RNAi)	23
109	N2.HIF-1.(RNAi)	23
110	N2.HIF-1.(RNAi)	23
111	N2.HIF-1.(RNAi)	23
112	N2.HIF-1.(RNAi)	23
113	N2.HIF-1.(RNAi)	25
114	N2.HIF-1.(RNAi)	25
115	N2.HIF-1.(RNAi)	25
116	N2.HIF-1.(RNAi)	25
117	N2.HIF-1.(RNAi)	25
118	N2.HIF-1.(RNAi)	14
119	N2.HIF-1.(RNAi)	14
120	N2.HIF-1.(RNAi)	14
121	N2.HIF-1.(RNAi)	16
122	N2.HIF-1.(RNAi)	16
