1	0.mM.caffeine.15dgrC	21
2	0.mM.caffeine.15dgrC	23
3	0.mM.caffeine.15dgrC	23
4	0.mM.caffeine.15dgrC	24
5	0.mM.caffeine.15dgrC	30
6	0.mM.caffeine.15dgrC	30
7	0.mM.caffeine.15dgrC	30
8	0.mM.caffeine.15dgrC	30
9	0.mM.caffeine.15dgrC	32
10	0.mM.caffeine.15dgrC	32
11	0.mM.caffeine.15dgrC	32
12	0.mM.caffeine.15dgrC	32
13	0.mM.caffeine.15dgrC	32
14	0.mM.caffeine.15dgrC	32
15	0.mM.caffeine.15dgrC	32
16	0.mM.caffeine.15dgrC	35
17	0.mM.caffeine.15dgrC	35
18	0.mM.caffeine.15dgrC	35
19	0.mM.caffeine.15dgrC	35
20	0.mM.caffeine.15dgrC	35
21	0.mM.caffeine.15dgrC	35
22	0.mM.caffeine.15dgrC	37
23	0.mM.caffeine.15dgrC	37
24	0.mM.caffeine.15dgrC	37
25	0.mM.caffeine.15dgrC	37
26	0.mM.caffeine.15dgrC	37
27	0.mM.caffeine.15dgrC	42
28	0.mM.caffeine.15dgrC	42
29	0.mM.caffeine.15dgrC	44
30	0.mM.caffeine.15dgrC	46
31	0.mM.caffeine.15dgrC	46
32	0.mM.caffeine.15dgrC	23
33	0.mM.caffeine.15dgrC	23
34	0.mM.caffeine.15dgrC	23
35	0.mM.caffeine.15dgrC	23
36	0.mM.caffeine.15dgrC	32
37	0.mM.caffeine.15dgrC	32
38	0.mM.caffeine.15dgrC	32
39	0.mM.caffeine.15dgrC	32
40	0.mM.caffeine.15dgrC	32
41	0.mM.caffeine.15dgrC	32
42	0.mM.caffeine.15dgrC	35
43	0.mM.caffeine.15dgrC	35
44	0.mM.caffeine.15dgrC	35
45	0.mM.caffeine.15dgrC	37
46	0.mM.caffeine.15dgrC	37
47	0.mM.caffeine.15dgrC	37
48	0.mM.caffeine.15dgrC	37
49	0.mM.caffeine.15dgrC	37
50	0.mM.caffeine.15dgrC	37
51	0.mM.caffeine.15dgrC	44
52	0.mM.caffeine.15dgrC	49
53	0.mM.caffeine.15dgrC	52
54	0.mM.caffeine.15dgrC	56
55	0.mM.caffeine.15dgrC	56
56	0.mM.caffeine.15dgrC	56
57	0.mM.caffeine.15dgrC	56
58	0.mM.caffeine.15dgrC	14
59	0.mM.caffeine.15dgrC	23
60	0.mM.caffeine.15dgrC	23
61	0.mM.caffeine.15dgrC	23
62	0.mM.caffeine.15dgrC	30
63	0.mM.caffeine.15dgrC	30
64	0.mM.caffeine.15dgrC	32
65	0.mM.caffeine.15dgrC	32
66	0.mM.caffeine.15dgrC	32
67	0.mM.caffeine.15dgrC	32
68	0.mM.caffeine.15dgrC	32
69	0.mM.caffeine.15dgrC	35
70	0.mM.caffeine.15dgrC	35
71	0.mM.caffeine.15dgrC	35
72	0.mM.caffeine.15dgrC	35
73	0.mM.caffeine.15dgrC	35
74	0.mM.caffeine.15dgrC	35
75	0.mM.caffeine.15dgrC	37
76	0.mM.caffeine.15dgrC	46
77	0.mM.caffeine.15dgrC	46
78	0.mM.caffeine.15dgrC	46
79	0.mM.caffeine.15dgrC	49
80	0.mM.caffeine.15dgrC	52
81	0.mM.caffeine.15dgrC	52
82	0.mM.caffeine.15dgrC	52
83	0.mM.caffeine.15dgrC	56
84	0.mM.caffeine.15dgrC	56
85	0.mM.caffeine.15dgrC	56
86	0.mM.caffeine.15dgrC	56
87	0.mM.caffeine.15dgrC	56
88	0.mM.caffeine.15dgrC	56
