1	hif-1	19
2	hif-1	24
3	hif-1	26
4	hif-1	26
5	hif-1	26
6	hif-1	26
7	hif-1	26
8	hif-1	32
9	hif-1	32
10	hif-1	32
11	hif-1	32
12	hif-1	34
13	hif-1	34
14	hif-1	36
15	hif-1	36
16	hif-1	38
17	hif-1	40
18	hif-1	42
19	hif-1	47
20	hif-1	29
21	hif-1	29
22	hif-1	29
23	hif-1	29
24	hif-1	29
25	hif-1	32
26	hif-1	32
27	hif-1	32
28	hif-1	32
29	hif-1	32
30	hif-1	32
31	hif-1	32
32	hif-1	32
33	hif-1	32
34	hif-1	34
35	hif-1	34
36	hif-1	34
37	hif-1	34
38	hif-1	34
39	hif-1	34
40	hif-1	36
41	hif-1	36
42	hif-1	36
43	hif-1	36
44	hif-1	36
45	hif-1	36
46	hif-1	36
47	hif-1	36
48	hif-1	36
49	hif-1	36
50	hif-1	36
51	hif-1	38
52	hif-1	38
53	hif-1	38
54	hif-1	24
55	hif-1	26
56	hif-1	26
57	hif-1	26
58	hif-1	26
59	hif-1	26
60	hif-1	26
61	hif-1	26
62	hif-1	29
63	hif-1	29
64	hif-1	29
65	hif-1	32
66	hif-1	32
67	hif-1	32
68	hif-1	32
69	hif-1	32
70	hif-1	32
71	hif-1	34
72	hif-1	34
73	hif-1	38
74	hif-1	26
75	hif-1	29
76	hif-1	32
77	hif-1	32
78	hif-1	32
79	hif-1	32
80	hif-1	32
81	hif-1	32
82	hif-1	32
83	hif-1	32
84	hif-1	32
85	hif-1	32
86	hif-1	32
87	hif-1	32
88	hif-1	32
89	hif-1	32
90	hif-1	34
91	hif-1	34
92	hif-1	34
93	hif-1	34
94	hif-1	34
95	hif-1	34
96	hif-1	34
97	hif-1	34
98	hif-1	36
99	hif-1	36
100	hif-1	36
