1	sir-2.1	10
2	sir-2.1	13
3	sir-2.1	13
4	sir-2.1	13
5	sir-2.1	13
6	sir-2.1	13
7	sir-2.1	13
8	sir-2.1	13
9	sir-2.1	13
10	sir-2.1	13
11	sir-2.1	13
12	sir-2.1	13
13	sir-2.1	13
14	sir-2.1	13
15	sir-2.1	13
16	sir-2.1	13
17	sir-2.1	13
18	sir-2.1	15
19	sir-2.1	15
20	sir-2.1	15
21	sir-2.1	15
22	sir-2.1	15
23	sir-2.1	15
24	sir-2.1	15
25	sir-2.1	15
26	sir-2.1	15
27	sir-2.1	15
28	sir-2.1	15
29	sir-2.1	15
30	sir-2.1	15
31	sir-2.1	15
32	sir-2.1	15
33	sir-2.1	15
34	sir-2.1	15
35	sir-2.1	17
36	sir-2.1	17
37	sir-2.1	17
38	sir-2.1	17
39	sir-2.1	17
40	sir-2.1	17
41	sir-2.1	17
42	sir-2.1	17
43	sir-2.1	17
44	sir-2.1	17
45	sir-2.1	17
46	sir-2.1	17
47	sir-2.1	17
48	sir-2.1	17
49	sir-2.1	17
50	sir-2.1	17
51	sir-2.1	17
52	sir-2.1	17
53	sir-2.1	17
54	sir-2.1	19
55	sir-2.1	19
56	sir-2.1	19
57	sir-2.1	19
58	sir-2.1	22
59	sir-2.1	22
60	sir-2.1	22
61	sir-2.1	22
62	sir-2.1	13
63	sir-2.1	13
64	sir-2.1	17
65	sir-2.1	17
66	sir-2.1	19
67	sir-2.1	19
68	sir-2.1	19
69	sir-2.1	10
70	sir-2.1	15
71	sir-2.1	17
72	sir-2.1	10
73	sir-2.1	10
74	sir-2.1	13
75	sir-2.1	13
76	sir-2.1	13
77	sir-2.1	13
78	sir-2.1	13
79	sir-2.1	13
80	sir-2.1	13
81	sir-2.1	13
82	sir-2.1	13
83	sir-2.1	13
84	sir-2.1	13
85	sir-2.1	15
86	sir-2.1	15
87	sir-2.1	15
88	sir-2.1	15
89	sir-2.1	15
90	sir-2.1	15
91	sir-2.1	15
92	sir-2.1	15
93	sir-2.1	15
94	sir-2.1	15
95	sir-2.1	17
96	sir-2.1	17
97	sir-2.1	17
98	sir-2.1	17
99	sir-2.1	17
100	sir-2.1	17
101	sir-2.1	17
102	sir-2.1	17
103	sir-2.1	17
104	sir-2.1	17
105	sir-2.1	17
106	sir-2.1	17
107	sir-2.1	17
108	sir-2.1	17
109	sir-2.1	17
110	sir-2.1	17
111	sir-2.1	17
112	sir-2.1	17
113	sir-2.1	17
114	sir-2.1	17
115	sir-2.1	17
116	sir-2.1	19
117	sir-2.1	19
118	sir-2.1	19
119	sir-2.1	19
120	sir-2.1	19
121	sir-2.1	22
122	sir-2.1	22
123	sir-2.1	22
124	sir-2.1	13
125	sir-2.1	13
126	sir-2.1	13
127	sir-2.1	17
128	sir-2.1	17
129	sir-2.1	19
130	sir-2.1	19
131	sir-2.1	22
132	sir-2.1	17
133	sir-2.1	10
