1	fmo-2	19
2	fmo-2	19
3	fmo-2	19
4	fmo-2	19
5	fmo-2	19
6	fmo-2	21
7	fmo-2	21
8	fmo-2	21
9	fmo-2	21
10	fmo-2	21
11	fmo-2	21
12	fmo-2	23
13	fmo-2	23
14	fmo-2	23
15	fmo-2	23
16	fmo-2	23
17	fmo-2	23
18	fmo-2	23
19	fmo-2	23
20	fmo-2	23
21	fmo-2	23
22	fmo-2	23
23	fmo-2	26
24	fmo-2	26
25	fmo-2	26
26	fmo-2	26
27	fmo-2	26
28	fmo-2	26
29	fmo-2	28
30	fmo-2	28
31	fmo-2	28
32	fmo-2	28
33	fmo-2	28
34	fmo-2	28
35	fmo-2	28
36	fmo-2	28
37	fmo-2	28
38	fmo-2	28
39	fmo-2	30
40	fmo-2	30
41	fmo-2	30
42	fmo-2	30
43	fmo-2	30
44	fmo-2	30
45	fmo-2	30
46	fmo-2	30
47	fmo-2	30
48	fmo-2	30
49	fmo-2	30
50	fmo-2	33
51	fmo-2	33
52	fmo-2	33
53	fmo-2	33
54	fmo-2	33
55	fmo-2	33
56	fmo-2	33
57	fmo-2	33
58	fmo-2	33
59	fmo-2	35
60	fmo-2	37
61	fmo-2	37
62	fmo-2	16
63	fmo-2	19
64	fmo-2	19
65	fmo-2	19
66	fmo-2	19
67	fmo-2	19
68	fmo-2	21
69	fmo-2	21
70	fmo-2	21
71	fmo-2	26
72	fmo-2	16
73	fmo-2	16
