1	vhl-1	14
2	vhl-1	14
3	vhl-1	14
4	vhl-1	16
5	vhl-1	17
6	vhl-1	20
7	vhl-1	20
8	vhl-1	20
9	vhl-1	20
10	vhl-1	20
11	vhl-1	22
12	vhl-1	22
13	vhl-1	22
14	vhl-1	22
15	vhl-1	24
16	vhl-1	24
17	vhl-1	24
18	vhl-1	24
19	vhl-1	24
20	vhl-1	24
21	vhl-1	24
22	vhl-1	24
23	vhl-1	24
24	vhl-1	24
25	vhl-1	24
26	vhl-1	24
27	vhl-1	24
28	vhl-1	27
29	vhl-1	27
30	vhl-1	27
31	vhl-1	27
32	vhl-1	27
33	vhl-1	29
34	vhl-1	33
35	vhl-1	17
36	vhl-1	20
37	vhl-1	20
38	vhl-1	20
39	vhl-1	20
40	vhl-1	20
41	vhl-1	20
42	vhl-1	22
43	vhl-1	22
44	vhl-1	22
45	vhl-1	22
46	vhl-1	22
47	vhl-1	22
48	vhl-1	24
49	vhl-1	24
50	vhl-1	24
51	vhl-1	24
52	vhl-1	24
53	vhl-1	24
54	vhl-1	24
55	vhl-1	24
56	vhl-1	24
57	vhl-1	24
58	vhl-1	24
59	vhl-1	27
60	vhl-1	27
61	vhl-1	27
62	vhl-1	27
63	vhl-1	27
64	vhl-1	29
65	vhl-1	29
