1	N2.FMO-2.(RNAi)	13
2	N2.FMO-2.(RNAi)	13
3	N2.FMO-2.(RNAi)	16
4	N2.FMO-2.(RNAi)	16
5	N2.FMO-2.(RNAi)	16
6	N2.FMO-2.(RNAi)	16
7	N2.FMO-2.(RNAi)	16
8	N2.FMO-2.(RNAi)	23
9	N2.FMO-2.(RNAi)	28
10	N2.FMO-2.(RNAi)	28
11	N2.FMO-2.(RNAi)	16
12	N2.FMO-2.(RNAi)	23
13	N2.FMO-2.(RNAi)	16
14	N2.FMO-2.(RNAi)	19
15	N2.FMO-2.(RNAi)	19
16	N2.FMO-2.(RNAi)	19
17	N2.FMO-2.(RNAi)	19
18	N2.FMO-2.(RNAi)	19
19	N2.FMO-2.(RNAi)	19
20	N2.FMO-2.(RNAi)	19
21	N2.FMO-2.(RNAi)	19
22	N2.FMO-2.(RNAi)	21
23	N2.FMO-2.(RNAi)	21
24	N2.FMO-2.(RNAi)	21
25	N2.FMO-2.(RNAi)	21
26	N2.FMO-2.(RNAi)	21
27	N2.FMO-2.(RNAi)	21
28	N2.FMO-2.(RNAi)	21
29	N2.FMO-2.(RNAi)	21
30	N2.FMO-2.(RNAi)	21
31	N2.FMO-2.(RNAi)	23
32	N2.FMO-2.(RNAi)	23
33	N2.FMO-2.(RNAi)	26
34	N2.FMO-2.(RNAi)	28
35	N2.FMO-2.(RNAi)	28
36	N2.FMO-2.(RNAi)	28
37	N2.FMO-2.(RNAi)	28
38	N2.FMO-2.(RNAi)	16
39	N2.FMO-2.(RNAi)	16
40	N2.FMO-2.(RNAi)	16
41	N2.FMO-2.(RNAi)	19
42	N2.FMO-2.(RNAi)	19
43	N2.FMO-2.(RNAi)	21
44	N2.FMO-2.(RNAi)	13
45	N2.FMO-2.(RNAi)	13
46	N2.FMO-2.(RNAi)	13
47	N2.FMO-2.(RNAi)	13
48	N2.FMO-2.(RNAi)	16
49	N2.FMO-2.(RNAi)	16
50	N2.FMO-2.(RNAi)	16
51	N2.FMO-2.(RNAi)	16
52	N2.FMO-2.(RNAi)	16
53	N2.FMO-2.(RNAi)	21
54	N2.FMO-2.(RNAi)	23
55	N2.FMO-2.(RNAi)	23
56	N2.FMO-2.(RNAi)	26
57	N2.FMO-2.(RNAi)	35
58	N2.FMO-2.(RNAi)	16
59	N2.FMO-2.(RNAi)	16
60	N2.FMO-2.(RNAi)	13
61	N2.FMO-2.(RNAi)	13
62	N2.FMO-2.(RNAi)	16
63	N2.FMO-2.(RNAi)	16
64	N2.FMO-2.(RNAi)	16
65	N2.FMO-2.(RNAi)	16
66	N2.FMO-2.(RNAi)	16
67	N2.FMO-2.(RNAi)	19
68	N2.FMO-2.(RNAi)	19
69	N2.FMO-2.(RNAi)	19
70	N2.FMO-2.(RNAi)	19
71	N2.FMO-2.(RNAi)	19
72	N2.FMO-2.(RNAi)	19
73	N2.FMO-2.(RNAi)	19
74	N2.FMO-2.(RNAi)	19
75	N2.FMO-2.(RNAi)	19
76	N2.FMO-2.(RNAi)	19
77	N2.FMO-2.(RNAi)	19
78	N2.FMO-2.(RNAi)	19
79	N2.FMO-2.(RNAi)	19
80	N2.FMO-2.(RNAi)	19
81	N2.FMO-2.(RNAi)	19
82	N2.FMO-2.(RNAi)	19
83	N2.FMO-2.(RNAi)	19
84	N2.FMO-2.(RNAi)	19
85	N2.FMO-2.(RNAi)	19
86	N2.FMO-2.(RNAi)	19
87	N2.FMO-2.(RNAi)	19
88	N2.FMO-2.(RNAi)	19
89	N2.FMO-2.(RNAi)	19
90	N2.FMO-2.(RNAi)	19
91	N2.FMO-2.(RNAi)	19
92	N2.FMO-2.(RNAi)	19
93	N2.FMO-2.(RNAi)	19
94	N2.FMO-2.(RNAi)	19
95	N2.FMO-2.(RNAi)	19
96	N2.FMO-2.(RNAi)	19
97	N2.FMO-2.(RNAi)	19
98	N2.FMO-2.(RNAi)	19
99	N2.FMO-2.(RNAi)	19
100	N2.FMO-2.(RNAi)	21
101	N2.FMO-2.(RNAi)	21
102	N2.FMO-2.(RNAi)	21
103	N2.FMO-2.(RNAi)	21
104	N2.FMO-2.(RNAi)	21
105	N2.FMO-2.(RNAi)	21
106	N2.FMO-2.(RNAi)	21
107	N2.FMO-2.(RNAi)	21
108	N2.FMO-2.(RNAi)	21
109	N2.FMO-2.(RNAi)	21
110	N2.FMO-2.(RNAi)	21
111	N2.FMO-2.(RNAi)	21
112	N2.FMO-2.(RNAi)	21
113	N2.FMO-2.(RNAi)	21
114	N2.FMO-2.(RNAi)	21
115	N2.FMO-2.(RNAi)	23
116	N2.FMO-2.(RNAi)	23
117	N2.FMO-2.(RNAi)	23
118	N2.FMO-2.(RNAi)	26
119	N2.FMO-2.(RNAi)	26
120	N2.FMO-2.(RNAi)	28
121	N2.FMO-2.(RNAi)	30
122	N2.FMO-2.(RNAi)	16
123	N2.FMO-2.(RNAi)	16
124	N2.FMO-2.(RNAi)	16
125	N2.FMO-2.(RNAi)	19
126	N2.FMO-2.(RNAi)	19
