1	N2.rpl-9(RNAi)	14
2	N2.rpl-9(RNAi)	14
3	N2.rpl-9(RNAi)	16
4	N2.rpl-9(RNAi)	21
5	N2.rpl-9(RNAi)	21
6	N2.rpl-9(RNAi)	21
7	N2.rpl-9(RNAi)	21
8	N2.rpl-9(RNAi)	21
9	N2.rpl-9(RNAi)	21
10	N2.rpl-9(RNAi)	21
11	N2.rpl-9(RNAi)	21
12	N2.rpl-9(RNAi)	21
13	N2.rpl-9(RNAi)	21
14	N2.rpl-9(RNAi)	21
15	N2.rpl-9(RNAi)	23
16	N2.rpl-9(RNAi)	23
17	N2.rpl-9(RNAi)	23
18	N2.rpl-9(RNAi)	23
19	N2.rpl-9(RNAi)	23
20	N2.rpl-9(RNAi)	23
21	N2.rpl-9(RNAi)	23
22	N2.rpl-9(RNAi)	23
23	N2.rpl-9(RNAi)	23
24	N2.rpl-9(RNAi)	23
25	N2.rpl-9(RNAi)	23
26	N2.rpl-9(RNAi)	23
27	N2.rpl-9(RNAi)	23
28	N2.rpl-9(RNAi)	23
29	N2.rpl-9(RNAi)	23
30	N2.rpl-9(RNAi)	23
31	N2.rpl-9(RNAi)	23
32	N2.rpl-9(RNAi)	23
33	N2.rpl-9(RNAi)	23
34	N2.rpl-9(RNAi)	23
35	N2.rpl-9(RNAi)	23
36	N2.rpl-9(RNAi)	23
37	N2.rpl-9(RNAi)	23
38	N2.rpl-9(RNAi)	23
39	N2.rpl-9(RNAi)	23
40	N2.rpl-9(RNAi)	25
41	N2.rpl-9(RNAi)	25
42	N2.rpl-9(RNAi)	25
43	N2.rpl-9(RNAi)	25
44	N2.rpl-9(RNAi)	25
45	N2.rpl-9(RNAi)	25
46	N2.rpl-9(RNAi)	25
47	N2.rpl-9(RNAi)	25
48	N2.rpl-9(RNAi)	25
49	N2.rpl-9(RNAi)	25
50	N2.rpl-9(RNAi)	25
51	N2.rpl-9(RNAi)	25
52	N2.rpl-9(RNAi)	27
53	N2.rpl-9(RNAi)	27
54	N2.rpl-9(RNAi)	27
55	N2.rpl-9(RNAi)	27
56	N2.rpl-9(RNAi)	14
57	N2.rpl-9(RNAi)	14
58	N2.rpl-9(RNAi)	14
59	N2.rpl-9(RNAi)	14
60	N2.rpl-9(RNAi)	14
61	N2.rpl-9(RNAi)	14
62	N2.rpl-9(RNAi)	14
63	N2.rpl-9(RNAi)	14
64	N2.rpl-9(RNAi)	14
65	N2.rpl-9(RNAi)	14
66	N2.rpl-9(RNAi)	16
67	N2.rpl-9(RNAi)	16
68	N2.rpl-9(RNAi)	16
69	N2.rpl-9(RNAi)	16
70	N2.rpl-9(RNAi)	16
71	N2.rpl-9(RNAi)	16
72	N2.rpl-9(RNAi)	16
73	N2.rpl-9(RNAi)	16
74	N2.rpl-9(RNAi)	16
75	N2.rpl-9(RNAi)	16
76	N2.rpl-9(RNAi)	16
77	N2.rpl-9(RNAi)	16
78	N2.rpl-9(RNAi)	18
79	N2.rpl-9(RNAi)	18
80	N2.rpl-9(RNAi)	18
81	N2.rpl-9(RNAi)	21
82	N2.rpl-9(RNAi)	21
83	N2.rpl-9(RNAi)	25
84	N2.rpl-9(RNAi)	25
85	N2.rpl-9(RNAi)	14
86	N2.rpl-9(RNAi)	14
87	N2.rpl-9(RNAi)	14
88	N2.rpl-9(RNAi)	14
89	N2.rpl-9(RNAi)	14
90	N2.rpl-9(RNAi)	14
91	N2.rpl-9(RNAi)	14
92	N2.rpl-9(RNAi)	14
93	N2.rpl-9(RNAi)	14
94	N2.rpl-9(RNAi)	16
95	N2.rpl-9(RNAi)	16
96	N2.rpl-9(RNAi)	16
97	N2.rpl-9(RNAi)	18
98	N2.rpl-9(RNAi)	18
99	N2.rpl-9(RNAi)	21
100	N2.rpl-9(RNAi)	21
101	N2.rpl-9(RNAi)	21
102	N2.rpl-9(RNAi)	21
103	N2.rpl-9(RNAi)	23
104	N2.rpl-9(RNAi)	23
105	N2.rpl-9(RNAi)	23
106	N2.rpl-9(RNAi)	23
107	N2.rpl-9(RNAi)	23
108	N2.rpl-9(RNAi)	23
109	N2.rpl-9(RNAi)	23
110	N2.rpl-9(RNAi)	23
111	N2.rpl-9(RNAi)	23
112	N2.rpl-9(RNAi)	23
113	N2.rpl-9(RNAi)	23
114	N2.rpl-9(RNAi)	23
115	N2.rpl-9(RNAi)	25
116	N2.rpl-9(RNAi)	25
117	N2.rpl-9(RNAi)	25
118	N2.rpl-9(RNAi)	25
119	N2.rpl-9(RNAi)	25
120	N2.rpl-9(RNAi)	25
121	N2.rpl-9(RNAi)	25
122	N2.rpl-9(RNAi)	25
123	N2.rpl-9(RNAi)	25
124	N2.rpl-9(RNAi)	25
125	N2.rpl-9(RNAi)	25
126	N2.rpl-9(RNAi)	25
127	N2.rpl-9(RNAi)	25
128	N2.rpl-9(RNAi)	25
129	N2.rpl-9(RNAi)	27
130	N2.rpl-9(RNAi)	27
131	N2.rpl-9(RNAi)	27
132	N2.rpl-9(RNAi)	27
133	N2.rpl-9(RNAi)	27
134	N2.rpl-9(RNAi)	27
135	N2.rpl-9(RNAi)	27
136	N2.rpl-9(RNAi)	27
137	N2.rpl-9(RNAi)	27
138	N2.rpl-9(RNAi)	27
139	N2.rpl-9(RNAi)	27
140	N2.rpl-9(RNAi)	27
141	N2.rpl-9(RNAi)	29
142	N2.rpl-9(RNAi)	29
143	N2.rpl-9(RNAi)	10
144	N2.rpl-9(RNAi)	14
145	N2.rpl-9(RNAi)	14
146	N2.rpl-9(RNAi)	14
147	N2.rpl-9(RNAi)	14
148	N2.rpl-9(RNAi)	14
149	N2.rpl-9(RNAi)	14
150	N2.rpl-9(RNAi)	14
151	N2.rpl-9(RNAi)	14
152	N2.rpl-9(RNAi)	14
153	N2.rpl-9(RNAi)	14
154	N2.rpl-9(RNAi)	14
155	N2.rpl-9(RNAi)	16
156	N2.rpl-9(RNAi)	16
157	N2.rpl-9(RNAi)	16
158	N2.rpl-9(RNAi)	16
159	N2.rpl-9(RNAi)	16
160	N2.rpl-9(RNAi)	16
161	N2.rpl-9(RNAi)	16
162	N2.rpl-9(RNAi)	16
163	N2.rpl-9(RNAi)	18
164	N2.rpl-9(RNAi)	18
165	N2.rpl-9(RNAi)	18
166	N2.rpl-9(RNAi)	18
167	N2.rpl-9(RNAi)	21
168	N2.rpl-9(RNAi)	21
169	N2.rpl-9(RNAi)	21
170	N2.rpl-9(RNAi)	21
171	N2.rpl-9(RNAi)	23
172	N2.rpl-9(RNAi)	14
173	N2.rpl-9(RNAi)	14
174	N2.rpl-9(RNAi)	14
175	N2.rpl-9(RNAi)	14
176	N2.rpl-9(RNAi)	14
177	N2.rpl-9(RNAi)	14
178	N2.rpl-9(RNAi)	16
179	N2.rpl-9(RNAi)	16
