1	hif-1	12
2	hif-1	14
3	hif-1	15
4	hif-1	15
5	hif-1	17
6	hif-1	17
7	hif-1	17
8	hif-1	17
9	hif-1	17
10	hif-1	19
11	hif-1	19
12	hif-1	19
13	hif-1	19
14	hif-1	19
15	hif-1	19
16	hif-1	19
17	hif-1	21
18	hif-1	21
19	hif-1	21
20	hif-1	21
21	hif-1	21
22	hif-1	21
23	hif-1	21
24	hif-1	21
25	hif-1	21
26	hif-1	21
27	hif-1	21
28	hif-1	24
29	hif-1	24
30	hif-1	24
31	hif-1	24
32	hif-1	24
33	hif-1	24
34	hif-1	24
35	hif-1	24
36	hif-1	24
37	hif-1	24
38	hif-1	24
39	hif-1	24
40	hif-1	24
41	hif-1	24
42	hif-1	26
43	hif-1	26
44	hif-1	26
45	hif-1	26
46	hif-1	26
47	hif-1	26
48	hif-1	29
49	hif-1	29
50	hif-1	29
51	hif-1	29
52	hif-1	29
53	hif-1	12
54	hif-1	14
55	hif-1	14
56	hif-1	14
57	hif-1	15
58	hif-1	15
59	hif-1	17
60	hif-1	17
61	hif-1	17
62	hif-1	17
63	hif-1	17
64	hif-1	17
65	hif-1	17
66	hif-1	17
67	hif-1	17
68	hif-1	17
69	hif-1	19
70	hif-1	19
71	hif-1	19
72	hif-1	19
73	hif-1	19
74	hif-1	19
75	hif-1	19
76	hif-1	19
77	hif-1	19
78	hif-1	19
79	hif-1	19
80	hif-1	19
81	hif-1	19
82	hif-1	19
83	hif-1	19
84	hif-1	19
85	hif-1	19
86	hif-1	19
87	hif-1	21
88	hif-1	21
89	hif-1	21
90	hif-1	21
91	hif-1	21
92	hif-1	21
93	hif-1	21
94	hif-1	21
95	hif-1	21
96	hif-1	21
97	hif-1	21
98	hif-1	24
99	hif-1	24
100	hif-1	24
101	hif-1	24
102	hif-1	24
103	hif-1	24
104	hif-1	24
105	hif-1	24
106	hif-1	24
107	hif-1	24
108	hif-1	24
109	hif-1	24
110	hif-1	24
111	hif-1	24
112	hif-1	24
113	hif-1	24
114	hif-1	24
115	hif-1	26
116	hif-1	26
117	hif-1	26
118	hif-1	26
119	hif-1	26
120	hif-1	29
121	hif-1	29
122	hif-1	29
