1	5.mM.caffeine	8
2	5.mM.caffeine	13
3	5.mM.caffeine	20
4	5.mM.caffeine	20
5	5.mM.caffeine	20
6	5.mM.caffeine	20
7	5.mM.caffeine	20
8	5.mM.caffeine	22
9	5.mM.caffeine	22
10	5.mM.caffeine	22
11	5.mM.caffeine	24
12	5.mM.caffeine	24
13	5.mM.caffeine	24
14	5.mM.caffeine	27
15	5.mM.caffeine	27
16	5.mM.caffeine	29
17	5.mM.caffeine	29
18	5.mM.caffeine	29
19	5.mM.caffeine	29
20	5.mM.caffeine	31
21	5.mM.caffeine	31
22	5.mM.caffeine	31
23	5.mM.caffeine	31
24	5.mM.caffeine	31
25	5.mM.caffeine	34
26	5.mM.caffeine	34
27	5.mM.caffeine	34
28	5.mM.caffeine	59
29	5.mM.caffeine	59
30	5.mM.caffeine	59
31	5.mM.caffeine	12
32	5.mM.caffeine	17
33	5.mM.caffeine	24
34	5.mM.caffeine	24
35	5.mM.caffeine	24
36	5.mM.caffeine	24
37	5.mM.caffeine	24
38	5.mM.caffeine	26
39	5.mM.caffeine	26
40	5.mM.caffeine	26
41	5.mM.caffeine	28
42	5.mM.caffeine	28
43	5.mM.caffeine	28
44	5.mM.caffeine	31
45	5.mM.caffeine	31
46	5.mM.caffeine	33
47	5.mM.caffeine	33
48	5.mM.caffeine	33
49	5.mM.caffeine	33
50	5.mM.caffeine	35
51	5.mM.caffeine	35
52	5.mM.caffeine	35
53	5.mM.caffeine	35
54	5.mM.caffeine	35
55	5.mM.caffeine	38
56	5.mM.caffeine	38
57	5.mM.caffeine	38
58	5.mM.caffeine	63
59	5.mM.caffeine	63
