1	WT.rpl-9(RNAi).15dgrC	17
2	WT.rpl-9(RNAi).15dgrC	19
3	WT.rpl-9(RNAi).15dgrC	19
4	WT.rpl-9(RNAi).15dgrC	19
5	WT.rpl-9(RNAi).15dgrC	22
6	WT.rpl-9(RNAi).15dgrC	22
7	WT.rpl-9(RNAi).15dgrC	22
8	WT.rpl-9(RNAi).15dgrC	22
9	WT.rpl-9(RNAi).15dgrC	22
10	WT.rpl-9(RNAi).15dgrC	22
11	WT.rpl-9(RNAi).15dgrC	22
12	WT.rpl-9(RNAi).15dgrC	22
13	WT.rpl-9(RNAi).15dgrC	22
14	WT.rpl-9(RNAi).15dgrC	24
15	WT.rpl-9(RNAi).15dgrC	24
16	WT.rpl-9(RNAi).15dgrC	24
17	WT.rpl-9(RNAi).15dgrC	24
18	WT.rpl-9(RNAi).15dgrC	27
19	WT.rpl-9(RNAi).15dgrC	31
20	WT.rpl-9(RNAi).15dgrC	17
21	WT.rpl-9(RNAi).15dgrC	17
22	WT.rpl-9(RNAi).15dgrC	17
23	WT.rpl-9(RNAi).15dgrC	19
24	WT.rpl-9(RNAi).15dgrC	19
25	WT.rpl-9(RNAi).15dgrC	19
26	WT.rpl-9(RNAi).15dgrC	19
27	WT.rpl-9(RNAi).15dgrC	19
28	WT.rpl-9(RNAi).15dgrC	19
29	WT.rpl-9(RNAi).15dgrC	19
30	WT.rpl-9(RNAi).15dgrC	19
31	WT.rpl-9(RNAi).15dgrC	19
32	WT.rpl-9(RNAi).15dgrC	19
33	WT.rpl-9(RNAi).15dgrC	22
34	WT.rpl-9(RNAi).15dgrC	22
35	WT.rpl-9(RNAi).15dgrC	22
36	WT.rpl-9(RNAi).15dgrC	22
37	WT.rpl-9(RNAi).15dgrC	22
38	WT.rpl-9(RNAi).15dgrC	22
39	WT.rpl-9(RNAi).15dgrC	22
40	WT.rpl-9(RNAi).15dgrC	24
41	WT.rpl-9(RNAi).15dgrC	24
42	WT.rpl-9(RNAi).15dgrC	24
43	WT.rpl-9(RNAi).15dgrC	27
44	WT.rpl-9(RNAi).15dgrC	27
45	WT.rpl-9(RNAi).15dgrC	33
46	WT.rpl-9(RNAi).15dgrC	14
47	WT.rpl-9(RNAi).15dgrC	17
48	WT.rpl-9(RNAi).15dgrC	17
49	WT.rpl-9(RNAi).15dgrC	19
50	WT.rpl-9(RNAi).15dgrC	19
51	WT.rpl-9(RNAi).15dgrC	19
52	WT.rpl-9(RNAi).15dgrC	22
53	WT.rpl-9(RNAi).15dgrC	22
54	WT.rpl-9(RNAi).15dgrC	24
55	WT.rpl-9(RNAi).15dgrC	17
56	WT.rpl-9(RNAi).15dgrC	17
57	WT.rpl-9(RNAi).15dgrC	17
58	WT.rpl-9(RNAi).15dgrC	17
59	WT.rpl-9(RNAi).15dgrC	19
60	WT.rpl-9(RNAi).15dgrC	19
61	WT.rpl-9(RNAi).15dgrC	19
62	WT.rpl-9(RNAi).15dgrC	19
63	WT.rpl-9(RNAi).15dgrC	19
64	WT.rpl-9(RNAi).15dgrC	22
65	WT.rpl-9(RNAi).15dgrC	22
66	WT.rpl-9(RNAi).15dgrC	22
67	WT.rpl-9(RNAi).15dgrC	22
68	WT.rpl-9(RNAi).15dgrC	22
69	WT.rpl-9(RNAi).15dgrC	22
70	WT.rpl-9(RNAi).15dgrC	22
71	WT.rpl-9(RNAi).15dgrC	22
72	WT.rpl-9(RNAi).15dgrC	22
73	WT.rpl-9(RNAi).15dgrC	22
74	WT.rpl-9(RNAi).15dgrC	22
75	WT.rpl-9(RNAi).15dgrC	22
76	WT.rpl-9(RNAi).15dgrC	22
77	WT.rpl-9(RNAi).15dgrC	22
78	WT.rpl-9(RNAi).15dgrC	22
79	WT.rpl-9(RNAi).15dgrC	22
80	WT.rpl-9(RNAi).15dgrC	22
81	WT.rpl-9(RNAi).15dgrC	22
82	WT.rpl-9(RNAi).15dgrC	22
83	WT.rpl-9(RNAi).15dgrC	22
84	WT.rpl-9(RNAi).15dgrC	22
85	WT.rpl-9(RNAi).15dgrC	22
86	WT.rpl-9(RNAi).15dgrC	22
87	WT.rpl-9(RNAi).15dgrC	22
88	WT.rpl-9(RNAi).15dgrC	24
89	WT.rpl-9(RNAi).15dgrC	24
90	WT.rpl-9(RNAi).15dgrC	24
91	WT.rpl-9(RNAi).15dgrC	24
92	WT.rpl-9(RNAi).15dgrC	24
93	WT.rpl-9(RNAi).15dgrC	24
94	WT.rpl-9(RNAi).15dgrC	27
