1	WT.rpl-9(RNAi)	12
2	WT.rpl-9(RNAi)	16
3	WT.rpl-9(RNAi)	16
4	WT.rpl-9(RNAi)	16
5	WT.rpl-9(RNAi)	16
6	WT.rpl-9(RNAi)	16
7	WT.rpl-9(RNAi)	18
8	WT.rpl-9(RNAi)	18
9	WT.rpl-9(RNAi)	18
10	WT.rpl-9(RNAi)	18
11	WT.rpl-9(RNAi)	18
12	WT.rpl-9(RNAi)	18
13	WT.rpl-9(RNAi)	21
14	WT.rpl-9(RNAi)	21
15	WT.rpl-9(RNAi)	21
16	WT.rpl-9(RNAi)	21
17	WT.rpl-9(RNAi)	21
18	WT.rpl-9(RNAi)	21
19	WT.rpl-9(RNAi)	21
20	WT.rpl-9(RNAi)	21
21	WT.rpl-9(RNAi)	21
22	WT.rpl-9(RNAi)	21
23	WT.rpl-9(RNAi)	21
24	WT.rpl-9(RNAi)	21
25	WT.rpl-9(RNAi)	21
26	WT.rpl-9(RNAi)	21
27	WT.rpl-9(RNAi)	21
28	WT.rpl-9(RNAi)	21
29	WT.rpl-9(RNAi)	21
30	WT.rpl-9(RNAi)	21
31	WT.rpl-9(RNAi)	21
32	WT.rpl-9(RNAi)	21
33	WT.rpl-9(RNAi)	24
34	WT.rpl-9(RNAi)	24
35	WT.rpl-9(RNAi)	24
36	WT.rpl-9(RNAi)	24
37	WT.rpl-9(RNAi)	24
38	WT.rpl-9(RNAi)	24
39	WT.rpl-9(RNAi)	24
40	WT.rpl-9(RNAi)	24
41	WT.rpl-9(RNAi)	24
42	WT.rpl-9(RNAi)	24
43	WT.rpl-9(RNAi)	24
44	WT.rpl-9(RNAi)	24
45	WT.rpl-9(RNAi)	24
46	WT.rpl-9(RNAi)	24
47	WT.rpl-9(RNAi)	24
48	WT.rpl-9(RNAi)	24
49	WT.rpl-9(RNAi)	24
50	WT.rpl-9(RNAi)	26
51	WT.rpl-9(RNAi)	26
52	WT.rpl-9(RNAi)	26
53	WT.rpl-9(RNAi)	26
54	WT.rpl-9(RNAi)	29
55	WT.rpl-9(RNAi)	29
56	WT.rpl-9(RNAi)	31
57	WT.rpl-9(RNAi)	10
58	WT.rpl-9(RNAi)	12
59	WT.rpl-9(RNAi)	12
60	WT.rpl-9(RNAi)	16
61	WT.rpl-9(RNAi)	16
62	WT.rpl-9(RNAi)	16
63	WT.rpl-9(RNAi)	16
64	WT.rpl-9(RNAi)	16
65	WT.rpl-9(RNAi)	18
66	WT.rpl-9(RNAi)	21
67	WT.rpl-9(RNAi)	21
68	WT.rpl-9(RNAi)	21
69	WT.rpl-9(RNAi)	21
