1	N2.NUO-2(RNAi)	7
2	N2.NUO-2(RNAi)	9
3	N2.NUO-2(RNAi)	9
4	N2.NUO-2(RNAi)	9
5	N2.NUO-2(RNAi)	9
6	N2.NUO-2(RNAi)	9
7	N2.NUO-2(RNAi)	9
8	N2.NUO-2(RNAi)	10
9	N2.NUO-2(RNAi)	10
10	N2.NUO-2(RNAi)	10
11	N2.NUO-2(RNAi)	12
12	N2.NUO-2(RNAi)	12
13	N2.NUO-2(RNAi)	12
14	N2.NUO-2(RNAi)	12
15	N2.NUO-2(RNAi)	12
16	N2.NUO-2(RNAi)	12
17	N2.NUO-2(RNAi)	12
18	N2.NUO-2(RNAi)	12
19	N2.NUO-2(RNAi)	12
20	N2.NUO-2(RNAi)	12
21	N2.NUO-2(RNAi)	12
22	N2.NUO-2(RNAi)	12
23	N2.NUO-2(RNAi)	12
24	N2.NUO-2(RNAi)	12
25	N2.NUO-2(RNAi)	12
26	N2.NUO-2(RNAi)	12
27	N2.NUO-2(RNAi)	12
28	N2.NUO-2(RNAi)	13
29	N2.NUO-2(RNAi)	13
30	N2.NUO-2(RNAi)	13
31	N2.NUO-2(RNAi)	13
32	N2.NUO-2(RNAi)	13
33	N2.NUO-2(RNAi)	13
34	N2.NUO-2(RNAi)	13
35	N2.NUO-2(RNAi)	13
36	N2.NUO-2(RNAi)	13
37	N2.NUO-2(RNAi)	13
38	N2.NUO-2(RNAi)	13
39	N2.NUO-2(RNAi)	14
40	N2.NUO-2(RNAi)	14
41	N2.NUO-2(RNAi)	14
42	N2.NUO-2(RNAi)	14
43	N2.NUO-2(RNAi)	14
44	N2.NUO-2(RNAi)	14
45	N2.NUO-2(RNAi)	14
46	N2.NUO-2(RNAi)	14
47	N2.NUO-2(RNAi)	14
48	N2.NUO-2(RNAi)	14
49	N2.NUO-2(RNAi)	14
50	N2.NUO-2(RNAi)	14
51	N2.NUO-2(RNAi)	14
52	N2.NUO-2(RNAi)	14
53	N2.NUO-2(RNAi)	14
54	N2.NUO-2(RNAi)	16
55	N2.NUO-2(RNAi)	16
56	N2.NUO-2(RNAi)	16
57	N2.NUO-2(RNAi)	16
58	N2.NUO-2(RNAi)	16
59	N2.NUO-2(RNAi)	16
60	N2.NUO-2(RNAi)	16
61	N2.NUO-2(RNAi)	16
62	N2.NUO-2(RNAi)	16
63	N2.NUO-2(RNAi)	16
64	N2.NUO-2(RNAi)	16
65	N2.NUO-2(RNAi)	16
66	N2.NUO-2(RNAi)	16
67	N2.NUO-2(RNAi)	16
68	N2.NUO-2(RNAi)	16
69	N2.NUO-2(RNAi)	16
70	N2.NUO-2(RNAi)	16
71	N2.NUO-2(RNAi)	16
72	N2.NUO-2(RNAi)	16
73	N2.NUO-2(RNAi)	16
74	N2.NUO-2(RNAi)	16
75	N2.NUO-2(RNAi)	16
76	N2.NUO-2(RNAi)	16
77	N2.NUO-2(RNAi)	17
78	N2.NUO-2(RNAi)	17
79	N2.NUO-2(RNAi)	17
80	N2.NUO-2(RNAi)	19
81	N2.NUO-2(RNAi)	19
82	N2.NUO-2(RNAi)	7
83	N2.NUO-2(RNAi)	9
84	N2.NUO-2(RNAi)	10
85	N2.NUO-2(RNAi)	10
86	N2.NUO-2(RNAi)	10
87	N2.NUO-2(RNAi)	10
88	N2.NUO-2(RNAi)	12
89	N2.NUO-2(RNAi)	12
90	N2.NUO-2(RNAi)	12
91	N2.NUO-2(RNAi)	12
92	N2.NUO-2(RNAi)	12
93	N2.NUO-2(RNAi)	12
94	N2.NUO-2(RNAi)	12
95	N2.NUO-2(RNAi)	12
96	N2.NUO-2(RNAi)	12
97	N2.NUO-2(RNAi)	12
98	N2.NUO-2(RNAi)	12
99	N2.NUO-2(RNAi)	12
100	N2.NUO-2(RNAi)	13
101	N2.NUO-2(RNAi)	13
102	N2.NUO-2(RNAi)	13
103	N2.NUO-2(RNAi)	13
104	N2.NUO-2(RNAi)	13
105	N2.NUO-2(RNAi)	13
106	N2.NUO-2(RNAi)	13
107	N2.NUO-2(RNAi)	13
108	N2.NUO-2(RNAi)	13
109	N2.NUO-2(RNAi)	13
110	N2.NUO-2(RNAi)	14
111	N2.NUO-2(RNAi)	14
112	N2.NUO-2(RNAi)	14
113	N2.NUO-2(RNAi)	14
114	N2.NUO-2(RNAi)	14
115	N2.NUO-2(RNAi)	14
116	N2.NUO-2(RNAi)	14
117	N2.NUO-2(RNAi)	14
118	N2.NUO-2(RNAi)	14
119	N2.NUO-2(RNAi)	14
120	N2.NUO-2(RNAi)	16
121	N2.NUO-2(RNAi)	16
122	N2.NUO-2(RNAi)	16
123	N2.NUO-2(RNAi)	16
124	N2.NUO-2(RNAi)	16
125	N2.NUO-2(RNAi)	16
126	N2.NUO-2(RNAi)	16
127	N2.NUO-2(RNAi)	16
128	N2.NUO-2(RNAi)	16
129	N2.NUO-2(RNAi)	16
130	N2.NUO-2(RNAi)	16
131	N2.NUO-2(RNAi)	16
132	N2.NUO-2(RNAi)	16
133	N2.NUO-2(RNAi)	16
134	N2.NUO-2(RNAi)	16
135	N2.NUO-2(RNAi)	16
136	N2.NUO-2(RNAi)	16
137	N2.NUO-2(RNAi)	16
138	N2.NUO-2(RNAi)	16
139	N2.NUO-2(RNAi)	16
140	N2.NUO-2(RNAi)	16
141	N2.NUO-2(RNAi)	16
142	N2.NUO-2(RNAi)	16
143	N2.NUO-2(RNAi)	16
144	N2.NUO-2(RNAi)	16
145	N2.NUO-2(RNAi)	16
146	N2.NUO-2(RNAi)	16
147	N2.NUO-2(RNAi)	16
148	N2.NUO-2(RNAi)	16
149	N2.NUO-2(RNAi)	16
150	N2.NUO-2(RNAi)	17
151	N2.NUO-2(RNAi)	17
152	N2.NUO-2(RNAi)	17
153	N2.NUO-2(RNAi)	17
154	N2.NUO-2(RNAi)	17
155	N2.NUO-2(RNAi)	17
156	N2.NUO-2(RNAi)	17
157	N2.NUO-2(RNAi)	17
158	N2.NUO-2(RNAi)	19
159	N2.NUO-2(RNAi)	19
160	N2.NUO-2(RNAi)	21
161	N2.NUO-2(RNAi)	21
162	N2.NUO-2(RNAi)	21
163	N2.NUO-2(RNAi)	21
164	N2.NUO-2(RNAi)	21
165	N2.NUO-2(RNAi)	21
166	N2.NUO-2(RNAi)	23
167	N2.NUO-2(RNAi)	7
168	N2.NUO-2(RNAi)	7
169	N2.NUO-2(RNAi)	10
170	N2.NUO-2(RNAi)	12
171	N2.NUO-2(RNAi)	9
172	N2.NUO-2(RNAi)	9
173	N2.NUO-2(RNAi)	9
174	N2.NUO-2(RNAi)	10
175	N2.NUO-2(RNAi)	10
176	N2.NUO-2(RNAi)	10
177	N2.NUO-2(RNAi)	12
178	N2.NUO-2(RNAi)	12
179	N2.NUO-2(RNAi)	12
180	N2.NUO-2(RNAi)	12
181	N2.NUO-2(RNAi)	13
182	N2.NUO-2(RNAi)	13
183	N2.NUO-2(RNAi)	13
184	N2.NUO-2(RNAi)	13
185	N2.NUO-2(RNAi)	13
186	N2.NUO-2(RNAi)	13
187	N2.NUO-2(RNAi)	14
188	N2.NUO-2(RNAi)	14
189	N2.NUO-2(RNAi)	14
190	N2.NUO-2(RNAi)	14
191	N2.NUO-2(RNAi)	16
192	N2.NUO-2(RNAi)	16
193	N2.NUO-2(RNAi)	16
194	N2.NUO-2(RNAi)	16
195	N2.NUO-2(RNAi)	16
196	N2.NUO-2(RNAi)	16
197	N2.NUO-2(RNAi)	16
198	N2.NUO-2(RNAi)	16
199	N2.NUO-2(RNAi)	16
200	N2.NUO-2(RNAi)	16
201	N2.NUO-2(RNAi)	16
202	N2.NUO-2(RNAi)	16
203	N2.NUO-2(RNAi)	16
204	N2.NUO-2(RNAi)	17
205	N2.NUO-2(RNAi)	17
206	N2.NUO-2(RNAi)	17
207	N2.NUO-2(RNAi)	17
208	N2.NUO-2(RNAi)	17
209	N2.NUO-2(RNAi)	17
210	N2.NUO-2(RNAi)	17
211	N2.NUO-2(RNAi)	17
212	N2.NUO-2(RNAi)	17
213	N2.NUO-2(RNAi)	17
214	N2.NUO-2(RNAi)	17
215	N2.NUO-2(RNAi)	17
216	N2.NUO-2(RNAi)	17
217	N2.NUO-2(RNAi)	17
218	N2.NUO-2(RNAi)	19
219	N2.NUO-2(RNAi)	19
220	N2.NUO-2(RNAi)	19
221	N2.NUO-2(RNAi)	19
222	N2.NUO-2(RNAi)	19
223	N2.NUO-2(RNAi)	19
224	N2.NUO-2(RNAi)	19
225	N2.NUO-2(RNAi)	19
226	N2.NUO-2(RNAi)	19
227	N2.NUO-2(RNAi)	19
228	N2.NUO-2(RNAi)	19
229	N2.NUO-2(RNAi)	19
230	N2.NUO-2(RNAi)	19
231	N2.NUO-2(RNAi)	19
232	N2.NUO-2(RNAi)	19
233	N2.NUO-2(RNAi)	19
234	N2.NUO-2(RNAi)	21
235	N2.NUO-2(RNAi)	21
236	N2.NUO-2(RNAi)	21
237	N2.NUO-2(RNAi)	21
238	N2.NUO-2(RNAi)	21
239	N2.NUO-2(RNAi)	21
240	N2.NUO-2(RNAi)	21
241	N2.NUO-2(RNAi)	21
242	N2.NUO-2(RNAi)	21
243	N2.NUO-2(RNAi)	21
244	N2.NUO-2(RNAi)	21
245	N2.NUO-2(RNAi)	21
246	N2.NUO-2(RNAi)	21
247	N2.NUO-2(RNAi)	23
248	N2.NUO-2(RNAi)	23
249	N2.NUO-2(RNAi)	23
250	N2.NUO-2(RNAi)	23
251	N2.NUO-2(RNAi)	23
252	N2.NUO-2(RNAi)	23
253	N2.NUO-2(RNAi)	23
254	N2.NUO-2(RNAi)	26
255	N2.NUO-2(RNAi)	14
256	N2.NUO-2(RNAi)	7
257	N2.NUO-2(RNAi)	7
