1	N2.PHY-2(RNAi)	17
2	N2.PHY-2(RNAi)	19
3	N2.PHY-2(RNAi)	19
4	N2.PHY-2(RNAi)	21
5	N2.PHY-2(RNAi)	21
6	N2.PHY-2(RNAi)	21
7	N2.PHY-2(RNAi)	24
8	N2.PHY-2(RNAi)	24
9	N2.PHY-2(RNAi)	24
10	N2.PHY-2(RNAi)	24
11	N2.PHY-2(RNAi)	24
12	N2.PHY-2(RNAi)	26
13	N2.PHY-2(RNAi)	26
14	N2.PHY-2(RNAi)	26
15	N2.PHY-2(RNAi)	26
16	N2.PHY-2(RNAi)	26
17	N2.PHY-2(RNAi)	26
18	N2.PHY-2(RNAi)	26
19	N2.PHY-2(RNAi)	26
20	N2.PHY-2(RNAi)	28
21	N2.PHY-2(RNAi)	28
22	N2.PHY-2(RNAi)	28
23	N2.PHY-2(RNAi)	28
24	N2.PHY-2(RNAi)	31
25	N2.PHY-2(RNAi)	14
26	N2.PHY-2(RNAi)	21
27	N2.PHY-2(RNAi)	21
28	N2.PHY-2(RNAi)	21
29	N2.PHY-2(RNAi)	24
30	N2.PHY-2(RNAi)	24
31	N2.PHY-2(RNAi)	24
32	N2.PHY-2(RNAi)	24
33	N2.PHY-2(RNAi)	24
34	N2.PHY-2(RNAi)	24
35	N2.PHY-2(RNAi)	24
36	N2.PHY-2(RNAi)	24
37	N2.PHY-2(RNAi)	24
38	N2.PHY-2(RNAi)	24
39	N2.PHY-2(RNAi)	24
40	N2.PHY-2(RNAi)	26
41	N2.PHY-2(RNAi)	26
42	N2.PHY-2(RNAi)	26
43	N2.PHY-2(RNAi)	26
44	N2.PHY-2(RNAi)	28
45	N2.PHY-2(RNAi)	28
46	N2.PHY-2(RNAi)	28
47	N2.PHY-2(RNAi)	28
48	N2.PHY-2(RNAi)	31
