1	N2.EGL-9(RNAi)	15
2	N2.EGL-9(RNAi)	18
3	N2.EGL-9(RNAi)	18
4	N2.EGL-9(RNAi)	18
5	N2.EGL-9(RNAi)	18
6	N2.EGL-9(RNAi)	18
7	N2.EGL-9(RNAi)	18
8	N2.EGL-9(RNAi)	18
9	N2.EGL-9(RNAi)	18
10	N2.EGL-9(RNAi)	18
11	N2.EGL-9(RNAi)	18
12	N2.EGL-9(RNAi)	18
13	N2.EGL-9(RNAi)	18
14	N2.EGL-9(RNAi)	18
15	N2.EGL-9(RNAi)	18
16	N2.EGL-9(RNAi)	18
17	N2.EGL-9(RNAi)	18
18	N2.EGL-9(RNAi)	18
19	N2.EGL-9(RNAi)	18
20	N2.EGL-9(RNAi)	18
21	N2.EGL-9(RNAi)	18
22	N2.EGL-9(RNAi)	20
23	N2.EGL-9(RNAi)	20
24	N2.EGL-9(RNAi)	20
25	N2.EGL-9(RNAi)	22
26	N2.EGL-9(RNAi)	22
27	N2.EGL-9(RNAi)	22
28	N2.EGL-9(RNAi)	15
29	N2.EGL-9(RNAi)	15
30	N2.EGL-9(RNAi)	15
31	N2.EGL-9(RNAi)	15
32	N2.EGL-9(RNAi)	18
33	N2.EGL-9(RNAi)	18
34	N2.EGL-9(RNAi)	18
35	N2.EGL-9(RNAi)	18
36	N2.EGL-9(RNAi)	18
37	N2.EGL-9(RNAi)	18
38	N2.EGL-9(RNAi)	18
39	N2.EGL-9(RNAi)	18
40	N2.EGL-9(RNAi)	18
41	N2.EGL-9(RNAi)	18
42	N2.EGL-9(RNAi)	18
43	N2.EGL-9(RNAi)	18
44	N2.EGL-9(RNAi)	18
45	N2.EGL-9(RNAi)	18
46	N2.EGL-9(RNAi)	18
47	N2.EGL-9(RNAi)	18
48	N2.EGL-9(RNAi)	18
49	N2.EGL-9(RNAi)	18
50	N2.EGL-9(RNAi)	20
51	N2.EGL-9(RNAi)	22
