1	hif-1	10
2	hif-1	14
3	hif-1	18
4	hif-1	20
5	hif-1	20
6	hif-1	20
7	hif-1	20
8	hif-1	20
9	hif-1	22
10	hif-1	22
11	hif-1	22
12	hif-1	24
13	hif-1	24
14	hif-1	24
15	hif-1	24
16	hif-1	24
17	hif-1	24
18	hif-1	24
19	hif-1	24
20	hif-1	24
21	hif-1	24
22	hif-1	24
23	hif-1	24
24	hif-1	24
25	hif-1	24
26	hif-1	24
27	hif-1	24
28	hif-1	24
29	hif-1	24
30	hif-1	24
31	hif-1	26
32	hif-1	26
33	hif-1	26
34	hif-1	26
35	hif-1	26
36	hif-1	26
37	hif-1	26
38	hif-1	26
39	hif-1	26
40	hif-1	28
41	hif-1	28
42	hif-1	31
43	hif-1	31
44	hif-1	31
45	hif-1	31
46	hif-1	33
47	hif-1	33
48	hif-1	18
49	hif-1	20
50	hif-1	22
51	hif-1	14
52	hif-1	14
53	hif-1	14
54	hif-1	20
55	hif-1	14
56	hif-1	18
57	hif-1	18
58	hif-1	18
59	hif-1	18
60	hif-1	18
61	hif-1	18
62	hif-1	18
63	hif-1	18
64	hif-1	20
65	hif-1	22
66	hif-1	22
67	hif-1	22
68	hif-1	24
69	hif-1	24
70	hif-1	24
71	hif-1	24
72	hif-1	24
73	hif-1	24
74	hif-1	24
75	hif-1	24
76	hif-1	24
77	hif-1	24
78	hif-1	24
79	hif-1	24
80	hif-1	26
81	hif-1	26
82	hif-1	26
83	hif-1	26
84	hif-1	26
85	hif-1	26
86	hif-1	26
87	hif-1	28
88	hif-1	28
89	hif-1	28
90	hif-1	28
91	hif-1	18
92	hif-1	20
93	hif-1	24
94	hif-1	24
95	hif-1	14
