1	N2.CCO-1(RNAi)	19
2	N2.CCO-1(RNAi)	19
3	N2.CCO-1(RNAi)	19
4	N2.CCO-1(RNAi)	19
5	N2.CCO-1(RNAi)	19
6	N2.CCO-1(RNAi)	22
7	N2.CCO-1(RNAi)	22
8	N2.CCO-1(RNAi)	24
9	N2.CCO-1(RNAi)	26
10	N2.CCO-1(RNAi)	26
11	N2.CCO-1(RNAi)	26
12	N2.CCO-1(RNAi)	29
13	N2.CCO-1(RNAi)	29
14	N2.CCO-1(RNAi)	29
15	N2.CCO-1(RNAi)	29
16	N2.CCO-1(RNAi)	29
17	N2.CCO-1(RNAi)	29
18	N2.CCO-1(RNAi)	29
19	N2.CCO-1(RNAi)	29
20	N2.CCO-1(RNAi)	29
21	N2.CCO-1(RNAi)	31
22	N2.CCO-1(RNAi)	31
23	N2.CCO-1(RNAi)	31
24	N2.CCO-1(RNAi)	31
25	N2.CCO-1(RNAi)	31
26	N2.CCO-1(RNAi)	31
27	N2.CCO-1(RNAi)	31
28	N2.CCO-1(RNAi)	33
29	N2.CCO-1(RNAi)	33
30	N2.CCO-1(RNAi)	19
31	N2.CCO-1(RNAi)	19
32	N2.CCO-1(RNAi)	19
33	N2.CCO-1(RNAi)	19
34	N2.CCO-1(RNAi)	24
35	N2.CCO-1(RNAi)	29
36	N2.CCO-1(RNAi)	22
37	N2.CCO-1(RNAi)	22
38	N2.CCO-1(RNAi)	22
39	N2.CCO-1(RNAi)	22
40	N2.CCO-1(RNAi)	22
41	N2.CCO-1(RNAi)	22
42	N2.CCO-1(RNAi)	22
43	N2.CCO-1(RNAi)	24
44	N2.CCO-1(RNAi)	24
45	N2.CCO-1(RNAi)	24
46	N2.CCO-1(RNAi)	26
47	N2.CCO-1(RNAi)	26
48	N2.CCO-1(RNAi)	26
49	N2.CCO-1(RNAi)	29
50	N2.CCO-1(RNAi)	29
51	N2.CCO-1(RNAi)	29
52	N2.CCO-1(RNAi)	29
53	N2.CCO-1(RNAi)	29
54	N2.CCO-1(RNAi)	29
55	N2.CCO-1(RNAi)	19
56	N2.CCO-1(RNAi)	19
57	N2.CCO-1(RNAi)	19
58	N2.CCO-1(RNAi)	19
59	N2.CCO-1(RNAi)	19
60	N2.CCO-1(RNAi)	24
61	N2.CCO-1(RNAi)	29
62	N2.CCO-1(RNAi)	29
63	N2.CCO-1(RNAi)	29
64	N2.CCO-1(RNAi)	29
65	N2.CCO-1(RNAi)	33
66	N2.CCO-1(RNAi)	38
67	N2.CCO-1(RNAi)	40
68	N2.CCO-1(RNAi)	19
69	N2.CCO-1(RNAi)	22
70	N2.CCO-1(RNAi)	22
71	N2.CCO-1(RNAi)	22
72	N2.CCO-1(RNAi)	24
73	N2.CCO-1(RNAi)	24
74	N2.CCO-1(RNAi)	26
75	N2.CCO-1(RNAi)	26
76	N2.CCO-1(RNAi)	26
77	N2.CCO-1(RNAi)	26
78	N2.CCO-1(RNAi)	26
79	N2.CCO-1(RNAi)	26
80	N2.CCO-1(RNAi)	29
81	N2.CCO-1(RNAi)	29
82	N2.CCO-1(RNAi)	29
83	N2.CCO-1(RNAi)	31
84	N2.CCO-1(RNAi)	33
85	N2.CCO-1(RNAi)	33
86	N2.CCO-1(RNAi)	36
87	N2.CCO-1(RNAi)	36
