1	daf-2	23
2	daf-2	26
3	daf-2	26
4	daf-2	31
5	daf-2	31
6	daf-2	31
7	daf-2	31
8	daf-2	31
9	daf-2	31
10	daf-2	31
11	daf-2	34
12	daf-2	34
13	daf-2	34
14	daf-2	34
15	daf-2	34
16	daf-2	34
17	daf-2	34
18	daf-2	34
19	daf-2	34
20	daf-2	34
21	daf-2	34
22	daf-2	34
23	daf-2	34
24	daf-2	37
25	daf-2	37
26	daf-2	37
27	daf-2	37
28	daf-2	37
29	daf-2	37
30	daf-2	40
31	daf-2	40
32	daf-2	40
33	daf-2	40
34	daf-2	40
35	daf-2	40
36	daf-2	44
37	daf-2	44
38	daf-2	44
39	daf-2	44
40	daf-2	44
41	daf-2	44
42	daf-2	44
43	daf-2	47
44	daf-2	47
45	daf-2	47
46	daf-2	47
47	daf-2	47
48	daf-2	47
49	daf-2	47
50	daf-2	47
51	daf-2	47
52	daf-2	47
53	daf-2	47
54	daf-2	47
55	daf-2	51
56	daf-2	51
57	daf-2	51
58	daf-2	51
59	daf-2	51
60	daf-2	51
61	daf-2	51
62	daf-2	51
63	daf-2	51
64	daf-2	54
65	daf-2	54
66	daf-2	54
67	daf-2	54
68	daf-2	54
69	daf-2	54
70	daf-2	54
71	daf-2	34
72	daf-2	37
73	daf-2	37
74	daf-2	37
75	daf-2	37
76	daf-2	37
77	daf-2	40
78	daf-2	40
79	daf-2	40
80	daf-2	40
81	daf-2	40
82	daf-2	40
83	daf-2	44
84	daf-2	44
85	daf-2	47
86	daf-2	47
87	daf-2	47
88	daf-2	51
89	daf-2	31
90	daf-2	31
91	daf-2	31
92	daf-2	31
93	daf-2	31
94	daf-2	34
95	daf-2	34
96	daf-2	37
97	daf-2	37
98	daf-2	37
99	daf-2	37
100	daf-2	37
101	daf-2	40
102	daf-2	47
103	daf-2	47
