1	hif-1	14
2	hif-1	14
3	hif-1	14
4	hif-1	14
5	hif-1	17
6	hif-1	17
7	hif-1	17
8	hif-1	20
9	hif-1	20
10	hif-1	20
11	hif-1	20
12	hif-1	22
13	hif-1	22
14	hif-1	22
15	hif-1	22
16	hif-1	24
17	hif-1	24
18	hif-1	24
19	hif-1	24
20	hif-1	27
21	hif-1	27
22	hif-1	27
23	hif-1	27
24	hif-1	29
25	hif-1	29
26	hif-1	29
27	hif-1	29
28	hif-1	31
29	hif-1	31
30	hif-1	31
31	hif-1	31
32	hif-1	31
33	hif-1	31
34	hif-1	33
35	hif-1	33
36	hif-1	33
37	hif-1	35
38	hif-1	35
39	hif-1	35
40	hif-1	37
41	hif-1	14
42	hif-1	14
43	hif-1	14
44	hif-1	17
45	hif-1	17
46	hif-1	17
47	hif-1	20
48	hif-1	20
49	hif-1	20
50	hif-1	20
51	hif-1	20
52	hif-1	22
53	hif-1	22
54	hif-1	22
55	hif-1	22
56	hif-1	22
57	hif-1	22
58	hif-1	24
59	hif-1	24
60	hif-1	24
61	hif-1	24
62	hif-1	27
63	hif-1	29
64	hif-1	33
65	hif-1	33
66	hif-1	33
67	hif-1	35
68	hif-1	39
