1	N2.CAH4(RNAi)	9
2	N2.CAH4(RNAi)	11
3	N2.CAH4(RNAi)	11
4	N2.CAH4(RNAi)	14
5	N2.CAH4(RNAi)	14
6	N2.CAH4(RNAi)	16
7	N2.CAH4(RNAi)	16
8	N2.CAH4(RNAi)	16
9	N2.CAH4(RNAi)	16
10	N2.CAH4(RNAi)	18
11	N2.CAH4(RNAi)	18
12	N2.CAH4(RNAi)	18
13	N2.CAH4(RNAi)	21
14	N2.CAH4(RNAi)	21
15	N2.CAH4(RNAi)	21
16	N2.CAH4(RNAi)	21
17	N2.CAH4(RNAi)	21
18	N2.CAH4(RNAi)	21
19	N2.CAH4(RNAi)	21
20	N2.CAH4(RNAi)	21
21	N2.CAH4(RNAi)	21
22	N2.CAH4(RNAi)	21
23	N2.CAH4(RNAi)	21
24	N2.CAH4(RNAi)	21
25	N2.CAH4(RNAi)	21
26	N2.CAH4(RNAi)	23
27	N2.CAH4(RNAi)	23
28	N2.CAH4(RNAi)	23
29	N2.CAH4(RNAi)	23
30	N2.CAH4(RNAi)	9
31	N2.CAH4(RNAi)	11
32	N2.CAH4(RNAi)	11
33	N2.CAH4(RNAi)	11
34	N2.CAH4(RNAi)	11
35	N2.CAH4(RNAi)	11
36	N2.CAH4(RNAi)	11
37	N2.CAH4(RNAi)	11
38	N2.CAH4(RNAi)	14
39	N2.CAH4(RNAi)	14
40	N2.CAH4(RNAi)	14
41	N2.CAH4(RNAi)	14
42	N2.CAH4(RNAi)	14
43	N2.CAH4(RNAi)	14
44	N2.CAH4(RNAi)	14
45	N2.CAH4(RNAi)	14
46	N2.CAH4(RNAi)	14
47	N2.CAH4(RNAi)	14
48	N2.CAH4(RNAi)	14
49	N2.CAH4(RNAi)	16
50	N2.CAH4(RNAi)	16
51	N2.CAH4(RNAi)	16
52	N2.CAH4(RNAi)	16
53	N2.CAH4(RNAi)	16
54	N2.CAH4(RNAi)	16
55	N2.CAH4(RNAi)	16
56	N2.CAH4(RNAi)	16
57	N2.CAH4(RNAi)	18
58	N2.CAH4(RNAi)	18
59	N2.CAH4(RNAi)	11
60	N2.CAH4(RNAi)	14
61	N2.CAH4(RNAi)	14
62	N2.CAH4(RNAi)	14
63	N2.CAH4(RNAi)	14
64	N2.CAH4(RNAi)	14
65	N2.CAH4(RNAi)	14
66	N2.CAH4(RNAi)	16
67	N2.CAH4(RNAi)	16
68	N2.CAH4(RNAi)	16
69	N2.CAH4(RNAi)	16
70	N2.CAH4(RNAi)	18
71	N2.CAH4(RNAi)	18
72	N2.CAH4(RNAi)	18
73	N2.CAH4(RNAi)	18
74	N2.CAH4(RNAi)	18
75	N2.CAH4(RNAi)	18
76	N2.CAH4(RNAi)	18
77	N2.CAH4(RNAi)	18
78	N2.CAH4(RNAi)	18
79	N2.CAH4(RNAi)	18
80	N2.CAH4(RNAi)	18
81	N2.CAH4(RNAi)	18
82	N2.CAH4(RNAi)	18
83	N2.CAH4(RNAi)	18
84	N2.CAH4(RNAi)	18
85	N2.CAH4(RNAi)	18
86	N2.CAH4(RNAi)	21
87	N2.CAH4(RNAi)	21
88	N2.CAH4(RNAi)	21
89	N2.CAH4(RNAi)	21
90	N2.CAH4(RNAi)	21
91	N2.CAH4(RNAi)	9
92	N2.CAH4(RNAi)	11
93	N2.CAH4(RNAi)	11
94	N2.CAH4(RNAi)	11
95	N2.CAH4(RNAi)	11
96	N2.CAH4(RNAi)	11
97	N2.CAH4(RNAi)	11
98	N2.CAH4(RNAi)	14
99	N2.CAH4(RNAi)	14
100	N2.CAH4(RNAi)	14
101	N2.CAH4(RNAi)	14
102	N2.CAH4(RNAi)	14
103	N2.CAH4(RNAi)	14
104	N2.CAH4(RNAi)	14
105	N2.CAH4(RNAi)	14
106	N2.CAH4(RNAi)	14
107	N2.CAH4(RNAi)	14
108	N2.CAH4(RNAi)	14
109	N2.CAH4(RNAi)	16
110	N2.CAH4(RNAi)	16
111	N2.CAH4(RNAi)	16
112	N2.CAH4(RNAi)	16
113	N2.CAH4(RNAi)	16
