1	hif-1	16
2	hif-1	21
3	hif-1	23
4	hif-1	26
5	hif-1	26
6	hif-1	28
7	hif-1	28
8	hif-1	28
9	hif-1	28
10	hif-1	28
11	hif-1	28
12	hif-1	28
13	hif-1	28
14	hif-1	28
15	hif-1	30
16	hif-1	30
17	hif-1	32
18	hif-1	35
19	hif-1	35
20	hif-1	35
21	hif-1	35
22	hif-1	35
23	hif-1	37
24	hif-1	37
25	hif-1	39
26	hif-1	39
27	hif-1	39
28	hif-1	42
29	hif-1	42
30	hif-1	42
31	hif-1	42
32	hif-1	42
33	hif-1	42
34	hif-1	44
35	hif-1	44
36	hif-1	44
37	hif-1	44
38	hif-1	46
39	hif-1	46
40	hif-1	49
41	hif-1	49
42	hif-1	53
43	hif-1	37
44	hif-1	42
45	hif-1	18
46	hif-1	21
47	hif-1	21
48	hif-1	21
49	hif-1	21
50	hif-1	21
51	hif-1	23
52	hif-1	23
53	hif-1	23
54	hif-1	23
55	hif-1	26
56	hif-1	26
57	hif-1	37
58	hif-1	16
59	hif-1	18
60	hif-1	18
61	hif-1	18
62	hif-1	21
63	hif-1	21
64	hif-1	21
65	hif-1	21
66	hif-1	26
67	hif-1	26
68	hif-1	26
69	hif-1	26
70	hif-1	26
71	hif-1	28
72	hif-1	28
73	hif-1	28
74	hif-1	28
75	hif-1	28
76	hif-1	28
77	hif-1	30
78	hif-1	30
79	hif-1	30
80	hif-1	30
81	hif-1	32
82	hif-1	32
83	hif-1	32
84	hif-1	35
85	hif-1	35
86	hif-1	35
87	hif-1	35
88	hif-1	35
89	hif-1	35
90	hif-1	37
91	hif-1	37
92	hif-1	39
93	hif-1	39
94	hif-1	39
95	hif-1	42
96	hif-1	42
97	hif-1	42
98	hif-1	44
99	hif-1	44
100	hif-1	46
101	hif-1	46
102	hif-1	46
103	hif-1	49
104	hif-1	49
105	hif-1	49
106	hif-1	51
107	hif-1	51
108	hif-1	53
109	hif-1	53
110	hif-1	53
111	hif-1	23
112	hif-1	32
113	hif-1	35
114	hif-1	42
115	hif-1	42
116	hif-1	18
117	hif-1	21
118	hif-1	21
119	hif-1	21
120	hif-1	23
121	hif-1	23
122	hif-1	26
123	hif-1	26
124	hif-1	26
125	hif-1	28
126	hif-1	28
127	hif-1	28
128	hif-1	30
129	hif-1	30
130	hif-1	30
131	hif-1	35
132	hif-1	37
133	hif-1	39
134	hif-1	39
135	hif-1	39
136	hif-1	42
137	hif-1	23
138	hif-1	26
139	hif-1	28
