1	rpl-6(RNAi)	16
2	rpl-6(RNAi)	16
3	rpl-6(RNAi)	16
4	rpl-6(RNAi)	16
5	rpl-6(RNAi)	22
6	rpl-6(RNAi)	22
7	rpl-6(RNAi)	22
8	rpl-6(RNAi)	22
9	rpl-6(RNAi)	22
10	rpl-6(RNAi)	22
11	rpl-6(RNAi)	22
12	rpl-6(RNAi)	22
13	rpl-6(RNAi)	25
14	rpl-6(RNAi)	25
15	rpl-6(RNAi)	22
16	rpl-6(RNAi)	22
17	rpl-6(RNAi)	22
18	rpl-6(RNAi)	22
19	rpl-6(RNAi)	22
20	rpl-6(RNAi)	22
21	rpl-6(RNAi)	22
22	rpl-6(RNAi)	22
23	rpl-6(RNAi)	25
24	rpl-6(RNAi)	22
25	rpl-6(RNAi)	14
26	rpl-6(RNAi)	14
27	rpl-6(RNAi)	22
28	rpl-6(RNAi)	22
29	rpl-6(RNAi)	22
30	rpl-6(RNAi)	22
31	rpl-6(RNAi)	22
32	rpl-6(RNAi)	22
33	rpl-6(RNAi)	22
34	rpl-6(RNAi)	22
35	rpl-6(RNAi)	16
36	rpl-6(RNAi)	22
37	rpl-6(RNAi)	22
38	rpl-6(RNAi)	22
39	rpl-6(RNAi)	14
40	rpl-6(RNAi)	16
41	rpl-6(RNAi)	22
42	rpl-6(RNAi)	22
43	rpl-6(RNAi)	22
44	rpl-6(RNAi)	22
45	rpl-6(RNAi)	22
46	rpl-6(RNAi)	22
47	rpl-6(RNAi)	22
48	rpl-6(RNAi)	22
49	rpl-6(RNAi)	22
50	rpl-6(RNAi)	22
51	rpl-6(RNAi)	22
52	rpl-6(RNAi)	25
53	rpl-6(RNAi)	22
54	rpl-6(RNAi)	22
55	rpl-6(RNAi)	22
