1	0.mM.caffeine	16
2	0.mM.caffeine	18
3	0.mM.caffeine	18
4	0.mM.caffeine	18
5	0.mM.caffeine	18
6	0.mM.caffeine	18
7	0.mM.caffeine	18
8	0.mM.caffeine	21
9	0.mM.caffeine	21
10	0.mM.caffeine	21
11	0.mM.caffeine	23
12	0.mM.caffeine	23
13	0.mM.caffeine	25
14	0.mM.caffeine	29
15	0.mM.caffeine	37
16	0.mM.caffeine	37
17	0.mM.caffeine	37
18	0.mM.caffeine	37
19	0.mM.caffeine	40
20	0.mM.caffeine	46
21	0.mM.caffeine	46
22	0.mM.caffeine	50
23	0.mM.caffeine	18
24	0.mM.caffeine	18
25	0.mM.caffeine	18
26	0.mM.caffeine	18
27	0.mM.caffeine	18
28	0.mM.caffeine	18
29	0.mM.caffeine	23
30	0.mM.caffeine	25
31	0.mM.caffeine	25
32	0.mM.caffeine	25
33	0.mM.caffeine	25
34	0.mM.caffeine	29
35	0.mM.caffeine	29
36	0.mM.caffeine	29
37	0.mM.caffeine	29
38	0.mM.caffeine	35
39	0.mM.caffeine	35
40	0.mM.caffeine	35
41	0.mM.caffeine	35
42	0.mM.caffeine	37
43	0.mM.caffeine	40
44	0.mM.caffeine	40
45	0.mM.caffeine	42
46	0.mM.caffeine	44
47	0.mM.caffeine	44
48	0.mM.caffeine	44
49	0.mM.caffeine	44
50	0.mM.caffeine	50
51	0.mM.caffeine	50
52	0.mM.caffeine	50
53	0.mM.caffeine	53
54	0.mM.caffeine	53
55	0.mM.caffeine	32
56	0.mM.caffeine	25
57	0.mM.caffeine	18
58	0.mM.caffeine	18
59	0.mM.caffeine	18
60	0.mM.caffeine	18
61	0.mM.caffeine	18
62	0.mM.caffeine	21
63	0.mM.caffeine	21
64	0.mM.caffeine	23
65	0.mM.caffeine	25
66	0.mM.caffeine	25
67	0.mM.caffeine	25
68	0.mM.caffeine	25
69	0.mM.caffeine	25
70	0.mM.caffeine	29
71	0.mM.caffeine	29
72	0.mM.caffeine	35
73	0.mM.caffeine	35
74	0.mM.caffeine	35
75	0.mM.caffeine	35
76	0.mM.caffeine	35
77	0.mM.caffeine	37
78	0.mM.caffeine	37
79	0.mM.caffeine	37
80	0.mM.caffeine	40
81	0.mM.caffeine	42
82	0.mM.caffeine	44
83	0.mM.caffeine	46
84	0.mM.caffeine	50
85	0.mM.caffeine	53
86	0.mM.caffeine	53
87	0.mM.caffeine	53
88	0.mM.caffeine	53
89	0.mM.caffeine	21
