1	N2.EV(RNAi)	12
2	N2.EV(RNAi)	12
3	N2.EV(RNAi)	12
4	N2.EV(RNAi)	12
5	N2.EV(RNAi)	12
6	N2.EV(RNAi)	12
7	N2.EV(RNAi)	12
8	N2.EV(RNAi)	12
9	N2.EV(RNAi)	12
10	N2.EV(RNAi)	12
11	N2.EV(RNAi)	12
12	N2.EV(RNAi)	15
13	N2.EV(RNAi)	15
14	N2.EV(RNAi)	15
15	N2.EV(RNAi)	15
16	N2.EV(RNAi)	15
17	N2.EV(RNAi)	15
18	N2.EV(RNAi)	15
19	N2.EV(RNAi)	15
20	N2.EV(RNAi)	15
21	N2.EV(RNAi)	15
22	N2.EV(RNAi)	15
23	N2.EV(RNAi)	15
24	N2.EV(RNAi)	15
25	N2.EV(RNAi)	15
26	N2.EV(RNAi)	15
27	N2.EV(RNAi)	15
28	N2.EV(RNAi)	15
29	N2.EV(RNAi)	15
30	N2.EV(RNAi)	15
31	N2.EV(RNAi)	15
32	N2.EV(RNAi)	15
33	N2.EV(RNAi)	15
34	N2.EV(RNAi)	15
35	N2.EV(RNAi)	15
36	N2.EV(RNAi)	15
37	N2.EV(RNAi)	15
38	N2.EV(RNAi)	15
39	N2.EV(RNAi)	15
40	N2.EV(RNAi)	15
41	N2.EV(RNAi)	15
42	N2.EV(RNAi)	15
43	N2.EV(RNAi)	15
44	N2.EV(RNAi)	15
45	N2.EV(RNAi)	15
46	N2.EV(RNAi)	15
47	N2.EV(RNAi)	15
48	N2.EV(RNAi)	15
49	N2.EV(RNAi)	15
50	N2.EV(RNAi)	15
51	N2.EV(RNAi)	15
52	N2.EV(RNAi)	15
53	N2.EV(RNAi)	15
54	N2.EV(RNAi)	15
55	N2.EV(RNAi)	15
56	N2.EV(RNAi)	17
57	N2.EV(RNAi)	17
58	N2.EV(RNAi)	17
59	N2.EV(RNAi)	17
60	N2.EV(RNAi)	17
61	N2.EV(RNAi)	17
62	N2.EV(RNAi)	17
63	N2.EV(RNAi)	17
64	N2.EV(RNAi)	17
65	N2.EV(RNAi)	17
66	N2.EV(RNAi)	17
67	N2.EV(RNAi)	17
68	N2.EV(RNAi)	17
69	N2.EV(RNAi)	17
70	N2.EV(RNAi)	17
71	N2.EV(RNAi)	17
72	N2.EV(RNAi)	17
73	N2.EV(RNAi)	17
74	N2.EV(RNAi)	17
75	N2.EV(RNAi)	17
76	N2.EV(RNAi)	22
77	N2.EV(RNAi)	12
78	N2.EV(RNAi)	12
79	N2.EV(RNAi)	12
80	N2.EV(RNAi)	12
81	N2.EV(RNAi)	12
82	N2.EV(RNAi)	15
83	N2.EV(RNAi)	15
84	N2.EV(RNAi)	15
85	N2.EV(RNAi)	15
86	N2.EV(RNAi)	15
87	N2.EV(RNAi)	15
88	N2.EV(RNAi)	15
89	N2.EV(RNAi)	15
90	N2.EV(RNAi)	15
91	N2.EV(RNAi)	15
92	N2.EV(RNAi)	15
93	N2.EV(RNAi)	15
94	N2.EV(RNAi)	15
95	N2.EV(RNAi)	15
96	N2.EV(RNAi)	15
97	N2.EV(RNAi)	15
98	N2.EV(RNAi)	17
99	N2.EV(RNAi)	17
100	N2.EV(RNAi)	17
101	N2.EV(RNAi)	17
102	N2.EV(RNAi)	17
103	N2.EV(RNAi)	17
104	N2.EV(RNAi)	17
105	N2.EV(RNAi)	17
106	N2.EV(RNAi)	17
107	N2.EV(RNAi)	17
108	N2.EV(RNAi)	17
109	N2.EV(RNAi)	17
110	N2.EV(RNAi)	17
111	N2.EV(RNAi)	17
112	N2.EV(RNAi)	17
113	N2.EV(RNAi)	17
114	N2.EV(RNAi)	17
115	N2.EV(RNAi)	17
116	N2.EV(RNAi)	17
117	N2.EV(RNAi)	17
118	N2.EV(RNAi)	17
119	N2.EV(RNAi)	17
120	N2.EV(RNAi)	17
121	N2.EV(RNAi)	17
122	N2.EV(RNAi)	17
123	N2.EV(RNAi)	17
124	N2.EV(RNAi)	17
125	N2.EV(RNAi)	20
126	N2.EV(RNAi)	20
127	N2.EV(RNAi)	20
128	N2.EV(RNAi)	20
129	N2.EV(RNAi)	20
130	N2.EV(RNAi)	20
131	N2.EV(RNAi)	20
132	N2.EV(RNAi)	20
133	N2.EV(RNAi)	20
134	N2.EV(RNAi)	20
135	N2.EV(RNAi)	22
136	N2.EV(RNAi)	22
137	N2.EV(RNAi)	22
138	N2.EV(RNAi)	22
139	N2.EV(RNAi)	15
140	N2.EV(RNAi)	12
141	N2.EV(RNAi)	10
