1	lys-8	12
2	lys-8	12
3	lys-8	12
4	lys-8	14
5	lys-8	16
6	lys-8	16
7	lys-8	16
8	lys-8	16
9	lys-8	16
10	lys-8	16
11	lys-8	16
12	lys-8	16
13	lys-8	16
14	lys-8	16
15	lys-8	16
16	lys-8	16
17	lys-8	16
18	lys-8	17
19	lys-8	17
20	lys-8	17
21	lys-8	17
22	lys-8	17
23	lys-8	17
24	lys-8	17
25	lys-8	17
26	lys-8	17
27	lys-8	19
28	lys-8	19
29	lys-8	19
30	lys-8	19
31	lys-8	19
32	lys-8	19
33	lys-8	19
34	lys-8	19
35	lys-8	19
36	lys-8	19
37	lys-8	19
38	lys-8	19
39	lys-8	19
40	lys-8	21
41	lys-8	21
42	lys-8	21
43	lys-8	21
44	lys-8	21
45	lys-8	21
46	lys-8	21
47	lys-8	21
48	lys-8	21
49	lys-8	21
50	lys-8	21
51	lys-8	21
52	lys-8	21
53	lys-8	21
54	lys-8	21
55	lys-8	21
56	lys-8	21
57	lys-8	21
58	lys-8	21
59	lys-8	23
60	lys-8	23
61	lys-8	23
62	lys-8	23
63	lys-8	23
64	lys-8	23
65	lys-8	23
66	lys-8	23
67	lys-8	23
68	lys-8	23
69	lys-8	23
70	lys-8	23
71	lys-8	23
72	lys-8	23
73	lys-8	23
74	lys-8	23
75	lys-8	23
76	lys-8	23
77	lys-8	23
78	lys-8	26
79	lys-8	26
80	lys-8	26
81	lys-8	26
82	lys-8	28
83	lys-8	14
84	lys-8	14
85	lys-8	14
86	lys-8	12
87	lys-8	14
88	lys-8	14
89	lys-8	14
90	lys-8	16
91	lys-8	16
92	lys-8	16
93	lys-8	16
94	lys-8	16
95	lys-8	16
96	lys-8	16
97	lys-8	17
98	lys-8	17
99	lys-8	17
100	lys-8	17
101	lys-8	17
102	lys-8	17
103	lys-8	17
104	lys-8	19
105	lys-8	19
106	lys-8	19
107	lys-8	19
108	lys-8	19
109	lys-8	19
110	lys-8	19
111	lys-8	19
112	lys-8	19
113	lys-8	19
114	lys-8	19
115	lys-8	19
116	lys-8	19
117	lys-8	19
118	lys-8	19
119	lys-8	19
120	lys-8	21
121	lys-8	21
122	lys-8	21
123	lys-8	21
124	lys-8	21
125	lys-8	21
126	lys-8	21
127	lys-8	21
128	lys-8	21
129	lys-8	21
130	lys-8	21
131	lys-8	21
132	lys-8	21
133	lys-8	21
134	lys-8	21
135	lys-8	21
136	lys-8	21
137	lys-8	21
138	lys-8	21
139	lys-8	23
140	lys-8	23
141	lys-8	23
142	lys-8	23
143	lys-8	23
144	lys-8	23
145	lys-8	23
146	lys-8	23
147	lys-8	23
148	lys-8	23
149	lys-8	26
150	lys-8	26
151	lys-8	14
152	lys-8	14
153	lys-8	16
