1	rsks-1	17
2	rsks-1	17
3	rsks-1	19
4	rsks-1	19
5	rsks-1	21
6	rsks-1	21
7	rsks-1	21
8	rsks-1	21
9	rsks-1	21
10	rsks-1	21
11	rsks-1	21
12	rsks-1	21
13	rsks-1	23
14	rsks-1	23
15	rsks-1	23
16	rsks-1	23
17	rsks-1	23
18	rsks-1	23
19	rsks-1	23
20	rsks-1	23
21	rsks-1	23
22	rsks-1	23
23	rsks-1	26
24	rsks-1	26
25	rsks-1	26
26	rsks-1	26
27	rsks-1	26
28	rsks-1	26
29	rsks-1	26
30	rsks-1	26
31	rsks-1	26
32	rsks-1	26
33	rsks-1	26
34	rsks-1	26
35	rsks-1	26
36	rsks-1	26
37	rsks-1	26
38	rsks-1	28
39	rsks-1	28
40	rsks-1	28
41	rsks-1	28
42	rsks-1	28
43	rsks-1	28
44	rsks-1	28
45	rsks-1	17
46	rsks-1	17
47	rsks-1	17
48	rsks-1	19
49	rsks-1	19
50	rsks-1	19
51	rsks-1	21
52	rsks-1	21
53	rsks-1	21
54	rsks-1	21
55	rsks-1	21
56	rsks-1	23
57	rsks-1	23
58	rsks-1	23
59	rsks-1	23
60	rsks-1	23
61	rsks-1	23
62	rsks-1	23
63	rsks-1	23
64	rsks-1	23
65	rsks-1	26
66	rsks-1	26
67	rsks-1	26
68	rsks-1	26
69	rsks-1	26
70	rsks-1	26
71	rsks-1	26
72	rsks-1	26
73	rsks-1	26
74	rsks-1	26
75	rsks-1	26
76	rsks-1	26
77	rsks-1	26
78	rsks-1	26
79	rsks-1	26
80	rsks-1	26
81	rsks-1	26
82	rsks-1	26
83	rsks-1	26
84	rsks-1	26
85	rsks-1	26
86	rsks-1	28
87	rsks-1	28
88	rsks-1	28
89	rsks-1	28
90	rsks-1	28
91	rsks-1	28
92	rsks-1	28
93	rsks-1	28
94	rsks-1	28
95	rsks-1	28
96	rsks-1	28
97	rsks-1	28
98	rsks-1	28
99	rsks-1	28
100	rsks-1	28
101	rsks-1	28
102	rsks-1	28
103	rsks-1	28
104	rsks-1	30
105	rsks-1	30
106	rsks-1	30
107	rsks-1	30
108	rsks-1	30
109	rsks-1	30
110	rsks-1	33
111	rsks-1	33
112	rsks-1	33
113	rsks-1	33
114	rsks-1	16
