1	vhl-1	21
2	vhl-1	25
3	vhl-1	30
4	vhl-1	30
5	vhl-1	30
6	vhl-1	30
7	vhl-1	30
8	vhl-1	32
9	vhl-1	32
10	vhl-1	32
11	vhl-1	32
12	vhl-1	32
13	vhl-1	32
14	vhl-1	32
15	vhl-1	32
16	vhl-1	32
17	vhl-1	32
18	vhl-1	32
19	vhl-1	32
20	vhl-1	32
21	vhl-1	32
22	vhl-1	32
23	vhl-1	32
24	vhl-1	32
25	vhl-1	32
26	vhl-1	32
27	vhl-1	35
28	vhl-1	35
29	vhl-1	35
30	vhl-1	35
31	vhl-1	35
32	vhl-1	35
33	vhl-1	35
34	vhl-1	35
35	vhl-1	35
36	vhl-1	35
37	vhl-1	35
38	vhl-1	35
39	vhl-1	35
40	vhl-1	35
41	vhl-1	35
42	vhl-1	35
43	vhl-1	35
44	vhl-1	35
45	vhl-1	37
46	vhl-1	37
47	vhl-1	37
48	vhl-1	37
49	vhl-1	37
50	vhl-1	37
51	vhl-1	37
52	vhl-1	37
53	vhl-1	37
54	vhl-1	37
55	vhl-1	37
56	vhl-1	37
57	vhl-1	37
58	vhl-1	37
59	vhl-1	37
60	vhl-1	37
61	vhl-1	37
62	vhl-1	39
63	vhl-1	39
64	vhl-1	39
65	vhl-1	39
66	vhl-1	39
67	vhl-1	39
68	vhl-1	39
69	vhl-1	39
70	vhl-1	39
71	vhl-1	39
72	vhl-1	39
73	vhl-1	39
74	vhl-1	39
75	vhl-1	39
76	vhl-1	39
77	vhl-1	39
78	vhl-1	39
79	vhl-1	42
80	vhl-1	42
81	vhl-1	42
82	vhl-1	42
83	vhl-1	42
84	vhl-1	42
85	vhl-1	42
86	vhl-1	42
87	vhl-1	42
88	vhl-1	42
89	vhl-1	42
90	vhl-1	42
91	vhl-1	42
92	vhl-1	42
93	vhl-1	42
94	vhl-1	42
95	vhl-1	42
96	vhl-1	42
97	vhl-1	42
98	vhl-1	42
99	vhl-1	42
100	vhl-1	42
101	vhl-1	42
102	vhl-1	42
103	vhl-1	42
104	vhl-1	42
105	vhl-1	42
106	vhl-1	42
107	vhl-1	44
108	vhl-1	44
109	vhl-1	44
110	vhl-1	44
111	vhl-1	44
112	vhl-1	44
113	vhl-1	44
114	vhl-1	44
115	vhl-1	44
116	vhl-1	44
117	vhl-1	44
118	vhl-1	44
119	vhl-1	44
120	vhl-1	44
121	vhl-1	44
122	vhl-1	44
123	vhl-1	44
124	vhl-1	44
125	vhl-1	44
126	vhl-1	46
127	vhl-1	46
128	vhl-1	46
129	vhl-1	49
130	vhl-1	49
131	vhl-1	49
132	vhl-1	49
133	vhl-1	49
134	vhl-1	49
135	vhl-1	53
136	vhl-1	28
137	vhl-1	30
138	vhl-1	30
139	vhl-1	30
140	vhl-1	28
