1	skn-1(zu67)	16
2	skn-1(zu67)	24
3	skn-1(zu67)	26
4	skn-1(zu67)	28
5	skn-1(zu67)	30
6	skn-1(zu67)	30
7	skn-1(zu67)	30
8	skn-1(zu67)	30
9	skn-1(zu67)	30
10	skn-1(zu67)	30
11	skn-1(zu67)	30
12	skn-1(zu67)	30
13	skn-1(zu67)	33
14	skn-1(zu67)	35
15	skn-1(zu67)	35
16	skn-1(zu67)	37
17	skn-1(zu67)	37
18	skn-1(zu67)	40
19	skn-1(zu67)	40
20	skn-1(zu67)	42
21	skn-1(zu67)	42
22	skn-1(zu67)	44
23	skn-1(zu67)	22
24	skn-1(zu67)	30
25	skn-1(zu67)	30
26	skn-1(zu67)	30
27	skn-1(zu67)	22
28	skn-1(zu67)	22
29	skn-1(zu67)	22
30	skn-1(zu67)	22
31	skn-1(zu67)	22
32	skn-1(zu67)	22
33	skn-1(zu67)	22
34	skn-1(zu67)	22
35	skn-1(zu67)	22
36	skn-1(zu67)	24
37	skn-1(zu67)	24
38	skn-1(zu67)	24
39	skn-1(zu67)	24
40	skn-1(zu67)	24
41	skn-1(zu67)	24
42	skn-1(zu67)	24
43	skn-1(zu67)	24
44	skn-1(zu67)	24
45	skn-1(zu67)	26
46	skn-1(zu67)	26
47	skn-1(zu67)	26
48	skn-1(zu67)	26
49	skn-1(zu67)	26
50	skn-1(zu67)	26
51	skn-1(zu67)	28
52	skn-1(zu67)	28
53	skn-1(zu67)	28
54	skn-1(zu67)	28
55	skn-1(zu67)	28
56	skn-1(zu67)	28
57	skn-1(zu67)	28
58	skn-1(zu67)	28
59	skn-1(zu67)	28
60	skn-1(zu67)	28
61	skn-1(zu67)	28
62	skn-1(zu67)	28
63	skn-1(zu67)	28
64	skn-1(zu67)	28
65	skn-1(zu67)	28
66	skn-1(zu67)	28
67	skn-1(zu67)	28
68	skn-1(zu67)	28
69	skn-1(zu67)	28
70	skn-1(zu67)	28
71	skn-1(zu67)	30
72	skn-1(zu67)	30
73	skn-1(zu67)	33
74	skn-1(zu67)	33
75	skn-1(zu67)	33
76	skn-1(zu67)	33
77	skn-1(zu67)	33
78	skn-1(zu67)	33
79	skn-1(zu67)	22
80	skn-1(zu67)	22
81	skn-1(zu67)	22
82	skn-1(zu67)	26
83	skn-1(zu67)	30
84	skn-1(zu67)	30
85	skn-1(zu67)	30
86	skn-1(zu67)	30
87	skn-1(zu67)	37
88	skn-1(zu67)	37
89	skn-1(zu67)	37
90	skn-1(zu67)	40
91	skn-1(zu67)	42
92	skn-1(zu67)	47
93	skn-1(zu67)	47
94	skn-1(zu67)	51
95	skn-1(zu67)	22
96	skn-1(zu67)	22
97	skn-1(zu67)	28
98	skn-1(zu67)	30
99	skn-1(zu67)	30
100	skn-1(zu67)	33
101	skn-1(zu67)	33
102	skn-1(zu67)	22
103	skn-1(zu67)	22
104	skn-1(zu67)	22
105	skn-1(zu67)	22
106	skn-1(zu67)	22
107	skn-1(zu67)	24
108	skn-1(zu67)	24
109	skn-1(zu67)	24
110	skn-1(zu67)	24
111	skn-1(zu67)	24
112	skn-1(zu67)	24
113	skn-1(zu67)	24
114	skn-1(zu67)	24
115	skn-1(zu67)	24
116	skn-1(zu67)	24
117	skn-1(zu67)	24
118	skn-1(zu67)	26
119	skn-1(zu67)	26
120	skn-1(zu67)	26
121	skn-1(zu67)	26
122	skn-1(zu67)	26
123	skn-1(zu67)	26
124	skn-1(zu67)	26
125	skn-1(zu67)	26
126	skn-1(zu67)	26
127	skn-1(zu67)	26
128	skn-1(zu67)	26
129	skn-1(zu67)	28
130	skn-1(zu67)	28
131	skn-1(zu67)	28
132	skn-1(zu67)	28
133	skn-1(zu67)	28
134	skn-1(zu67)	28
135	skn-1(zu67)	28
136	skn-1(zu67)	28
137	skn-1(zu67)	28
138	skn-1(zu67)	28
139	skn-1(zu67)	28
140	skn-1(zu67)	28
141	skn-1(zu67)	28
142	skn-1(zu67)	28
143	skn-1(zu67)	28
144	skn-1(zu67)	28
145	skn-1(zu67)	28
146	skn-1(zu67)	28
147	skn-1(zu67)	28
148	skn-1(zu67)	28
149	skn-1(zu67)	28
150	skn-1(zu67)	28
151	skn-1(zu67)	28
152	skn-1(zu67)	28
153	skn-1(zu67)	28
154	skn-1(zu67)	28
155	skn-1(zu67)	28
156	skn-1(zu67)	30
157	skn-1(zu67)	33
158	skn-1(zu67)	35
159	skn-1(zu67)	37
160	skn-1(zu67)	19
161	skn-1(zu67)	19
162	skn-1(zu67)	28
163	skn-1(zu67)	28
164	skn-1(zu67)	28
165	skn-1(zu67)	28
166	skn-1(zu67)	28
