1	N2.hif-1(RNAi)	14
2	N2.hif-1(RNAi)	14
3	N2.hif-1(RNAi)	14
4	N2.hif-1(RNAi)	16
5	N2.hif-1(RNAi)	16
6	N2.hif-1(RNAi)	16
7	N2.hif-1(RNAi)	16
8	N2.hif-1(RNAi)	16
9	N2.hif-1(RNAi)	18
10	N2.hif-1(RNAi)	18
11	N2.hif-1(RNAi)	18
12	N2.hif-1(RNAi)	21
13	N2.hif-1(RNAi)	21
14	N2.hif-1(RNAi)	21
15	N2.hif-1(RNAi)	21
16	N2.hif-1(RNAi)	21
17	N2.hif-1(RNAi)	21
18	N2.hif-1(RNAi)	23
19	N2.hif-1(RNAi)	23
20	N2.hif-1(RNAi)	23
21	N2.hif-1(RNAi)	25
22	N2.hif-1(RNAi)	25
23	N2.hif-1(RNAi)	25
24	N2.hif-1(RNAi)	16
25	N2.hif-1(RNAi)	16
26	N2.hif-1(RNAi)	16
27	N2.hif-1(RNAi)	18
28	N2.hif-1(RNAi)	21
29	N2.hif-1(RNAi)	25
30	N2.hif-1(RNAi)	14
31	N2.hif-1(RNAi)	14
32	N2.hif-1(RNAi)	16
33	N2.hif-1(RNAi)	16
34	N2.hif-1(RNAi)	16
35	N2.hif-1(RNAi)	16
36	N2.hif-1(RNAi)	16
37	N2.hif-1(RNAi)	16
38	N2.hif-1(RNAi)	18
39	N2.hif-1(RNAi)	18
40	N2.hif-1(RNAi)	18
41	N2.hif-1(RNAi)	18
42	N2.hif-1(RNAi)	23
43	N2.hif-1(RNAi)	14
44	N2.hif-1(RNAi)	16
45	N2.hif-1(RNAi)	16
46	N2.hif-1(RNAi)	16
47	N2.hif-1(RNAi)	16
48	N2.hif-1(RNAi)	16
49	N2.hif-1(RNAi)	16
50	N2.hif-1(RNAi)	18
51	N2.hif-1(RNAi)	18
52	N2.hif-1(RNAi)	18
53	N2.hif-1(RNAi)	18
54	N2.hif-1(RNAi)	18
55	N2.hif-1(RNAi)	18
56	N2.hif-1(RNAi)	18
57	N2.hif-1(RNAi)	18
58	N2.hif-1(RNAi)	21
59	N2.hif-1(RNAi)	21
60	N2.hif-1(RNAi)	21
61	N2.hif-1(RNAi)	21
62	N2.hif-1(RNAi)	21
63	N2.hif-1(RNAi)	23
64	N2.hif-1(RNAi)	14
65	N2.hif-1(RNAi)	14
66	N2.hif-1(RNAi)	14
67	N2.hif-1(RNAi)	14
68	N2.hif-1(RNAi)	14
69	N2.hif-1(RNAi)	14
70	N2.hif-1(RNAi)	14
71	N2.hif-1(RNAi)	14
72	N2.hif-1(RNAi)	14
73	N2.hif-1(RNAi)	14
74	N2.hif-1(RNAi)	16
75	N2.hif-1(RNAi)	16
76	N2.hif-1(RNAi)	16
77	N2.hif-1(RNAi)	16
78	N2.hif-1(RNAi)	16
79	N2.hif-1(RNAi)	16
80	N2.hif-1(RNAi)	21
81	N2.hif-1(RNAi)	23
82	N2.hif-1(RNAi)	23
83	N2.hif-1(RNAi)	23
84	N2.hif-1(RNAi)	23
85	N2.hif-1(RNAi)	23
86	N2.hif-1(RNAi)	23
87	N2.hif-1(RNAi)	25
88	N2.hif-1(RNAi)	25
89	N2.hif-1(RNAi)	25
90	N2.hif-1(RNAi)	14
91	N2.hif-1(RNAi)	18
92	N2.hif-1(RNAi)	18
93	N2.hif-1(RNAi)	18
94	N2.hif-1(RNAi)	18
95	N2.hif-1(RNAi)	18
96	N2.hif-1(RNAi)	21
97	N2.hif-1(RNAi)	23
98	N2.hif-1(RNAi)	11
99	N2.hif-1(RNAi)	11
100	N2.hif-1(RNAi)	14
101	N2.hif-1(RNAi)	14
102	N2.hif-1(RNAi)	16
103	N2.hif-1(RNAi)	16
104	N2.hif-1(RNAi)	16
105	N2.hif-1(RNAi)	16
106	N2.hif-1(RNAi)	16
107	N2.hif-1(RNAi)	18
108	N2.hif-1(RNAi)	18
109	N2.hif-1(RNAi)	18
110	N2.hif-1(RNAi)	18
111	N2.hif-1(RNAi)	18
112	N2.hif-1(RNAi)	21
113	N2.hif-1(RNAi)	11
114	N2.hif-1(RNAi)	11
115	N2.hif-1(RNAi)	14
116	N2.hif-1(RNAi)	14
117	N2.hif-1(RNAi)	14
118	N2.hif-1(RNAi)	14
119	N2.hif-1(RNAi)	14
120	N2.hif-1(RNAi)	16
121	N2.hif-1(RNAi)	16
122	N2.hif-1(RNAi)	16
123	N2.hif-1(RNAi)	16
124	N2.hif-1(RNAi)	16
125	N2.hif-1(RNAi)	18
126	N2.hif-1(RNAi)	18
127	N2.hif-1(RNAi)	18
128	N2.hif-1(RNAi)	18
129	N2.hif-1(RNAi)	18
130	N2.hif-1(RNAi)	18
131	N2.hif-1(RNAi)	11
132	N2.hif-1(RNAi)	11
133	N2.hif-1(RNAi)	14
134	N2.hif-1(RNAi)	14
135	N2.hif-1(RNAi)	14
136	N2.hif-1(RNAi)	14
137	N2.hif-1(RNAi)	14
138	N2.hif-1(RNAi)	14
139	N2.hif-1(RNAi)	14
140	N2.hif-1(RNAi)	14
141	N2.hif-1(RNAi)	14
142	N2.hif-1(RNAi)	14
143	N2.hif-1(RNAi)	14
144	N2.hif-1(RNAi)	14
145	N2.hif-1(RNAi)	14
146	N2.hif-1(RNAi)	14
147	N2.hif-1(RNAi)	16
148	N2.hif-1(RNAi)	16
149	N2.hif-1(RNAi)	16
150	N2.hif-1(RNAi)	16
151	N2.hif-1(RNAi)	16
152	N2.hif-1(RNAi)	16
153	N2.hif-1(RNAi)	16
154	N2.hif-1(RNAi)	16
155	N2.hif-1(RNAi)	16
156	N2.hif-1(RNAi)	18
157	N2.hif-1(RNAi)	18
158	N2.hif-1(RNAi)	18
159	N2.hif-1(RNAi)	18
160	N2.hif-1(RNAi)	18
161	N2.hif-1(RNAi)	18
162	N2.hif-1(RNAi)	21
163	N2.hif-1(RNAi)	21
164	N2.hif-1(RNAi)	21
165	N2.hif-1(RNAi)	21
166	N2.hif-1(RNAi)	21
167	N2.hif-1(RNAi)	23
168	N2.hif-1(RNAi)	23
169	N2.hif-1(RNAi)	23
170	N2.hif-1(RNAi)	23
171	N2.hif-1(RNAi)	23
172	N2.hif-1(RNAi)	25
173	N2.hif-1(RNAi)	25
174	N2.hif-1(RNAi)	14
175	N2.hif-1(RNAi)	14
176	N2.hif-1(RNAi)	14
177	N2.hif-1(RNAi)	14
178	N2.hif-1(RNAi)	14
179	N2.hif-1(RNAi)	16
180	N2.hif-1(RNAi)	16
181	N2.hif-1(RNAi)	18
182	N2.hif-1(RNAi)	18
183	N2.hif-1(RNAi)	18
184	N2.hif-1(RNAi)	18
185	N2.hif-1(RNAi)	18
186	N2.hif-1(RNAi)	21
187	N2.hif-1(RNAi)	25
188	N2.hif-1(RNAi)	11
189	N2.hif-1(RNAi)	14
190	N2.hif-1(RNAi)	14
191	N2.hif-1(RNAi)	16
192	N2.hif-1(RNAi)	18
193	N2.hif-1(RNAi)	14
194	N2.hif-1(RNAi)	14
195	N2.hif-1(RNAi)	14
196	N2.hif-1(RNAi)	14
197	N2.hif-1(RNAi)	16
198	N2.hif-1(RNAi)	16
199	N2.hif-1(RNAi)	16
200	N2.hif-1(RNAi)	16
201	N2.hif-1(RNAi)	16
202	N2.hif-1(RNAi)	18
203	N2.hif-1(RNAi)	18
