1	daf-16	13
2	daf-16	13
3	daf-16	13
4	daf-16	13
5	daf-16	13
6	daf-16	16
7	daf-16	16
8	daf-16	16
9	daf-16	16
10	daf-16	16
11	daf-16	16
12	daf-16	18
13	daf-16	18
14	daf-16	18
15	daf-16	18
16	daf-16	18
17	daf-16	18
18	daf-16	18
19	daf-16	18
20	daf-16	18
21	daf-16	18
22	daf-16	18
23	daf-16	20
24	daf-16	20
25	daf-16	23
26	daf-16	23
27	daf-16	10
28	daf-16	10
29	daf-16	10
30	daf-16	13
31	daf-16	13
32	daf-16	13
33	daf-16	13
34	daf-16	13
35	daf-16	16
36	daf-16	16
37	daf-16	16
38	daf-16	16
39	daf-16	16
40	daf-16	16
41	daf-16	16
42	daf-16	16
43	daf-16	16
44	daf-16	16
45	daf-16	18
46	daf-16	18
47	daf-16	18
48	daf-16	18
49	daf-16	18
50	daf-16	18
51	daf-16	18
52	daf-16	18
53	daf-16	20
54	daf-16	20
55	daf-16	20
56	daf-16	20
57	daf-16	20
58	daf-16	20
