1	5.mM.caffeine	11
2	5.mM.caffeine	11
3	5.mM.caffeine	11
4	5.mM.caffeine	14
5	5.mM.caffeine	14
6	5.mM.caffeine	18
7	5.mM.caffeine	18
8	5.mM.caffeine	21
9	5.mM.caffeine	21
10	5.mM.caffeine	21
11	5.mM.caffeine	21
12	5.mM.caffeine	21
13	5.mM.caffeine	25
14	5.mM.caffeine	25
15	5.mM.caffeine	25
16	5.mM.caffeine	25
17	5.mM.caffeine	28
18	5.mM.caffeine	28
19	5.mM.caffeine	28
20	5.mM.caffeine	28
21	5.mM.caffeine	28
22	5.mM.caffeine	11
23	5.mM.caffeine	11
24	5.mM.caffeine	11
25	5.mM.caffeine	14
26	5.mM.caffeine	14
27	5.mM.caffeine	14
28	5.mM.caffeine	14
29	5.mM.caffeine	16
30	5.mM.caffeine	16
31	5.mM.caffeine	21
32	5.mM.caffeine	21
33	5.mM.caffeine	25
34	5.mM.caffeine	25
35	5.mM.caffeine	25
36	5.mM.caffeine	25
37	5.mM.caffeine	25
38	5.mM.caffeine	25
39	5.mM.caffeine	25
40	5.mM.caffeine	25
41	5.mM.caffeine	28
42	5.mM.caffeine	28
43	5.mM.caffeine	28
44	5.mM.caffeine	28
45	5.mM.caffeine	28
46	5.mM.caffeine	28
47	5.mM.caffeine	28
48	5.mM.caffeine	28
49	5.mM.caffeine	28
50	5.mM.caffeine	30
51	5.mM.caffeine	30
52	5.mM.caffeine	30
53	5.mM.caffeine	32
54	5.mM.caffeine	9
55	5.mM.caffeine	11
56	5.mM.caffeine	16
57	5.mM.caffeine	16
58	5.mM.caffeine	21
59	5.mM.caffeine	21
60	5.mM.caffeine	21
61	5.mM.caffeine	21
62	5.mM.caffeine	21
63	5.mM.caffeine	21
64	5.mM.caffeine	21
65	5.mM.caffeine	21
66	5.mM.caffeine	25
67	5.mM.caffeine	25
68	5.mM.caffeine	25
69	5.mM.caffeine	25
70	5.mM.caffeine	25
71	5.mM.caffeine	25
72	5.mM.caffeine	25
73	5.mM.caffeine	25
74	5.mM.caffeine	25
75	5.mM.caffeine	28
76	5.mM.caffeine	28
77	5.mM.caffeine	30
78	5.mM.caffeine	30
79	5.mM.caffeine	30
80	5.mM.caffeine	30
