1	daf-16	11
2	daf-16	11
3	daf-16	13
4	daf-16	13
5	daf-16	13
6	daf-16	13
7	daf-16	13
8	daf-16	13
9	daf-16	13
10	daf-16	13
11	daf-16	13
12	daf-16	13
13	daf-16	13
14	daf-16	13
15	daf-16	13
16	daf-16	13
17	daf-16	13
18	daf-16	13
19	daf-16	13
20	daf-16	13
21	daf-16	13
22	daf-16	13
23	daf-16	13
24	daf-16	15
25	daf-16	15
26	daf-16	15
27	daf-16	15
28	daf-16	15
29	daf-16	15
30	daf-16	15
31	daf-16	15
32	daf-16	15
33	daf-16	15
34	daf-16	15
35	daf-16	17
36	daf-16	17
37	daf-16	17
38	daf-16	17
39	daf-16	17
40	daf-16	17
41	daf-16	17
42	daf-16	17
43	daf-16	17
44	daf-16	17
45	daf-16	17
46	daf-16	17
47	daf-16	20
48	daf-16	20
49	daf-16	20
50	daf-16	20
51	daf-16	11
52	daf-16	13
53	daf-16	13
54	daf-16	13
55	daf-16	13
56	daf-16	13
57	daf-16	13
58	daf-16	13
59	daf-16	13
60	daf-16	13
61	daf-16	13
62	daf-16	13
63	daf-16	13
64	daf-16	13
65	daf-16	13
66	daf-16	13
67	daf-16	13
68	daf-16	13
69	daf-16	15
70	daf-16	15
71	daf-16	15
72	daf-16	15
73	daf-16	15
74	daf-16	15
75	daf-16	15
76	daf-16	15
77	daf-16	15
78	daf-16	15
79	daf-16	15
80	daf-16	15
81	daf-16	15
82	daf-16	15
83	daf-16	17
84	daf-16	17
85	daf-16	17
86	daf-16	17
87	daf-16	17
88	daf-16	17
89	daf-16	17
90	daf-16	11
