1	rhy-1	7
2	rhy-1	7
3	rhy-1	7
4	rhy-1	7
5	rhy-1	7
6	rhy-1	7
7	rhy-1	7
8	rhy-1	7
9	rhy-1	7
10	rhy-1	9
11	rhy-1	11
12	rhy-1	11
13	rhy-1	11
14	rhy-1	11
15	rhy-1	11
16	rhy-1	11
17	rhy-1	11
18	rhy-1	14
19	rhy-1	14
20	rhy-1	14
21	rhy-1	14
22	rhy-1	14
23	rhy-1	16
24	rhy-1	16
25	rhy-1	16
26	rhy-1	16
27	rhy-1	16
28	rhy-1	16
29	rhy-1	16
30	rhy-1	7
31	rhy-1	7
32	rhy-1	7
33	rhy-1	7
34	rhy-1	9
35	rhy-1	9
36	rhy-1	9
37	rhy-1	9
38	rhy-1	9
39	rhy-1	9
40	rhy-1	9
41	rhy-1	9
42	rhy-1	9
43	rhy-1	9
44	rhy-1	9
45	rhy-1	9
46	rhy-1	9
47	rhy-1	11
48	rhy-1	11
49	rhy-1	11
50	rhy-1	11
51	rhy-1	11
52	rhy-1	11
53	rhy-1	11
54	rhy-1	11
55	rhy-1	14
56	rhy-1	16
57	rhy-1	16
58	rhy-1	16
59	rhy-1	16
60	rhy-1	16
61	rhy-1	16
62	rhy-1	16
63	rhy-1	7
64	rhy-1	7
65	rhy-1	7
66	rhy-1	11
67	rhy-1	11
68	rhy-1	14
69	rhy-1	14
70	rhy-1	14
71	rhy-1	16
72	rhy-1	7
73	rhy-1	9
74	rhy-1	11
75	rhy-1	11
76	rhy-1	11
77	rhy-1	14
78	rhy-1	14
79	rhy-1	14
80	rhy-1	14
81	rhy-1	14
82	rhy-1	14
83	rhy-1	14
84	rhy-1	14
85	rhy-1	14
86	rhy-1	14
87	rhy-1	14
88	rhy-1	14
89	rhy-1	14
90	rhy-1	14
91	rhy-1	14
92	rhy-1	14
93	rhy-1	14
94	rhy-1	14
95	rhy-1	14
96	rhy-1	16
97	rhy-1	16
98	rhy-1	16
99	rhy-1	16
100	rhy-1	16
101	rhy-1	16
102	rhy-1	16
103	rhy-1	16
104	rhy-1	16
105	rhy-1	16
106	rhy-1	16
107	rhy-1	17
108	rhy-1	17
109	rhy-1	17
110	rhy-1	20
111	rhy-1	7
112	rhy-1	7
113	rhy-1	7
114	rhy-1	7
115	rhy-1	7
116	rhy-1	7
117	rhy-1	7
118	rhy-1	7
119	rhy-1	7
120	rhy-1	9
121	rhy-1	9
122	rhy-1	9
123	rhy-1	9
124	rhy-1	9
125	rhy-1	9
126	rhy-1	11
127	rhy-1	11
128	rhy-1	11
129	rhy-1	11
130	rhy-1	11
131	rhy-1	11
132	rhy-1	11
133	rhy-1	14
134	rhy-1	16
135	rhy-1	7
136	rhy-1	7
137	rhy-1	7
138	rhy-1	7
139	rhy-1	7
140	rhy-1	7
141	rhy-1	9
142	rhy-1	9
143	rhy-1	9
144	rhy-1	9
145	rhy-1	9
146	rhy-1	9
147	rhy-1	9
148	rhy-1	11
149	rhy-1	11
150	rhy-1	11
151	rhy-1	11
152	rhy-1	11
153	rhy-1	11
154	rhy-1	11
155	rhy-1	14
156	rhy-1	14
157	rhy-1	16
158	rhy-1	16
159	rhy-1	16
160	rhy-1	16
161	rhy-1	16
162	rhy-1	16
163	rhy-1	16
164	rhy-1	16
165	rhy-1	7
166	rhy-1	9
167	rhy-1	11
168	rhy-1	11
169	rhy-1	11
170	rhy-1	11
171	rhy-1	14
172	rhy-1	14
173	rhy-1	14
174	rhy-1	14
175	rhy-1	14
176	rhy-1	14
177	rhy-1	14
178	rhy-1	16
179	rhy-1	9
180	rhy-1	9
181	rhy-1	9
182	rhy-1	9
183	rhy-1	9
184	rhy-1	11
185	rhy-1	11
186	rhy-1	11
187	rhy-1	11
188	rhy-1	11
189	rhy-1	14
190	rhy-1	14
191	rhy-1	14
192	rhy-1	14
193	rhy-1	14
194	rhy-1	14
195	rhy-1	14
196	rhy-1	14
197	rhy-1	14
198	rhy-1	14
199	rhy-1	14
200	rhy-1	14
201	rhy-1	14
202	rhy-1	14
203	rhy-1	14
204	rhy-1	14
205	rhy-1	14
206	rhy-1	14
207	rhy-1	14
208	rhy-1	14
209	rhy-1	14
210	rhy-1	14
211	rhy-1	16
212	rhy-1	16
213	rhy-1	16
214	rhy-1	16
215	rhy-1	16
216	rhy-1	16
217	rhy-1	16
218	rhy-1	16
219	rhy-1	16
220	rhy-1	17
221	rhy-1	7
222	rhy-1	7
223	rhy-1	7
224	rhy-1	7
225	rhy-1	7
226	rhy-1	7
227	rhy-1	9
228	rhy-1	9
229	rhy-1	9
230	rhy-1	9
231	rhy-1	9
232	rhy-1	11
233	rhy-1	11
234	rhy-1	11
235	rhy-1	11
236	rhy-1	11
237	rhy-1	11
238	rhy-1	11
239	rhy-1	11
240	rhy-1	11
241	rhy-1	11
242	rhy-1	11
243	rhy-1	14
244	rhy-1	16
245	rhy-1	17
246	rhy-1	7
247	rhy-1	7
248	rhy-1	7
249	rhy-1	7
250	rhy-1	7
251	rhy-1	9
252	rhy-1	9
253	rhy-1	9
254	rhy-1	9
255	rhy-1	9
256	rhy-1	9
257	rhy-1	9
258	rhy-1	11
259	rhy-1	11
260	rhy-1	11
261	rhy-1	11
262	rhy-1	11
263	rhy-1	11
264	rhy-1	11
265	rhy-1	11
266	rhy-1	11
267	rhy-1	11
268	rhy-1	11
269	rhy-1	11
270	rhy-1	11
271	rhy-1	14
272	rhy-1	14
273	rhy-1	14
274	rhy-1	14
275	rhy-1	16
276	rhy-1	17
277	rhy-1	9
278	rhy-1	9
279	rhy-1	11
280	rhy-1	11
281	rhy-1	11
282	rhy-1	11
283	rhy-1	11
284	rhy-1	11
285	rhy-1	11
286	rhy-1	11
287	rhy-1	11
288	rhy-1	11
289	rhy-1	11
290	rhy-1	14
291	rhy-1	14
292	rhy-1	14
293	rhy-1	14
294	rhy-1	14
295	rhy-1	14
296	rhy-1	7
297	rhy-1	7
298	rhy-1	9
299	rhy-1	11
300	rhy-1	11
301	rhy-1	11
302	rhy-1	11
303	rhy-1	11
304	rhy-1	11
305	rhy-1	14
306	rhy-1	14
307	rhy-1	14
308	rhy-1	14
309	rhy-1	14
310	rhy-1	14
311	rhy-1	14
312	rhy-1	14
313	rhy-1	14
314	rhy-1	14
315	rhy-1	14
316	rhy-1	14
317	rhy-1	14
318	rhy-1	14
319	rhy-1	14
320	rhy-1	14
321	rhy-1	14
322	rhy-1	14
323	rhy-1	14
324	rhy-1	14
325	rhy-1	14
326	rhy-1	14
327	rhy-1	14
328	rhy-1	14
329	rhy-1	14
330	rhy-1	14
331	rhy-1	14
332	rhy-1	14
333	rhy-1	16
334	rhy-1	16
335	rhy-1	16
336	rhy-1	16
337	rhy-1	17
338	rhy-1	17
339	rhy-1	17
340	rhy-1	17
341	rhy-1	17
342	rhy-1	18
