1	N2.Hypoxia	14
2	N2.Hypoxia	14
3	N2.Hypoxia	17
4	N2.Hypoxia	17
5	N2.Hypoxia	17
6	N2.Hypoxia	17
7	N2.Hypoxia	17
8	N2.Hypoxia	20
9	N2.Hypoxia	20
10	N2.Hypoxia	20
11	N2.Hypoxia	20
12	N2.Hypoxia	20
13	N2.Hypoxia	20
14	N2.Hypoxia	20
15	N2.Hypoxia	20
16	N2.Hypoxia	20
17	N2.Hypoxia	20
18	N2.Hypoxia	20
19	N2.Hypoxia	20
20	N2.Hypoxia	22
21	N2.Hypoxia	22
22	N2.Hypoxia	22
23	N2.Hypoxia	22
24	N2.Hypoxia	22
25	N2.Hypoxia	22
26	N2.Hypoxia	22
27	N2.Hypoxia	22
28	N2.Hypoxia	22
29	N2.Hypoxia	22
30	N2.Hypoxia	22
31	N2.Hypoxia	22
32	N2.Hypoxia	22
33	N2.Hypoxia	22
34	N2.Hypoxia	24
35	N2.Hypoxia	24
36	N2.Hypoxia	24
37	N2.Hypoxia	24
38	N2.Hypoxia	24
39	N2.Hypoxia	24
40	N2.Hypoxia	24
41	N2.Hypoxia	24
42	N2.Hypoxia	24
43	N2.Hypoxia	24
44	N2.Hypoxia	24
45	N2.Hypoxia	24
46	N2.Hypoxia	24
47	N2.Hypoxia	26
48	N2.Hypoxia	26
49	N2.Hypoxia	26
50	N2.Hypoxia	26
51	N2.Hypoxia	26
52	N2.Hypoxia	26
53	N2.Hypoxia	26
54	N2.Hypoxia	28
55	N2.Hypoxia	28
56	N2.Hypoxia	28
57	N2.Hypoxia	30
58	N2.Hypoxia	30
59	N2.Hypoxia	32
60	N2.Hypoxia	20
61	N2.Hypoxia	14
62	N2.Hypoxia	14
63	N2.Hypoxia	14
64	N2.Hypoxia	17
65	N2.Hypoxia	17
66	N2.Hypoxia	17
67	N2.Hypoxia	20
68	N2.Hypoxia	20
69	N2.Hypoxia	20
70	N2.Hypoxia	20
71	N2.Hypoxia	20
72	N2.Hypoxia	22
73	N2.Hypoxia	22
74	N2.Hypoxia	22
75	N2.Hypoxia	22
76	N2.Hypoxia	22
77	N2.Hypoxia	22
78	N2.Hypoxia	22
79	N2.Hypoxia	22
80	N2.Hypoxia	22
81	N2.Hypoxia	22
82	N2.Hypoxia	22
83	N2.Hypoxia	22
84	N2.Hypoxia	22
85	N2.Hypoxia	22
86	N2.Hypoxia	24
87	N2.Hypoxia	24
88	N2.Hypoxia	24
89	N2.Hypoxia	24
90	N2.Hypoxia	24
91	N2.Hypoxia	24
92	N2.Hypoxia	24
93	N2.Hypoxia	24
94	N2.Hypoxia	24
95	N2.Hypoxia	24
96	N2.Hypoxia	24
97	N2.Hypoxia	24
98	N2.Hypoxia	24
99	N2.Hypoxia	24
100	N2.Hypoxia	26
101	N2.Hypoxia	26
102	N2.Hypoxia	26
103	N2.Hypoxia	26
104	N2.Hypoxia	26
105	N2.Hypoxia	26
106	N2.Hypoxia	26
107	N2.Hypoxia	26
108	N2.Hypoxia	26
109	N2.Hypoxia	26
110	N2.Hypoxia	28
111	N2.Hypoxia	28
112	N2.Hypoxia	28
113	N2.Hypoxia	28
114	N2.Hypoxia	28
115	N2.Hypoxia	28
116	N2.Hypoxia	28
117	N2.Hypoxia	28
118	N2.Hypoxia	28
119	N2.Hypoxia	28
120	N2.Hypoxia	28
121	N2.Hypoxia	28
122	N2.Hypoxia	28
123	N2.Hypoxia	28
124	N2.Hypoxia	28
125	N2.Hypoxia	30
126	N2.Hypoxia	30
127	N2.Hypoxia	30
128	N2.Hypoxia	30
129	N2.Hypoxia	30
130	N2.Hypoxia	32
131	N2.Hypoxia	32
132	N2.Hypoxia	20
133	N2.Hypoxia	20
134	N2.Hypoxia	20
135	N2.Hypoxia	22
