1	N2	14
2	N2	14
3	N2	14
4	N2	16
5	N2	21
6	N2	21
7	N2	21
8	N2	21
9	N2	23
10	N2	23
11	N2	25
12	N2	28
13	N2	28
14	N2	28
15	N2	28
16	N2	32
17	N2	35
18	N2	14
19	N2	16
20	N2	16
21	N2	16
22	N2	16
23	N2	16
24	N2	18
25	N2	18
26	N2	21
27	N2	21
28	N2	21
29	N2	23
30	N2	23
31	N2	23
32	N2	23
33	N2	25
34	N2	25
35	N2	25
36	N2	25
37	N2	25
38	N2	25
39	N2	28
40	N2	28
41	N2	28
42	N2	28
43	N2	30
44	N2	30
45	N2	35
