1	N2.egl-9.(RNAi)	13
2	N2.egl-9.(RNAi)	13
3	N2.egl-9.(RNAi)	13
4	N2.egl-9.(RNAi)	16
5	N2.egl-9.(RNAi)	16
6	N2.egl-9.(RNAi)	19
7	N2.egl-9.(RNAi)	21
8	N2.egl-9.(RNAi)	21
9	N2.egl-9.(RNAi)	21
10	N2.egl-9.(RNAi)	21
11	N2.egl-9.(RNAi)	21
12	N2.egl-9.(RNAi)	23
13	N2.egl-9.(RNAi)	23
14	N2.egl-9.(RNAi)	23
15	N2.egl-9.(RNAi)	23
16	N2.egl-9.(RNAi)	23
17	N2.egl-9.(RNAi)	23
18	N2.egl-9.(RNAi)	26
19	N2.egl-9.(RNAi)	28
20	N2.egl-9.(RNAi)	28
21	N2.egl-9.(RNAi)	28
22	N2.egl-9.(RNAi)	28
23	N2.egl-9.(RNAi)	28
24	N2.egl-9.(RNAi)	28
25	N2.egl-9.(RNAi)	30
26	N2.egl-9.(RNAi)	30
27	N2.egl-9.(RNAi)	30
28	N2.egl-9.(RNAi)	33
29	N2.egl-9.(RNAi)	33
30	N2.egl-9.(RNAi)	33
31	N2.egl-9.(RNAi)	35
32	N2.egl-9.(RNAi)	35
33	N2.egl-9.(RNAi)	37
34	N2.egl-9.(RNAi)	37
35	N2.egl-9.(RNAi)	37
36	N2.egl-9.(RNAi)	37
37	N2.egl-9.(RNAi)	40
38	N2.egl-9.(RNAi)	40
39	N2.egl-9.(RNAi)	40
40	N2.egl-9.(RNAi)	42
41	N2.egl-9.(RNAi)	42
42	N2.egl-9.(RNAi)	42
43	N2.egl-9.(RNAi)	44
44	N2.egl-9.(RNAi)	47
45	N2.egl-9.(RNAi)	47
46	N2.egl-9.(RNAi)	47
47	N2.egl-9.(RNAi)	49
48	N2.egl-9.(RNAi)	51
49	N2.egl-9.(RNAi)	51
50	N2.egl-9.(RNAi)	13
51	N2.egl-9.(RNAi)	13
52	N2.egl-9.(RNAi)	23
53	N2.egl-9.(RNAi)	23
54	N2.egl-9.(RNAi)	26
55	N2.egl-9.(RNAi)	26
56	N2.egl-9.(RNAi)	28
57	N2.egl-9.(RNAi)	16
58	N2.egl-9.(RNAi)	16
59	N2.egl-9.(RNAi)	19
60	N2.egl-9.(RNAi)	21
61	N2.egl-9.(RNAi)	26
62	N2.egl-9.(RNAi)	26
63	N2.egl-9.(RNAi)	28
64	N2.egl-9.(RNAi)	28
65	N2.egl-9.(RNAi)	30
66	N2.egl-9.(RNAi)	30
67	N2.egl-9.(RNAi)	33
68	N2.egl-9.(RNAi)	13
69	N2.egl-9.(RNAi)	13
70	N2.egl-9.(RNAi)	13
71	N2.egl-9.(RNAi)	16
72	N2.egl-9.(RNAi)	19
73	N2.egl-9.(RNAi)	19
74	N2.egl-9.(RNAi)	19
75	N2.egl-9.(RNAi)	21
76	N2.egl-9.(RNAi)	21
77	N2.egl-9.(RNAi)	21
78	N2.egl-9.(RNAi)	21
79	N2.egl-9.(RNAi)	23
80	N2.egl-9.(RNAi)	23
81	N2.egl-9.(RNAi)	23
82	N2.egl-9.(RNAi)	23
83	N2.egl-9.(RNAi)	23
84	N2.egl-9.(RNAi)	23
85	N2.egl-9.(RNAi)	28
86	N2.egl-9.(RNAi)	28
87	N2.egl-9.(RNAi)	30
88	N2.egl-9.(RNAi)	30
89	N2.egl-9.(RNAi)	33
90	N2.egl-9.(RNAi)	33
91	N2.egl-9.(RNAi)	33
92	N2.egl-9.(RNAi)	33
93	N2.egl-9.(RNAi)	33
94	N2.egl-9.(RNAi)	33
95	N2.egl-9.(RNAi)	33
96	N2.egl-9.(RNAi)	35
97	N2.egl-9.(RNAi)	35
98	N2.egl-9.(RNAi)	35
99	N2.egl-9.(RNAi)	35
100	N2.egl-9.(RNAi)	35
101	N2.egl-9.(RNAi)	35
102	N2.egl-9.(RNAi)	35
103	N2.egl-9.(RNAi)	37
104	N2.egl-9.(RNAi)	37
105	N2.egl-9.(RNAi)	37
106	N2.egl-9.(RNAi)	37
107	N2.egl-9.(RNAi)	37
108	N2.egl-9.(RNAi)	37
109	N2.egl-9.(RNAi)	37
110	N2.egl-9.(RNAi)	37
111	N2.egl-9.(RNAi)	40
112	N2.egl-9.(RNAi)	40
113	N2.egl-9.(RNAi)	40
114	N2.egl-9.(RNAi)	40
115	N2.egl-9.(RNAi)	40
116	N2.egl-9.(RNAi)	42
117	N2.egl-9.(RNAi)	42
118	N2.egl-9.(RNAi)	42
119	N2.egl-9.(RNAi)	42
120	N2.egl-9.(RNAi)	42
121	N2.egl-9.(RNAi)	42
122	N2.egl-9.(RNAi)	42
123	N2.egl-9.(RNAi)	42
124	N2.egl-9.(RNAi)	42
125	N2.egl-9.(RNAi)	44
126	N2.egl-9.(RNAi)	44
127	N2.egl-9.(RNAi)	47
128	N2.egl-9.(RNAi)	47
129	N2.egl-9.(RNAi)	47
130	N2.egl-9.(RNAi)	47
131	N2.egl-9.(RNAi)	49
132	N2.egl-9.(RNAi)	16
133	N2.egl-9.(RNAi)	23
134	N2.egl-9.(RNAi)	26
135	N2.egl-9.(RNAi)	16
136	N2.egl-9.(RNAi)	23
137	N2.egl-9.(RNAi)	23
138	N2.egl-9.(RNAi)	26
139	N2.egl-9.(RNAi)	26
140	N2.egl-9.(RNAi)	28
141	N2.egl-9.(RNAi)	28
142	N2.egl-9.(RNAi)	28
143	N2.egl-9.(RNAi)	33
144	N2.egl-9.(RNAi)	33
145	N2.egl-9.(RNAi)	35
146	N2.egl-9.(RNAi)	21
147	N2.egl-9.(RNAi)	26
