1	egl-9	17
2	egl-9	17
3	egl-9	17
4	egl-9	20
5	egl-9	20
6	egl-9	20
7	egl-9	22
8	egl-9	22
9	egl-9	22
10	egl-9	22
11	egl-9	22
12	egl-9	22
13	egl-9	22
14	egl-9	22
15	egl-9	24
16	egl-9	24
17	egl-9	24
18	egl-9	27
19	egl-9	27
20	egl-9	27
21	egl-9	27
22	egl-9	27
23	egl-9	27
24	egl-9	27
25	egl-9	27
26	egl-9	27
27	egl-9	27
28	egl-9	27
29	egl-9	29
30	egl-9	29
31	egl-9	29
32	egl-9	29
33	egl-9	29
34	egl-9	29
35	egl-9	29
36	egl-9	31
37	egl-9	31
38	egl-9	31
39	egl-9	31
40	egl-9	31
41	egl-9	31
42	egl-9	31
43	egl-9	34
44	egl-9	34
45	egl-9	34
46	egl-9	34
47	egl-9	36
48	egl-9	36
49	egl-9	36
50	egl-9	48
51	egl-9	20
52	egl-9	20
53	egl-9	22
54	egl-9	22
55	egl-9	22
56	egl-9	22
57	egl-9	27
58	egl-9	27
59	egl-9	27
60	egl-9	27
61	egl-9	15
62	egl-9	17
63	egl-9	22
64	egl-9	22
65	egl-9	29
66	egl-9	15
67	egl-9	17
68	egl-9	20
69	egl-9	20
70	egl-9	20
71	egl-9	20
72	egl-9	20
73	egl-9	22
74	egl-9	22
75	egl-9	22
76	egl-9	22
77	egl-9	22
78	egl-9	22
79	egl-9	24
80	egl-9	24
81	egl-9	24
82	egl-9	24
83	egl-9	24
84	egl-9	24
85	egl-9	24
86	egl-9	24
87	egl-9	24
88	egl-9	27
89	egl-9	27
90	egl-9	27
91	egl-9	27
92	egl-9	27
93	egl-9	27
94	egl-9	27
95	egl-9	27
96	egl-9	27
97	egl-9	27
98	egl-9	27
99	egl-9	27
100	egl-9	27
101	egl-9	27
102	egl-9	27
103	egl-9	27
104	egl-9	27
105	egl-9	27
106	egl-9	29
107	egl-9	29
108	egl-9	29
109	egl-9	29
110	egl-9	29
111	egl-9	29
112	egl-9	29
113	egl-9	29
114	egl-9	29
115	egl-9	29
116	egl-9	31
117	egl-9	31
118	egl-9	31
119	egl-9	31
120	egl-9	31
121	egl-9	31
122	egl-9	31
123	egl-9	31
124	egl-9	36
125	egl-9	41
126	egl-9	15
127	egl-9	17
128	egl-9	17
129	egl-9	17
130	egl-9	22
131	egl-9	22
132	egl-9	22
133	egl-9	27
134	egl-9	29
135	egl-9	15
136	egl-9	17
137	egl-9	17
138	egl-9	17
139	egl-9	20
140	egl-9	20
141	egl-9	22
142	egl-9	22
143	egl-9	22
144	egl-9	22
145	egl-9	22
146	egl-9	22
147	egl-9	22
148	egl-9	24
149	egl-9	24
150	egl-9	24
151	egl-9	24
152	egl-9	24
153	egl-9	24
154	egl-9	24
155	egl-9	27
156	egl-9	27
157	egl-9	27
158	egl-9	27
159	egl-9	27
160	egl-9	27
161	egl-9	27
162	egl-9	27
163	egl-9	29
164	egl-9	29
165	egl-9	29
166	egl-9	29
167	egl-9	29
168	egl-9	29
169	egl-9	29
170	egl-9	29
171	egl-9	29
172	egl-9	31
173	egl-9	31
174	egl-9	31
175	egl-9	34
176	egl-9	34
177	egl-9	34
178	egl-9	34
179	egl-9	34
180	egl-9	34
181	egl-9	34
182	egl-9	36
183	egl-9	36
184	egl-9	36
185	egl-9	36
186	egl-9	36
187	egl-9	15
188	egl-9	20
189	egl-9	22
190	egl-9	22
191	egl-9	17
