1	N2.CCO-1(RNAi)	7
2	N2.CCO-1(RNAi)	9
3	N2.CCO-1(RNAi)	9
4	N2.CCO-1(RNAi)	9
5	N2.CCO-1(RNAi)	9
6	N2.CCO-1(RNAi)	9
7	N2.CCO-1(RNAi)	10
8	N2.CCO-1(RNAi)	10
9	N2.CCO-1(RNAi)	10
10	N2.CCO-1(RNAi)	12
11	N2.CCO-1(RNAi)	12
12	N2.CCO-1(RNAi)	12
13	N2.CCO-1(RNAi)	12
14	N2.CCO-1(RNAi)	12
15	N2.CCO-1(RNAi)	13
16	N2.CCO-1(RNAi)	13
17	N2.CCO-1(RNAi)	13
18	N2.CCO-1(RNAi)	13
19	N2.CCO-1(RNAi)	13
20	N2.CCO-1(RNAi)	13
21	N2.CCO-1(RNAi)	13
22	N2.CCO-1(RNAi)	13
23	N2.CCO-1(RNAi)	14
24	N2.CCO-1(RNAi)	14
25	N2.CCO-1(RNAi)	14
26	N2.CCO-1(RNAi)	14
27	N2.CCO-1(RNAi)	14
28	N2.CCO-1(RNAi)	14
29	N2.CCO-1(RNAi)	14
30	N2.CCO-1(RNAi)	14
31	N2.CCO-1(RNAi)	14
32	N2.CCO-1(RNAi)	16
33	N2.CCO-1(RNAi)	16
34	N2.CCO-1(RNAi)	16
35	N2.CCO-1(RNAi)	16
36	N2.CCO-1(RNAi)	16
37	N2.CCO-1(RNAi)	16
38	N2.CCO-1(RNAi)	16
39	N2.CCO-1(RNAi)	16
40	N2.CCO-1(RNAi)	16
41	N2.CCO-1(RNAi)	16
42	N2.CCO-1(RNAi)	16
43	N2.CCO-1(RNAi)	16
44	N2.CCO-1(RNAi)	16
45	N2.CCO-1(RNAi)	16
46	N2.CCO-1(RNAi)	16
47	N2.CCO-1(RNAi)	16
48	N2.CCO-1(RNAi)	16
49	N2.CCO-1(RNAi)	16
50	N2.CCO-1(RNAi)	17
51	N2.CCO-1(RNAi)	17
52	N2.CCO-1(RNAi)	17
53	N2.CCO-1(RNAi)	17
54	N2.CCO-1(RNAi)	19
55	N2.CCO-1(RNAi)	21
56	N2.CCO-1(RNAi)	21
57	N2.CCO-1(RNAi)	7
58	N2.CCO-1(RNAi)	7
59	N2.CCO-1(RNAi)	7
60	N2.CCO-1(RNAi)	10
61	N2.CCO-1(RNAi)	9
62	N2.CCO-1(RNAi)	9
63	N2.CCO-1(RNAi)	10
64	N2.CCO-1(RNAi)	12
65	N2.CCO-1(RNAi)	12
66	N2.CCO-1(RNAi)	12
67	N2.CCO-1(RNAi)	12
68	N2.CCO-1(RNAi)	13
69	N2.CCO-1(RNAi)	14
70	N2.CCO-1(RNAi)	14
71	N2.CCO-1(RNAi)	14
72	N2.CCO-1(RNAi)	14
73	N2.CCO-1(RNAi)	14
74	N2.CCO-1(RNAi)	16
75	N2.CCO-1(RNAi)	16
76	N2.CCO-1(RNAi)	16
77	N2.CCO-1(RNAi)	16
78	N2.CCO-1(RNAi)	16
79	N2.CCO-1(RNAi)	16
80	N2.CCO-1(RNAi)	16
81	N2.CCO-1(RNAi)	16
82	N2.CCO-1(RNAi)	16
83	N2.CCO-1(RNAi)	17
84	N2.CCO-1(RNAi)	17
85	N2.CCO-1(RNAi)	17
86	N2.CCO-1(RNAi)	17
87	N2.CCO-1(RNAi)	17
88	N2.CCO-1(RNAi)	17
89	N2.CCO-1(RNAi)	17
90	N2.CCO-1(RNAi)	19
91	N2.CCO-1(RNAi)	19
92	N2.CCO-1(RNAi)	19
93	N2.CCO-1(RNAi)	19
94	N2.CCO-1(RNAi)	21
95	N2.CCO-1(RNAi)	21
96	N2.CCO-1(RNAi)	21
97	N2.CCO-1(RNAi)	21
98	N2.CCO-1(RNAi)	21
99	N2.CCO-1(RNAi)	23
100	N2.CCO-1(RNAi)	9
101	N2.CCO-1(RNAi)	10
102	N2.CCO-1(RNAi)	13
103	N2.CCO-1(RNAi)	9
104	N2.CCO-1(RNAi)	9
105	N2.CCO-1(RNAi)	10
106	N2.CCO-1(RNAi)	10
107	N2.CCO-1(RNAi)	12
108	N2.CCO-1(RNAi)	12
109	N2.CCO-1(RNAi)	12
110	N2.CCO-1(RNAi)	12
111	N2.CCO-1(RNAi)	12
112	N2.CCO-1(RNAi)	12
113	N2.CCO-1(RNAi)	12
114	N2.CCO-1(RNAi)	12
115	N2.CCO-1(RNAi)	12
116	N2.CCO-1(RNAi)	12
117	N2.CCO-1(RNAi)	12
118	N2.CCO-1(RNAi)	12
119	N2.CCO-1(RNAi)	12
120	N2.CCO-1(RNAi)	12
121	N2.CCO-1(RNAi)	13
122	N2.CCO-1(RNAi)	13
123	N2.CCO-1(RNAi)	13
124	N2.CCO-1(RNAi)	13
125	N2.CCO-1(RNAi)	13
126	N2.CCO-1(RNAi)	13
127	N2.CCO-1(RNAi)	13
128	N2.CCO-1(RNAi)	13
129	N2.CCO-1(RNAi)	13
130	N2.CCO-1(RNAi)	13
131	N2.CCO-1(RNAi)	13
132	N2.CCO-1(RNAi)	14
133	N2.CCO-1(RNAi)	14
134	N2.CCO-1(RNAi)	14
135	N2.CCO-1(RNAi)	14
136	N2.CCO-1(RNAi)	14
137	N2.CCO-1(RNAi)	14
138	N2.CCO-1(RNAi)	14
139	N2.CCO-1(RNAi)	14
140	N2.CCO-1(RNAi)	16
141	N2.CCO-1(RNAi)	16
142	N2.CCO-1(RNAi)	16
143	N2.CCO-1(RNAi)	16
144	N2.CCO-1(RNAi)	16
145	N2.CCO-1(RNAi)	16
146	N2.CCO-1(RNAi)	16
147	N2.CCO-1(RNAi)	16
148	N2.CCO-1(RNAi)	16
149	N2.CCO-1(RNAi)	16
150	N2.CCO-1(RNAi)	16
151	N2.CCO-1(RNAi)	16
152	N2.CCO-1(RNAi)	16
153	N2.CCO-1(RNAi)	16
154	N2.CCO-1(RNAi)	16
155	N2.CCO-1(RNAi)	16
156	N2.CCO-1(RNAi)	16
157	N2.CCO-1(RNAi)	16
158	N2.CCO-1(RNAi)	16
159	N2.CCO-1(RNAi)	16
160	N2.CCO-1(RNAi)	16
161	N2.CCO-1(RNAi)	16
162	N2.CCO-1(RNAi)	16
163	N2.CCO-1(RNAi)	16
164	N2.CCO-1(RNAi)	16
165	N2.CCO-1(RNAi)	16
166	N2.CCO-1(RNAi)	16
167	N2.CCO-1(RNAi)	16
168	N2.CCO-1(RNAi)	16
169	N2.CCO-1(RNAi)	16
170	N2.CCO-1(RNAi)	16
171	N2.CCO-1(RNAi)	16
172	N2.CCO-1(RNAi)	17
173	N2.CCO-1(RNAi)	17
174	N2.CCO-1(RNAi)	17
175	N2.CCO-1(RNAi)	17
176	N2.CCO-1(RNAi)	17
177	N2.CCO-1(RNAi)	17
178	N2.CCO-1(RNAi)	17
179	N2.CCO-1(RNAi)	17
180	N2.CCO-1(RNAi)	17
181	N2.CCO-1(RNAi)	17
182	N2.CCO-1(RNAi)	17
183	N2.CCO-1(RNAi)	19
184	N2.CCO-1(RNAi)	19
185	N2.CCO-1(RNAi)	19
186	N2.CCO-1(RNAi)	7
187	N2.CCO-1(RNAi)	9
188	N2.CCO-1(RNAi)	9
189	N2.CCO-1(RNAi)	12
