1	sir-2.1	18
2	sir-2.1	20
3	sir-2.1	20
4	sir-2.1	25
5	sir-2.1	25
6	sir-2.1	27
7	sir-2.1	27
8	sir-2.1	27
9	sir-2.1	29
10	sir-2.1	29
11	sir-2.1	29
12	sir-2.1	31
13	sir-2.1	33
14	sir-2.1	33
15	sir-2.1	33
16	sir-2.1	20
17	sir-2.1	23
18	sir-2.1	20
19	sir-2.1	23
20	sir-2.1	23
21	sir-2.1	25
22	sir-2.1	25
23	sir-2.1	25
24	sir-2.1	25
25	sir-2.1	25
26	sir-2.1	25
27	sir-2.1	25
28	sir-2.1	27
29	sir-2.1	27
30	sir-2.1	27
31	sir-2.1	23
32	sir-2.1	23
33	sir-2.1	25
34	sir-2.1	25
35	sir-2.1	25
36	sir-2.1	25
37	sir-2.1	25
38	sir-2.1	27
39	sir-2.1	27
40	sir-2.1	27
41	sir-2.1	27
42	sir-2.1	27
43	sir-2.1	29
44	sir-2.1	29
45	sir-2.1	29
46	sir-2.1	29
47	sir-2.1	29
48	sir-2.1	29
49	sir-2.1	29
50	sir-2.1	29
51	sir-2.1	31
52	sir-2.1	31
53	sir-2.1	31
54	sir-2.1	31
55	sir-2.1	31
56	sir-2.1	31
57	sir-2.1	33
58	sir-2.1	33
59	sir-2.1	33
60	sir-2.1	33
61	sir-2.1	33
62	sir-2.1	36
63	sir-2.1	36
64	sir-2.1	36
65	sir-2.1	36
66	sir-2.1	36
67	sir-2.1	25
68	sir-2.1	20
69	sir-2.1	23
70	sir-2.1	25
71	sir-2.1	27
72	sir-2.1	27
73	sir-2.1	27
74	sir-2.1	27
75	sir-2.1	33
76	sir-2.1	23
77	sir-2.1	25
