1	N2.CLK-1(RNAi)	8
2	N2.CLK-1(RNAi)	12
3	N2.CLK-1(RNAi)	12
4	N2.CLK-1(RNAi)	12
5	N2.CLK-1(RNAi)	12
6	N2.CLK-1(RNAi)	12
7	N2.CLK-1(RNAi)	12
8	N2.CLK-1(RNAi)	12
9	N2.CLK-1(RNAi)	12
10	N2.CLK-1(RNAi)	12
11	N2.CLK-1(RNAi)	12
12	N2.CLK-1(RNAi)	12
13	N2.CLK-1(RNAi)	12
14	N2.CLK-1(RNAi)	12
15	N2.CLK-1(RNAi)	12
16	N2.CLK-1(RNAi)	12
17	N2.CLK-1(RNAi)	12
18	N2.CLK-1(RNAi)	12
19	N2.CLK-1(RNAi)	12
20	N2.CLK-1(RNAi)	12
21	N2.CLK-1(RNAi)	12
22	N2.CLK-1(RNAi)	12
23	N2.CLK-1(RNAi)	15
24	N2.CLK-1(RNAi)	15
25	N2.CLK-1(RNAi)	15
26	N2.CLK-1(RNAi)	15
27	N2.CLK-1(RNAi)	15
28	N2.CLK-1(RNAi)	15
29	N2.CLK-1(RNAi)	15
30	N2.CLK-1(RNAi)	15
31	N2.CLK-1(RNAi)	15
32	N2.CLK-1(RNAi)	15
33	N2.CLK-1(RNAi)	15
34	N2.CLK-1(RNAi)	15
35	N2.CLK-1(RNAi)	15
36	N2.CLK-1(RNAi)	15
37	N2.CLK-1(RNAi)	15
38	N2.CLK-1(RNAi)	15
39	N2.CLK-1(RNAi)	15
40	N2.CLK-1(RNAi)	15
41	N2.CLK-1(RNAi)	15
42	N2.CLK-1(RNAi)	15
43	N2.CLK-1(RNAi)	15
44	N2.CLK-1(RNAi)	15
45	N2.CLK-1(RNAi)	15
46	N2.CLK-1(RNAi)	15
47	N2.CLK-1(RNAi)	15
48	N2.CLK-1(RNAi)	15
49	N2.CLK-1(RNAi)	15
50	N2.CLK-1(RNAi)	15
51	N2.CLK-1(RNAi)	15
52	N2.CLK-1(RNAi)	15
53	N2.CLK-1(RNAi)	15
54	N2.CLK-1(RNAi)	15
55	N2.CLK-1(RNAi)	15
56	N2.CLK-1(RNAi)	15
57	N2.CLK-1(RNAi)	15
58	N2.CLK-1(RNAi)	15
59	N2.CLK-1(RNAi)	15
60	N2.CLK-1(RNAi)	15
61	N2.CLK-1(RNAi)	15
62	N2.CLK-1(RNAi)	15
63	N2.CLK-1(RNAi)	15
64	N2.CLK-1(RNAi)	15
65	N2.CLK-1(RNAi)	15
66	N2.CLK-1(RNAi)	15
67	N2.CLK-1(RNAi)	15
68	N2.CLK-1(RNAi)	15
69	N2.CLK-1(RNAi)	17
70	N2.CLK-1(RNAi)	17
71	N2.CLK-1(RNAi)	17
72	N2.CLK-1(RNAi)	17
73	N2.CLK-1(RNAi)	17
74	N2.CLK-1(RNAi)	17
75	N2.CLK-1(RNAi)	17
76	N2.CLK-1(RNAi)	17
77	N2.CLK-1(RNAi)	17
78	N2.CLK-1(RNAi)	17
79	N2.CLK-1(RNAi)	17
80	N2.CLK-1(RNAi)	17
81	N2.CLK-1(RNAi)	17
82	N2.CLK-1(RNAi)	17
83	N2.CLK-1(RNAi)	17
84	N2.CLK-1(RNAi)	17
85	N2.CLK-1(RNAi)	17
86	N2.CLK-1(RNAi)	17
87	N2.CLK-1(RNAi)	20
88	N2.CLK-1(RNAi)	20
89	N2.CLK-1(RNAi)	20
90	N2.CLK-1(RNAi)	20
91	N2.CLK-1(RNAi)	20
92	N2.CLK-1(RNAi)	20
93	N2.CLK-1(RNAi)	20
94	N2.CLK-1(RNAi)	20
95	N2.CLK-1(RNAi)	20
96	N2.CLK-1(RNAi)	20
97	N2.CLK-1(RNAi)	20
98	N2.CLK-1(RNAi)	20
99	N2.CLK-1(RNAi)	20
100	N2.CLK-1(RNAi)	22
101	N2.CLK-1(RNAi)	22
