1	vhl-1	18
2	vhl-1	18
3	vhl-1	18
4	vhl-1	18
5	vhl-1	18
6	vhl-1	18
7	vhl-1	20
8	vhl-1	20
9	vhl-1	20
10	vhl-1	23
11	vhl-1	23
12	vhl-1	23
13	vhl-1	23
14	vhl-1	23
15	vhl-1	23
16	vhl-1	23
17	vhl-1	23
18	vhl-1	23
19	vhl-1	23
20	vhl-1	23
21	vhl-1	23
22	vhl-1	23
23	vhl-1	23
24	vhl-1	23
25	vhl-1	23
26	vhl-1	23
27	vhl-1	23
28	vhl-1	23
29	vhl-1	23
30	vhl-1	23
31	vhl-1	23
32	vhl-1	23
33	vhl-1	25
34	vhl-1	25
35	vhl-1	25
36	vhl-1	25
37	vhl-1	25
38	vhl-1	25
39	vhl-1	25
40	vhl-1	25
41	vhl-1	25
42	vhl-1	25
43	vhl-1	25
44	vhl-1	25
45	vhl-1	25
46	vhl-1	25
47	vhl-1	25
48	vhl-1	25
49	vhl-1	25
50	vhl-1	25
51	vhl-1	25
52	vhl-1	25
53	vhl-1	25
54	vhl-1	25
55	vhl-1	25
56	vhl-1	27
57	vhl-1	27
58	vhl-1	27
59	vhl-1	27
60	vhl-1	27
61	vhl-1	27
62	vhl-1	27
63	vhl-1	27
64	vhl-1	27
65	vhl-1	27
66	vhl-1	27
67	vhl-1	32
68	vhl-1	32
69	vhl-1	32
70	vhl-1	32
71	vhl-1	32
72	vhl-1	32
73	vhl-1	32
74	vhl-1	32
75	vhl-1	32
76	vhl-1	32
77	vhl-1	32
78	vhl-1	34
79	vhl-1	34
80	vhl-1	34
81	vhl-1	34
82	vhl-1	34
83	vhl-1	34
84	vhl-1	34
85	vhl-1	34
86	vhl-1	34
87	vhl-1	18
88	vhl-1	20
89	vhl-1	32
90	vhl-1	32
91	vhl-1	32
92	vhl-1	18
93	vhl-1	18
94	vhl-1	18
95	vhl-1	20
96	vhl-1	34
97	vhl-1	18
98	vhl-1	18
99	vhl-1	18
100	vhl-1	18
101	vhl-1	18
102	vhl-1	20
103	vhl-1	20
104	vhl-1	20
105	vhl-1	20
106	vhl-1	20
107	vhl-1	20
108	vhl-1	20
109	vhl-1	23
110	vhl-1	23
111	vhl-1	23
112	vhl-1	23
113	vhl-1	23
114	vhl-1	23
115	vhl-1	23
116	vhl-1	23
117	vhl-1	23
118	vhl-1	23
119	vhl-1	23
120	vhl-1	23
121	vhl-1	23
122	vhl-1	23
123	vhl-1	23
124	vhl-1	23
125	vhl-1	23
126	vhl-1	23
127	vhl-1	23
128	vhl-1	23
129	vhl-1	23
130	vhl-1	23
131	vhl-1	23
132	vhl-1	23
133	vhl-1	23
134	vhl-1	25
135	vhl-1	25
136	vhl-1	25
137	vhl-1	25
138	vhl-1	25
139	vhl-1	25
140	vhl-1	25
141	vhl-1	25
142	vhl-1	25
143	vhl-1	25
144	vhl-1	25
145	vhl-1	25
146	vhl-1	25
147	vhl-1	25
148	vhl-1	25
149	vhl-1	25
150	vhl-1	25
151	vhl-1	25
152	vhl-1	25
153	vhl-1	25
154	vhl-1	25
155	vhl-1	25
156	vhl-1	25
157	vhl-1	25
158	vhl-1	25
159	vhl-1	25
160	vhl-1	25
161	vhl-1	25
162	vhl-1	25
163	vhl-1	25
164	vhl-1	27
165	vhl-1	27
166	vhl-1	27
167	vhl-1	27
168	vhl-1	27
169	vhl-1	27
170	vhl-1	27
171	vhl-1	27
172	vhl-1	27
173	vhl-1	27
174	vhl-1	27
175	vhl-1	27
176	vhl-1	27
177	vhl-1	27
178	vhl-1	32
179	vhl-1	32
180	vhl-1	32
181	vhl-1	32
182	vhl-1	32
183	vhl-1	32
184	vhl-1	32
185	vhl-1	34
186	vhl-1	34
187	vhl-1	34
188	vhl-1	34
189	vhl-1	34
190	vhl-1	34
191	vhl-1	34
192	vhl-1	34
193	vhl-1	34
194	vhl-1	18
195	vhl-1	18
196	vhl-1	32
197	vhl-1	32
198	vhl-1	32
199	vhl-1	32
200	vhl-1	34
201	vhl-1	18
202	vhl-1	18
203	vhl-1	18
204	vhl-1	18
205	vhl-1	32
