1	WT.rpl-6(RNAi)	17
2	WT.rpl-6(RNAi)	19
3	WT.rpl-6(RNAi)	22
4	WT.rpl-6(RNAi)	22
5	WT.rpl-6(RNAi)	22
6	WT.rpl-6(RNAi)	24
7	WT.rpl-6(RNAi)	24
8	WT.rpl-6(RNAi)	10
9	WT.rpl-6(RNAi)	12
10	WT.rpl-6(RNAi)	12
11	WT.rpl-6(RNAi)	12
12	WT.rpl-6(RNAi)	14
13	WT.rpl-6(RNAi)	14
14	WT.rpl-6(RNAi)	14
15	WT.rpl-6(RNAi)	14
16	WT.rpl-6(RNAi)	14
17	WT.rpl-6(RNAi)	14
18	WT.rpl-6(RNAi)	14
19	WT.rpl-6(RNAi)	17
20	WT.rpl-6(RNAi)	17
21	WT.rpl-6(RNAi)	17
22	WT.rpl-6(RNAi)	17
23	WT.rpl-6(RNAi)	17
24	WT.rpl-6(RNAi)	17
25	WT.rpl-6(RNAi)	17
26	WT.rpl-6(RNAi)	17
27	WT.rpl-6(RNAi)	17
28	WT.rpl-6(RNAi)	17
29	WT.rpl-6(RNAi)	17
30	WT.rpl-6(RNAi)	17
31	WT.rpl-6(RNAi)	17
32	WT.rpl-6(RNAi)	17
33	WT.rpl-6(RNAi)	17
34	WT.rpl-6(RNAi)	17
35	WT.rpl-6(RNAi)	19
36	WT.rpl-6(RNAi)	19
37	WT.rpl-6(RNAi)	19
38	WT.rpl-6(RNAi)	19
39	WT.rpl-6(RNAi)	19
40	WT.rpl-6(RNAi)	22
41	WT.rpl-6(RNAi)	22
42	WT.rpl-6(RNAi)	14
43	WT.rpl-6(RNAi)	14
44	WT.rpl-6(RNAi)	14
45	WT.rpl-6(RNAi)	14
46	WT.rpl-6(RNAi)	16
47	WT.rpl-6(RNAi)	16
48	WT.rpl-6(RNAi)	18
49	WT.rpl-6(RNAi)	18
50	WT.rpl-6(RNAi)	18
51	WT.rpl-6(RNAi)	18
52	WT.rpl-6(RNAi)	18
53	WT.rpl-6(RNAi)	18
54	WT.rpl-6(RNAi)	18
55	WT.rpl-6(RNAi)	18
56	WT.rpl-6(RNAi)	18
57	WT.rpl-6(RNAi)	21
58	WT.rpl-6(RNAi)	21
59	WT.rpl-6(RNAi)	21
60	WT.rpl-6(RNAi)	21
61	WT.rpl-6(RNAi)	21
62	WT.rpl-6(RNAi)	21
63	WT.rpl-6(RNAi)	21
64	WT.rpl-6(RNAi)	21
65	WT.rpl-6(RNAi)	21
66	WT.rpl-6(RNAi)	21
67	WT.rpl-6(RNAi)	21
68	WT.rpl-6(RNAi)	23
69	WT.rpl-6(RNAi)	23
70	WT.rpl-6(RNAi)	25
71	WT.rpl-6(RNAi)	25
72	WT.rpl-6(RNAi)	25
73	WT.rpl-6(RNAi)	29
74	WT.rpl-6(RNAi)	29
75	WT.rpl-6(RNAi)	32
76	WT.rpl-6(RNAi)	14
77	WT.rpl-6(RNAi)	16
78	WT.rpl-6(RNAi)	16
79	WT.rpl-6(RNAi)	16
80	WT.rpl-6(RNAi)	18
81	WT.rpl-6(RNAi)	18
82	WT.rpl-6(RNAi)	18
83	WT.rpl-6(RNAi)	18
84	WT.rpl-6(RNAi)	18
85	WT.rpl-6(RNAi)	18
86	WT.rpl-6(RNAi)	18
87	WT.rpl-6(RNAi)	18
88	WT.rpl-6(RNAi)	18
89	WT.rpl-6(RNAi)	18
90	WT.rpl-6(RNAi)	21
91	WT.rpl-6(RNAi)	21
92	WT.rpl-6(RNAi)	21
93	WT.rpl-6(RNAi)	21
94	WT.rpl-6(RNAi)	21
95	WT.rpl-6(RNAi)	21
96	WT.rpl-6(RNAi)	21
97	WT.rpl-6(RNAi)	21
98	WT.rpl-6(RNAi)	21
99	WT.rpl-6(RNAi)	21
100	WT.rpl-6(RNAi)	21
101	WT.rpl-6(RNAi)	21
102	WT.rpl-6(RNAi)	21
103	WT.rpl-6(RNAi)	21
104	WT.rpl-6(RNAi)	23
105	WT.rpl-6(RNAi)	23
106	WT.rpl-6(RNAi)	23
107	WT.rpl-6(RNAi)	23
108	WT.rpl-6(RNAi)	23
109	WT.rpl-6(RNAi)	25
110	WT.rpl-6(RNAi)	25
111	WT.rpl-6(RNAi)	25
112	WT.rpl-6(RNAi)	29
113	WT.rpl-6(RNAi)	29
114	WT.rpl-6(RNAi)	29
115	WT.rpl-6(RNAi)	32
116	WT.rpl-6(RNAi)	14
117	WT.rpl-6(RNAi)	14
118	WT.rpl-6(RNAi)	17
119	WT.rpl-6(RNAi)	21
120	WT.rpl-6(RNAi)	21
121	WT.rpl-6(RNAi)	21
122	WT.rpl-6(RNAi)	21
123	WT.rpl-6(RNAi)	21
124	WT.rpl-6(RNAi)	21
125	WT.rpl-6(RNAi)	21
126	WT.rpl-6(RNAi)	21
127	WT.rpl-6(RNAi)	21
128	WT.rpl-6(RNAi)	21
129	WT.rpl-6(RNAi)	24
130	WT.rpl-6(RNAi)	24
131	WT.rpl-6(RNAi)	24
132	WT.rpl-6(RNAi)	24
133	WT.rpl-6(RNAi)	24
134	WT.rpl-6(RNAi)	24
135	WT.rpl-6(RNAi)	24
136	WT.rpl-6(RNAi)	27
137	WT.rpl-6(RNAi)	27
138	WT.rpl-6(RNAi)	27
139	WT.rpl-6(RNAi)	17
140	WT.rpl-6(RNAi)	17
141	WT.rpl-6(RNAi)	17
142	WT.rpl-6(RNAi)	21
143	WT.rpl-6(RNAi)	21
144	WT.rpl-6(RNAi)	21
145	WT.rpl-6(RNAi)	21
146	WT.rpl-6(RNAi)	21
147	WT.rpl-6(RNAi)	21
148	WT.rpl-6(RNAi)	21
149	WT.rpl-6(RNAi)	21
150	WT.rpl-6(RNAi)	21
151	WT.rpl-6(RNAi)	21
152	WT.rpl-6(RNAi)	21
153	WT.rpl-6(RNAi)	21
154	WT.rpl-6(RNAi)	21
155	WT.rpl-6(RNAi)	24
156	WT.rpl-6(RNAi)	24
157	WT.rpl-6(RNAi)	24
158	WT.rpl-6(RNAi)	24
159	WT.rpl-6(RNAi)	24
160	WT.rpl-6(RNAi)	27
161	WT.rpl-6(RNAi)	27
162	WT.rpl-6(RNAi)	27
163	WT.rpl-6(RNAi)	17
164	WT.rpl-6(RNAi)	17
165	WT.rpl-6(RNAi)	21
166	WT.rpl-6(RNAi)	21
167	WT.rpl-6(RNAi)	21
168	WT.rpl-6(RNAi)	15
169	WT.rpl-6(RNAi)	15
170	WT.rpl-6(RNAi)	17
171	WT.rpl-6(RNAi)	17
172	WT.rpl-6(RNAi)	17
173	WT.rpl-6(RNAi)	17
174	WT.rpl-6(RNAi)	17
175	WT.rpl-6(RNAi)	21
176	WT.rpl-6(RNAi)	21
177	WT.rpl-6(RNAi)	21
178	WT.rpl-6(RNAi)	13
179	WT.rpl-6(RNAi)	15
180	WT.rpl-6(RNAi)	15
181	WT.rpl-6(RNAi)	21
182	WT.rpl-6(RNAi)	21
183	WT.rpl-6(RNAi)	21
184	WT.rpl-6(RNAi)	21
185	WT.rpl-6(RNAi)	21
186	WT.rpl-6(RNAi)	21
187	WT.rpl-6(RNAi)	21
188	WT.rpl-6(RNAi)	21
189	WT.rpl-6(RNAi)	21
190	WT.rpl-6(RNAi)	21
191	WT.rpl-6(RNAi)	21
192	WT.rpl-6(RNAi)	21
193	WT.rpl-6(RNAi)	21
194	WT.rpl-6(RNAi)	21
195	WT.rpl-6(RNAi)	24
196	WT.rpl-6(RNAi)	24
197	WT.rpl-6(RNAi)	24
198	WT.rpl-6(RNAi)	24
199	WT.rpl-6(RNAi)	24
200	WT.rpl-6(RNAi)	24
201	WT.rpl-6(RNAi)	24
202	WT.rpl-6(RNAi)	24
203	WT.rpl-6(RNAi)	24
204	WT.rpl-6(RNAi)	24
205	WT.rpl-6(RNAi)	24
206	WT.rpl-6(RNAi)	24
207	WT.rpl-6(RNAi)	24
208	WT.rpl-6(RNAi)	24
209	WT.rpl-6(RNAi)	24
210	WT.rpl-6(RNAi)	24
211	WT.rpl-6(RNAi)	27
212	WT.rpl-6(RNAi)	27
213	WT.rpl-6(RNAi)	27
214	WT.rpl-6(RNAi)	27
215	WT.rpl-6(RNAi)	27
216	WT.rpl-6(RNAi)	27
217	WT.rpl-6(RNAi)	27
218	WT.rpl-6(RNAi)	27
219	WT.rpl-6(RNAi)	27
220	WT.rpl-6(RNAi)	27
221	WT.rpl-6(RNAi)	27
222	WT.rpl-6(RNAi)	29
223	WT.rpl-6(RNAi)	36
224	WT.rpl-6(RNAi)	17
225	WT.rpl-6(RNAi)	21
226	WT.rpl-6(RNAi)	21
227	WT.rpl-6(RNAi)	21
228	WT.rpl-6(RNAi)	21
229	WT.rpl-6(RNAi)	21
230	WT.rpl-6(RNAi)	21
231	WT.rpl-6(RNAi)	24
232	WT.rpl-6(RNAi)	17
233	WT.rpl-6(RNAi)	21
234	WT.rpl-6(RNAi)	21
235	WT.rpl-6(RNAi)	21
236	WT.rpl-6(RNAi)	21
237	WT.rpl-6(RNAi)	15
