1	N2.CLK-1(RNAi)	12
2	N2.CLK-1(RNAi)	12
3	N2.CLK-1(RNAi)	12
4	N2.CLK-1(RNAi)	15
5	N2.CLK-1(RNAi)	15
6	N2.CLK-1(RNAi)	15
7	N2.CLK-1(RNAi)	15
8	N2.CLK-1(RNAi)	15
9	N2.CLK-1(RNAi)	15
10	N2.CLK-1(RNAi)	15
11	N2.CLK-1(RNAi)	15
12	N2.CLK-1(RNAi)	15
13	N2.CLK-1(RNAi)	19
14	N2.CLK-1(RNAi)	19
15	N2.CLK-1(RNAi)	19
16	N2.CLK-1(RNAi)	19
17	N2.CLK-1(RNAi)	19
18	N2.CLK-1(RNAi)	19
19	N2.CLK-1(RNAi)	19
20	N2.CLK-1(RNAi)	19
21	N2.CLK-1(RNAi)	19
22	N2.CLK-1(RNAi)	19
23	N2.CLK-1(RNAi)	19
24	N2.CLK-1(RNAi)	19
25	N2.CLK-1(RNAi)	19
26	N2.CLK-1(RNAi)	19
27	N2.CLK-1(RNAi)	19
28	N2.CLK-1(RNAi)	19
29	N2.CLK-1(RNAi)	19
30	N2.CLK-1(RNAi)	19
31	N2.CLK-1(RNAi)	21
32	N2.CLK-1(RNAi)	21
33	N2.CLK-1(RNAi)	21
34	N2.CLK-1(RNAi)	21
35	N2.CLK-1(RNAi)	21
36	N2.CLK-1(RNAi)	21
37	N2.CLK-1(RNAi)	21
38	N2.CLK-1(RNAi)	26
39	N2.CLK-1(RNAi)	26
40	N2.CLK-1(RNAi)	26
41	N2.CLK-1(RNAi)	26
42	N2.CLK-1(RNAi)	30
43	N2.CLK-1(RNAi)	15
44	N2.CLK-1(RNAi)	15
45	N2.CLK-1(RNAi)	15
46	N2.CLK-1(RNAi)	19
47	N2.CLK-1(RNAi)	15
48	N2.CLK-1(RNAi)	19
49	N2.CLK-1(RNAi)	19
50	N2.CLK-1(RNAi)	19
51	N2.CLK-1(RNAi)	21
52	N2.CLK-1(RNAi)	15
53	N2.CLK-1(RNAi)	12
54	N2.CLK-1(RNAi)	15
55	N2.CLK-1(RNAi)	15
56	N2.CLK-1(RNAi)	15
57	N2.CLK-1(RNAi)	15
58	N2.CLK-1(RNAi)	15
59	N2.CLK-1(RNAi)	15
60	N2.CLK-1(RNAi)	15
61	N2.CLK-1(RNAi)	19
62	N2.CLK-1(RNAi)	19
63	N2.CLK-1(RNAi)	19
64	N2.CLK-1(RNAi)	19
65	N2.CLK-1(RNAi)	19
66	N2.CLK-1(RNAi)	19
67	N2.CLK-1(RNAi)	19
68	N2.CLK-1(RNAi)	19
69	N2.CLK-1(RNAi)	19
70	N2.CLK-1(RNAi)	19
71	N2.CLK-1(RNAi)	19
72	N2.CLK-1(RNAi)	19
73	N2.CLK-1(RNAi)	19
74	N2.CLK-1(RNAi)	19
75	N2.CLK-1(RNAi)	19
76	N2.CLK-1(RNAi)	19
77	N2.CLK-1(RNAi)	21
78	N2.CLK-1(RNAi)	21
79	N2.CLK-1(RNAi)	21
80	N2.CLK-1(RNAi)	21
81	N2.CLK-1(RNAi)	21
82	N2.CLK-1(RNAi)	21
83	N2.CLK-1(RNAi)	21
84	N2.CLK-1(RNAi)	23
85	N2.CLK-1(RNAi)	23
86	N2.CLK-1(RNAi)	23
87	N2.CLK-1(RNAi)	23
88	N2.CLK-1(RNAi)	23
89	N2.CLK-1(RNAi)	26
90	N2.CLK-1(RNAi)	28
91	N2.CLK-1(RNAi)	28
92	N2.CLK-1(RNAi)	28
93	N2.CLK-1(RNAi)	15
94	N2.CLK-1(RNAi)	15
95	N2.CLK-1(RNAi)	15
96	N2.CLK-1(RNAi)	15
97	N2.CLK-1(RNAi)	15
98	N2.CLK-1(RNAi)	15
99	N2.CLK-1(RNAi)	19
100	N2.CLK-1(RNAi)	19
101	N2.CLK-1(RNAi)	19
102	N2.CLK-1(RNAi)	19
103	N2.CLK-1(RNAi)	19
104	N2.CLK-1(RNAi)	19
105	N2.CLK-1(RNAi)	21
106	N2.CLK-1(RNAi)	15
107	N2.CLK-1(RNAi)	19
108	N2.CLK-1(RNAi)	19
109	N2.CLK-1(RNAi)	19
110	N2.CLK-1(RNAi)	21
111	N2.CLK-1(RNAi)	19
