1	0.mM.caffeine	29
2	0.mM.caffeine	29
3	0.mM.caffeine	32
4	0.mM.caffeine	32
5	0.mM.caffeine	32
6	0.mM.caffeine	32
7	0.mM.caffeine	35
8	0.mM.caffeine	35
9	0.mM.caffeine	35
10	0.mM.caffeine	35
11	0.mM.caffeine	32
12	0.mM.caffeine	32
13	0.mM.caffeine	29
14	0.mM.caffeine	18
15	0.mM.caffeine	18
16	0.mM.caffeine	24
17	0.mM.caffeine	24
18	0.mM.caffeine	29
19	0.mM.caffeine	29
20	0.mM.caffeine	32
21	0.mM.caffeine	32
22	0.mM.caffeine	32
23	0.mM.caffeine	32
24	0.mM.caffeine	32
25	0.mM.caffeine	35
26	0.mM.caffeine	35
27	0.mM.caffeine	37
28	0.mM.caffeine	39
29	0.mM.caffeine	21
30	0.mM.caffeine	37
31	0.mM.caffeine	21
32	0.mM.caffeine	29
33	0.mM.caffeine	24
34	0.mM.caffeine	24
35	0.mM.caffeine	29
36	0.mM.caffeine	32
37	0.mM.caffeine	32
38	0.mM.caffeine	32
39	0.mM.caffeine	32
40	0.mM.caffeine	32
41	0.mM.caffeine	32
42	0.mM.caffeine	32
43	0.mM.caffeine	32
44	0.mM.caffeine	32
45	0.mM.caffeine	32
46	0.mM.caffeine	35
47	0.mM.caffeine	35
48	0.mM.caffeine	37
49	0.mM.caffeine	37
50	0.mM.caffeine	37
51	0.mM.caffeine	37
52	0.mM.caffeine	37
53	0.mM.caffeine	39
54	0.mM.caffeine	29
55	0.mM.caffeine	32
