1	N2.HIF-1(RNAi)	15
2	N2.HIF-1(RNAi)	18
3	N2.HIF-1(RNAi)	18
4	N2.HIF-1(RNAi)	18
5	N2.HIF-1(RNAi)	18
6	N2.HIF-1(RNAi)	18
7	N2.HIF-1(RNAi)	18
8	N2.HIF-1(RNAi)	20
9	N2.HIF-1(RNAi)	20
10	N2.HIF-1(RNAi)	20
11	N2.HIF-1(RNAi)	20
12	N2.HIF-1(RNAi)	20
13	N2.HIF-1(RNAi)	20
14	N2.HIF-1(RNAi)	20
15	N2.HIF-1(RNAi)	20
16	N2.HIF-1(RNAi)	20
17	N2.HIF-1(RNAi)	20
18	N2.HIF-1(RNAi)	20
19	N2.HIF-1(RNAi)	20
20	N2.HIF-1(RNAi)	22
21	N2.HIF-1(RNAi)	22
22	N2.HIF-1(RNAi)	22
23	N2.HIF-1(RNAi)	22
24	N2.HIF-1(RNAi)	22
25	N2.HIF-1(RNAi)	22
26	N2.HIF-1(RNAi)	22
27	N2.HIF-1(RNAi)	22
28	N2.HIF-1(RNAi)	22
29	N2.HIF-1(RNAi)	22
30	N2.HIF-1(RNAi)	25
31	N2.HIF-1(RNAi)	25
32	N2.HIF-1(RNAi)	25
33	N2.HIF-1(RNAi)	25
34	N2.HIF-1(RNAi)	25
35	N2.HIF-1(RNAi)	25
36	N2.HIF-1(RNAi)	25
37	N2.HIF-1(RNAi)	15
38	N2.HIF-1(RNAi)	15
39	N2.HIF-1(RNAi)	18
40	N2.HIF-1(RNAi)	13
41	N2.HIF-1(RNAi)	18
42	N2.HIF-1(RNAi)	18
43	N2.HIF-1(RNAi)	18
44	N2.HIF-1(RNAi)	20
45	N2.HIF-1(RNAi)	20
46	N2.HIF-1(RNAi)	20
47	N2.HIF-1(RNAi)	20
48	N2.HIF-1(RNAi)	20
49	N2.HIF-1(RNAi)	20
50	N2.HIF-1(RNAi)	20
51	N2.HIF-1(RNAi)	20
52	N2.HIF-1(RNAi)	20
53	N2.HIF-1(RNAi)	20
54	N2.HIF-1(RNAi)	20
55	N2.HIF-1(RNAi)	20
56	N2.HIF-1(RNAi)	20
57	N2.HIF-1(RNAi)	20
58	N2.HIF-1(RNAi)	20
59	N2.HIF-1(RNAi)	20
60	N2.HIF-1(RNAi)	20
61	N2.HIF-1(RNAi)	20
62	N2.HIF-1(RNAi)	20
63	N2.HIF-1(RNAi)	20
64	N2.HIF-1(RNAi)	20
65	N2.HIF-1(RNAi)	20
66	N2.HIF-1(RNAi)	20
67	N2.HIF-1(RNAi)	22
68	N2.HIF-1(RNAi)	22
69	N2.HIF-1(RNAi)	22
70	N2.HIF-1(RNAi)	22
71	N2.HIF-1(RNAi)	22
72	N2.HIF-1(RNAi)	22
73	N2.HIF-1(RNAi)	22
74	N2.HIF-1(RNAi)	22
75	N2.HIF-1(RNAi)	22
76	N2.HIF-1(RNAi)	22
77	N2.HIF-1(RNAi)	22
78	N2.HIF-1(RNAi)	25
