1	sir2.1	13
2	sir2.1	17
3	sir2.1	29
4	sir2.1	31
5	sir2.1	34
6	sir2.1	36
7	sir2.1	36
8	sir2.1	36
9	sir2.1	41
10	sir2.1	41
11	sir2.1	41
12	sir2.1	41
13	sir2.1	43
14	sir2.1	45
15	sir2.1	45
16	sir2.1	45
17	sir2.1	48
18	sir2.1	48
19	sir2.1	48
20	sir2.1	48
21	sir2.1	50
22	sir2.1	50
23	sir2.1	55
24	sir2.1	55
25	sir2.1	20
26	sir2.1	34
27	sir2.1	20
28	sir2.1	20
29	sir2.1	34
30	sir2.1	27
