1	egl-9	16
2	egl-9	19
3	egl-9	19
4	egl-9	19
5	egl-9	21
6	egl-9	21
7	egl-9	21
8	egl-9	21
9	egl-9	21
10	egl-9	21
11	egl-9	23
12	egl-9	23
13	egl-9	23
14	egl-9	23
15	egl-9	23
16	egl-9	23
17	egl-9	23
18	egl-9	23
19	egl-9	26
20	egl-9	26
21	egl-9	26
22	egl-9	26
23	egl-9	26
24	egl-9	26
25	egl-9	28
26	egl-9	28
27	egl-9	28
28	egl-9	28
29	egl-9	28
30	egl-9	28
31	egl-9	30
32	egl-9	30
33	egl-9	30
34	egl-9	30
35	egl-9	30
36	egl-9	33
37	egl-9	33
38	egl-9	33
39	egl-9	33
40	egl-9	33
41	egl-9	33
42	egl-9	35
43	egl-9	35
44	egl-9	35
45	egl-9	35
46	egl-9	37
47	egl-9	37
48	egl-9	37
49	egl-9	37
50	egl-9	40
51	egl-9	26
52	egl-9	23
53	egl-9	26
54	egl-9	26
55	egl-9	28
56	egl-9	28
57	egl-9	28
58	egl-9	28
59	egl-9	33
60	egl-9	35
61	egl-9	23
62	egl-9	23
63	egl-9	26
64	egl-9	28
