1	N2.F28B4.3.(RNAi)	8
2	N2.F28B4.3.(RNAi)	8
3	N2.F28B4.3.(RNAi)	10
4	N2.F28B4.3.(RNAi)	10
5	N2.F28B4.3.(RNAi)	10
6	N2.F28B4.3.(RNAi)	10
7	N2.F28B4.3.(RNAi)	10
8	N2.F28B4.3.(RNAi)	10
9	N2.F28B4.3.(RNAi)	8
10	N2.F28B4.3.(RNAi)	8
11	N2.F28B4.3.(RNAi)	10
12	N2.F28B4.3.(RNAi)	10
13	N2.F28B4.3.(RNAi)	10
14	N2.F28B4.3.(RNAi)	12
15	N2.F28B4.3.(RNAi)	12
16	N2.F28B4.3.(RNAi)	12
17	N2.F28B4.3.(RNAi)	12
18	N2.F28B4.3.(RNAi)	12
19	N2.F28B4.3.(RNAi)	12
20	N2.F28B4.3.(RNAi)	12
21	N2.F28B4.3.(RNAi)	12
22	N2.F28B4.3.(RNAi)	12
23	N2.F28B4.3.(RNAi)	12
24	N2.F28B4.3.(RNAi)	12
25	N2.F28B4.3.(RNAi)	12
26	N2.F28B4.3.(RNAi)	12
27	N2.F28B4.3.(RNAi)	13
28	N2.F28B4.3.(RNAi)	13
29	N2.F28B4.3.(RNAi)	13
30	N2.F28B4.3.(RNAi)	13
31	N2.F28B4.3.(RNAi)	13
32	N2.F28B4.3.(RNAi)	13
33	N2.F28B4.3.(RNAi)	13
34	N2.F28B4.3.(RNAi)	13
35	N2.F28B4.3.(RNAi)	13
36	N2.F28B4.3.(RNAi)	13
37	N2.F28B4.3.(RNAi)	13
38	N2.F28B4.3.(RNAi)	13
39	N2.F28B4.3.(RNAi)	13
40	N2.F28B4.3.(RNAi)	13
41	N2.F28B4.3.(RNAi)	13
42	N2.F28B4.3.(RNAi)	13
43	N2.F28B4.3.(RNAi)	14
44	N2.F28B4.3.(RNAi)	14
45	N2.F28B4.3.(RNAi)	14
46	N2.F28B4.3.(RNAi)	14
47	N2.F28B4.3.(RNAi)	14
48	N2.F28B4.3.(RNAi)	14
49	N2.F28B4.3.(RNAi)	14
50	N2.F28B4.3.(RNAi)	14
51	N2.F28B4.3.(RNAi)	14
52	N2.F28B4.3.(RNAi)	14
53	N2.F28B4.3.(RNAi)	14
54	N2.F28B4.3.(RNAi)	14
55	N2.F28B4.3.(RNAi)	14
56	N2.F28B4.3.(RNAi)	14
57	N2.F28B4.3.(RNAi)	14
58	N2.F28B4.3.(RNAi)	14
59	N2.F28B4.3.(RNAi)	14
60	N2.F28B4.3.(RNAi)	15
61	N2.F28B4.3.(RNAi)	15
62	N2.F28B4.3.(RNAi)	15
63	N2.F28B4.3.(RNAi)	15
64	N2.F28B4.3.(RNAi)	15
65	N2.F28B4.3.(RNAi)	15
66	N2.F28B4.3.(RNAi)	15
67	N2.F28B4.3.(RNAi)	15
68	N2.F28B4.3.(RNAi)	15
69	N2.F28B4.3.(RNAi)	15
70	N2.F28B4.3.(RNAi)	15
71	N2.F28B4.3.(RNAi)	15
72	N2.F28B4.3.(RNAi)	15
73	N2.F28B4.3.(RNAi)	15
74	N2.F28B4.3.(RNAi)	15
75	N2.F28B4.3.(RNAi)	15
76	N2.F28B4.3.(RNAi)	15
77	N2.F28B4.3.(RNAi)	15
78	N2.F28B4.3.(RNAi)	15
79	N2.F28B4.3.(RNAi)	15
80	N2.F28B4.3.(RNAi)	15
81	N2.F28B4.3.(RNAi)	15
82	N2.F28B4.3.(RNAi)	15
83	N2.F28B4.3.(RNAi)	15
84	N2.F28B4.3.(RNAi)	15
85	N2.F28B4.3.(RNAi)	15
86	N2.F28B4.3.(RNAi)	15
87	N2.F28B4.3.(RNAi)	15
88	N2.F28B4.3.(RNAi)	15
89	N2.F28B4.3.(RNAi)	15
90	N2.F28B4.3.(RNAi)	15
91	N2.F28B4.3.(RNAi)	15
92	N2.F28B4.3.(RNAi)	15
93	N2.F28B4.3.(RNAi)	15
94	N2.F28B4.3.(RNAi)	15
95	N2.F28B4.3.(RNAi)	15
96	N2.F28B4.3.(RNAi)	15
97	N2.F28B4.3.(RNAi)	15
98	N2.F28B4.3.(RNAi)	15
99	N2.F28B4.3.(RNAi)	15
100	N2.F28B4.3.(RNAi)	16
101	N2.F28B4.3.(RNAi)	16
102	N2.F28B4.3.(RNAi)	16
103	N2.F28B4.3.(RNAi)	16
104	N2.F28B4.3.(RNAi)	16
105	N2.F28B4.3.(RNAi)	16
106	N2.F28B4.3.(RNAi)	16
107	N2.F28B4.3.(RNAi)	16
108	N2.F28B4.3.(RNAi)	16
109	N2.F28B4.3.(RNAi)	16
110	N2.F28B4.3.(RNAi)	16
111	N2.F28B4.3.(RNAi)	16
112	N2.F28B4.3.(RNAi)	16
113	N2.F28B4.3.(RNAi)	16
114	N2.F28B4.3.(RNAi)	16
115	N2.F28B4.3.(RNAi)	16
116	N2.F28B4.3.(RNAi)	16
117	N2.F28B4.3.(RNAi)	16
118	N2.F28B4.3.(RNAi)	16
119	N2.F28B4.3.(RNAi)	16
120	N2.F28B4.3.(RNAi)	16
121	N2.F28B4.3.(RNAi)	16
122	N2.F28B4.3.(RNAi)	16
123	N2.F28B4.3.(RNAi)	16
124	N2.F28B4.3.(RNAi)	16
125	N2.F28B4.3.(RNAi)	18
126	N2.F28B4.3.(RNAi)	18
127	N2.F28B4.3.(RNAi)	18
128	N2.F28B4.3.(RNAi)	18
129	N2.F28B4.3.(RNAi)	18
130	N2.F28B4.3.(RNAi)	18
131	N2.F28B4.3.(RNAi)	18
132	N2.F28B4.3.(RNAi)	18
133	N2.F28B4.3.(RNAi)	18
134	N2.F28B4.3.(RNAi)	18
135	N2.F28B4.3.(RNAi)	18
136	N2.F28B4.3.(RNAi)	18
137	N2.F28B4.3.(RNAi)	18
138	N2.F28B4.3.(RNAi)	18
139	N2.F28B4.3.(RNAi)	18
140	N2.F28B4.3.(RNAi)	18
141	N2.F28B4.3.(RNAi)	18
142	N2.F28B4.3.(RNAi)	18
143	N2.F28B4.3.(RNAi)	18
144	N2.F28B4.3.(RNAi)	18
145	N2.F28B4.3.(RNAi)	18
146	N2.F28B4.3.(RNAi)	20
147	N2.F28B4.3.(RNAi)	20
148	N2.F28B4.3.(RNAi)	20
149	N2.F28B4.3.(RNAi)	20
150	N2.F28B4.3.(RNAi)	20
