1	daf-16	17
2	daf-16	21
3	daf-16	24
4	daf-16	24
5	daf-16	26
6	daf-16	28
7	daf-16	28
8	daf-16	28
9	daf-16	28
10	daf-16	31
11	daf-16	31
12	daf-16	31
13	daf-16	31
14	daf-16	31
15	daf-16	31
16	daf-16	33
17	daf-16	33
18	daf-16	33
19	daf-16	33
20	daf-16	33
21	daf-16	33
22	daf-16	33
23	daf-16	33
24	daf-16	33
25	daf-16	33
26	daf-16	33
27	daf-16	33
28	daf-16	33
29	daf-16	33
30	daf-16	35
31	daf-16	35
32	daf-16	35
33	daf-16	35
34	daf-16	35
35	daf-16	35
36	daf-16	37
37	daf-16	37
38	daf-16	37
39	daf-16	37
40	daf-16	37
41	daf-16	37
42	daf-16	39
43	daf-16	39
44	daf-16	39
45	daf-16	39
46	daf-16	39
47	daf-16	39
48	daf-16	39
49	daf-16	39
50	daf-16	39
51	daf-16	41
52	daf-16	41
53	daf-16	41
54	daf-16	41
55	daf-16	41
56	daf-16	41
57	daf-16	41
58	daf-16	41
59	daf-16	43
60	daf-16	43
61	daf-16	43
62	daf-16	43
63	daf-16	43
64	daf-16	43
65	daf-16	43
66	daf-16	43
67	daf-16	43
68	daf-16	45
69	daf-16	45
70	daf-16	45
71	daf-16	45
72	daf-16	45
73	daf-16	47
74	daf-16	47
75	daf-16	21
76	daf-16	24
77	daf-16	24
78	daf-16	26
79	daf-16	26
80	daf-16	26
81	daf-16	26
82	daf-16	28
83	daf-16	28
84	daf-16	28
85	daf-16	28
86	daf-16	28
87	daf-16	28
88	daf-16	28
89	daf-16	31
90	daf-16	31
91	daf-16	31
92	daf-16	31
93	daf-16	31
94	daf-16	31
95	daf-16	31
96	daf-16	31
97	daf-16	31
98	daf-16	33
99	daf-16	33
100	daf-16	33
101	daf-16	33
102	daf-16	33
103	daf-16	35
104	daf-16	35
105	daf-16	35
106	daf-16	35
107	daf-16	37
108	daf-16	37
109	daf-16	37
110	daf-16	37
111	daf-16	37
112	daf-16	14
113	daf-16	14
114	daf-16	17
115	daf-16	17
116	daf-16	26
117	daf-16	26
118	daf-16	28
119	daf-16	28
120	daf-16	28
121	daf-16	31
122	daf-16	31
123	daf-16	31
124	daf-16	31
125	daf-16	33
126	daf-16	33
127	daf-16	33
128	daf-16	33
129	daf-16	33
130	daf-16	33
131	daf-16	35
132	daf-16	37
133	daf-16	37
134	daf-16	37
135	daf-16	37
136	daf-16	37
137	daf-16	39
138	daf-16	39
139	daf-16	39
140	daf-16	39
141	daf-16	39
142	daf-16	41
143	daf-16	41
144	daf-16	41
145	daf-16	41
146	daf-16	43
147	daf-16	43
148	daf-16	43
149	daf-16	45
150	daf-16	45
151	daf-16	47
152	daf-16	24
153	daf-16	24
154	daf-16	26
155	daf-16	26
156	daf-16	26
157	daf-16	31
158	daf-16	31
159	daf-16	31
160	daf-16	31
161	daf-16	33
162	daf-16	35
163	daf-16	35
