1	hif-1	17
2	hif-1	17
3	hif-1	19
4	hif-1	21
5	hif-1	21
6	hif-1	24
7	hif-1	24
8	hif-1	24
9	hif-1	24
10	hif-1	24
11	hif-1	24
12	hif-1	24
13	hif-1	26
14	hif-1	26
15	hif-1	26
16	hif-1	19
17	hif-1	19
18	hif-1	21
19	hif-1	24
20	hif-1	24
21	hif-1	19
22	hif-1	19
23	hif-1	19
24	hif-1	21
25	hif-1	21
26	hif-1	21
27	hif-1	24
28	hif-1	24
29	hif-1	24
30	hif-1	24
31	hif-1	24
32	hif-1	12
33	hif-1	14
34	hif-1	17
35	hif-1	21
36	hif-1	24
37	hif-1	24
38	hif-1	14
39	hif-1	14
40	hif-1	19
41	hif-1	21
42	hif-1	21
43	hif-1	21
44	hif-1	21
45	hif-1	21
46	hif-1	24
47	hif-1	24
48	hif-1	24
49	hif-1	24
50	hif-1	24
51	hif-1	24
52	hif-1	24
53	hif-1	24
54	hif-1	24
55	hif-1	26
56	hif-1	26
57	hif-1	29
58	hif-1	29
59	hif-1	31
60	hif-1	19
61	hif-1	19
62	hif-1	21
63	hif-1	21
64	hif-1	21
65	hif-1	24
66	hif-1	14
67	hif-1	17
68	hif-1	24
69	hif-1	24
70	hif-1	24
71	hif-1	17
72	hif-1	17
73	hif-1	19
74	hif-1	19
75	hif-1	19
76	hif-1	19
77	hif-1	19
78	hif-1	19
79	hif-1	24
