1	N2.Hypoxia	18
2	N2.Hypoxia	25
3	N2.Hypoxia	29
4	N2.Hypoxia	32
5	N2.Hypoxia	32
6	N2.Hypoxia	32
7	N2.Hypoxia	32
8	N2.Hypoxia	32
9	N2.Hypoxia	32
10	N2.Hypoxia	32
11	N2.Hypoxia	32
12	N2.Hypoxia	32
13	N2.Hypoxia	32
14	N2.Hypoxia	32
15	N2.Hypoxia	32
16	N2.Hypoxia	32
17	N2.Hypoxia	32
18	N2.Hypoxia	32
19	N2.Hypoxia	34
20	N2.Hypoxia	36
21	N2.Hypoxia	39
22	N2.Hypoxia	39
23	N2.Hypoxia	41
24	N2.Hypoxia	41
25	N2.Hypoxia	32
26	N2.Hypoxia	32
27	N2.Hypoxia	32
28	N2.Hypoxia	32
29	N2.Hypoxia	32
30	N2.Hypoxia	32
31	N2.Hypoxia	32
32	N2.Hypoxia	32
33	N2.Hypoxia	34
34	N2.Hypoxia	34
35	N2.Hypoxia	34
36	N2.Hypoxia	34
37	N2.Hypoxia	34
38	N2.Hypoxia	34
39	N2.Hypoxia	34
40	N2.Hypoxia	34
41	N2.Hypoxia	34
42	N2.Hypoxia	36
43	N2.Hypoxia	36
44	N2.Hypoxia	36
45	N2.Hypoxia	36
46	N2.Hypoxia	36
47	N2.Hypoxia	36
48	N2.Hypoxia	36
49	N2.Hypoxia	36
50	N2.Hypoxia	36
51	N2.Hypoxia	36
52	N2.Hypoxia	36
53	N2.Hypoxia	39
54	N2.Hypoxia	39
55	N2.Hypoxia	39
56	N2.Hypoxia	39
57	N2.Hypoxia	39
58	N2.Hypoxia	39
59	N2.Hypoxia	39
60	N2.Hypoxia	39
61	N2.Hypoxia	41
62	N2.Hypoxia	41
63	N2.Hypoxia	34
64	N2.Hypoxia	34
65	N2.Hypoxia	34
66	N2.Hypoxia	34
67	N2.Hypoxia	34
68	N2.Hypoxia	36
69	N2.Hypoxia	36
70	N2.Hypoxia	36
71	N2.Hypoxia	36
72	N2.Hypoxia	36
73	N2.Hypoxia	39
74	N2.Hypoxia	39
75	N2.Hypoxia	39
76	N2.Hypoxia	39
77	N2.Hypoxia	39
78	N2.Hypoxia	29
79	N2.Hypoxia	29
80	N2.Hypoxia	32
81	N2.Hypoxia	32
82	N2.Hypoxia	32
83	N2.Hypoxia	32
84	N2.Hypoxia	32
85	N2.Hypoxia	32
86	N2.Hypoxia	32
87	N2.Hypoxia	34
88	N2.Hypoxia	36
89	N2.Hypoxia	39
90	N2.Hypoxia	39
91	N2.Hypoxia	43
92	N2.Hypoxia	43
93	N2.Hypoxia	25
94	N2.Hypoxia	32
95	N2.Hypoxia	32
96	N2.Hypoxia	32
97	N2.Hypoxia	32
98	N2.Hypoxia	32
99	N2.Hypoxia	32
100	N2.Hypoxia	32
101	N2.Hypoxia	32
102	N2.Hypoxia	32
103	N2.Hypoxia	32
104	N2.Hypoxia	32
105	N2.Hypoxia	32
106	N2.Hypoxia	34
107	N2.Hypoxia	34
108	N2.Hypoxia	34
109	N2.Hypoxia	34
110	N2.Hypoxia	36
111	N2.Hypoxia	36
112	N2.Hypoxia	36
113	N2.Hypoxia	36
114	N2.Hypoxia	36
115	N2.Hypoxia	36
116	N2.Hypoxia	36
117	N2.Hypoxia	36
118	N2.Hypoxia	36
119	N2.Hypoxia	39
120	N2.Hypoxia	39
121	N2.Hypoxia	39
122	N2.Hypoxia	39
123	N2.Hypoxia	32
124	N2.Hypoxia	32
125	N2.Hypoxia	32
126	N2.Hypoxia	32
127	N2.Hypoxia	32
128	N2.Hypoxia	32
129	N2.Hypoxia	34
130	N2.Hypoxia	34
131	N2.Hypoxia	34
132	N2.Hypoxia	34
133	N2.Hypoxia	34
134	N2.Hypoxia	34
135	N2.Hypoxia	34
136	N2.Hypoxia	34
137	N2.Hypoxia	34
138	N2.Hypoxia	36
139	N2.Hypoxia	36
140	N2.Hypoxia	36
141	N2.Hypoxia	36
142	N2.Hypoxia	36
143	N2.Hypoxia	39
144	N2.Hypoxia	41
145	N2.Hypoxia	29
146	N2.Hypoxia	29
147	N2.Hypoxia	32
148	N2.Hypoxia	32
149	N2.Hypoxia	32
150	N2.Hypoxia	32
151	N2.Hypoxia	34
152	N2.Hypoxia	39
153	N2.Hypoxia	39
154	N2.Hypoxia	41
155	N2.Hypoxia	43
156	N2.Hypoxia	43
157	N2.Hypoxia	46
158	N2.Hypoxia	46
159	N2.Hypoxia	46
160	N2.Hypoxia	39
161	N2.Hypoxia	32
162	N2.Hypoxia	32
163	N2.Hypoxia	32
164	N2.Hypoxia	32
165	N2.Hypoxia	34
166	N2.Hypoxia	34
167	N2.Hypoxia	34
168	N2.Hypoxia	34
169	N2.Hypoxia	36
170	N2.Hypoxia	36
171	N2.Hypoxia	36
172	N2.Hypoxia	36
173	N2.Hypoxia	36
174	N2.Hypoxia	39
175	N2.Hypoxia	39
176	N2.Hypoxia	39
177	N2.Hypoxia	39
178	N2.Hypoxia	39
179	N2.Hypoxia	39
180	N2.Hypoxia	39
181	N2.Hypoxia	39
182	N2.Hypoxia	39
183	N2.Hypoxia	39
184	N2.Hypoxia	41
185	N2.Hypoxia	41
186	N2.Hypoxia	41
187	N2.Hypoxia	41
188	N2.Hypoxia	41
189	N2.Hypoxia	41
190	N2.Hypoxia	34
191	N2.Hypoxia	34
192	N2.Hypoxia	34
193	N2.Hypoxia	34
194	N2.Hypoxia	36
195	N2.Hypoxia	36
196	N2.Hypoxia	39
197	N2.Hypoxia	39
198	N2.Hypoxia	39
199	N2.Hypoxia	41
