1	hif-1	13
2	hif-1	17
3	hif-1	17
4	hif-1	17
5	hif-1	19
6	hif-1	19
7	hif-1	19
8	hif-1	21
9	hif-1	21
10	hif-1	21
11	hif-1	21
12	hif-1	21
13	hif-1	21
14	hif-1	24
15	hif-1	24
16	hif-1	24
17	hif-1	24
18	hif-1	24
19	hif-1	24
20	hif-1	24
21	hif-1	24
22	hif-1	26
23	hif-1	26
24	hif-1	26
25	hif-1	26
26	hif-1	28
27	hif-1	28
28	hif-1	28
29	hif-1	31
30	hif-1	31
31	hif-1	31
32	hif-1	31
33	hif-1	31
34	hif-1	31
35	hif-1	33
36	hif-1	33
37	hif-1	33
38	hif-1	35
39	hif-1	35
40	hif-1	35
41	hif-1	37
42	hif-1	39
43	hif-1	43
44	hif-1	45
45	hif-1	17
46	hif-1	19
47	hif-1	19
48	hif-1	21
49	hif-1	24
50	hif-1	24
51	hif-1	24
52	hif-1	24
53	hif-1	24
54	hif-1	26
55	hif-1	26
56	hif-1	26
57	hif-1	28
58	hif-1	28
59	hif-1	28
60	hif-1	28
61	hif-1	28
62	hif-1	31
63	hif-1	31
64	hif-1	31
65	hif-1	33
66	hif-1	33
67	hif-1	35
68	hif-1	35
69	hif-1	35
70	hif-1	35
71	hif-1	35
72	hif-1	35
73	hif-1	37
74	hif-1	37
75	hif-1	37
76	hif-1	37
77	hif-1	37
78	hif-1	37
79	hif-1	39
80	hif-1	39
81	hif-1	39
82	hif-1	39
83	hif-1	39
84	hif-1	41
85	hif-1	47
