1	EV(RNAi)	16
2	EV(RNAi)	22
3	EV(RNAi)	22
4	EV(RNAi)	22
5	EV(RNAi)	22
6	EV(RNAi)	22
7	EV(RNAi)	25
8	EV(RNAi)	25
9	EV(RNAi)	14
10	EV(RNAi)	22
11	EV(RNAi)	22
12	EV(RNAi)	22
13	EV(RNAi)	22
14	EV(RNAi)	22
15	EV(RNAi)	22
16	EV(RNAi)	25
17	EV(RNAi)	16
18	EV(RNAi)	16
19	EV(RNAi)	22
20	EV(RNAi)	22
21	EV(RNAi)	22
22	EV(RNAi)	22
23	EV(RNAi)	22
24	EV(RNAi)	14
25	EV(RNAi)	16
26	EV(RNAi)	22
27	EV(RNAi)	22
28	EV(RNAi)	16
29	EV(RNAi)	16
30	EV(RNAi)	22
31	EV(RNAi)	22
32	EV(RNAi)	22
33	EV(RNAi)	22
34	EV(RNAi)	22
35	EV(RNAi)	22
36	EV(RNAi)	22
37	EV(RNAi)	22
38	EV(RNAi)	22
39	EV(RNAi)	22
40	EV(RNAi)	22
41	EV(RNAi)	22
42	EV(RNAi)	22
43	EV(RNAi)	22
44	EV(RNAi)	25
45	EV(RNAi)	25
46	EV(RNAi)	25
47	EV(RNAi)	22
48	EV(RNAi)	22
49	EV(RNAi)	22
50	EV(RNAi)	22
51	EV(RNAi)	22
52	EV(RNAi)	22
53	EV(RNAi)	25
54	EV(RNAi)	25
55	EV(RNAi)	25
56	EV(RNAi)	25
57	EV(RNAi)	25
58	EV(RNAi)	25
59	EV(RNAi)	25
60	EV(RNAi)	28
61	EV(RNAi)	31
62	EV(RNAi)	22
63	EV(RNAi)	25
64	EV(RNAi)	22
65	EV(RNAi)	22
66	EV(RNAi)	22
67	EV(RNAi)	22
68	EV(RNAi)	25
