1	SKN-1 OE	11
2	SKN-1 OE	11
3	SKN-1 OE	11
4	SKN-1 OE	15
5	SKN-1 OE	15
6	SKN-1 OE	15
7	SKN-1 OE	9
8	SKN-1 OE	11
9	SKN-1 OE	11
10	SKN-1 OE	11
11	SKN-1 OE	11
12	SKN-1 OE	11
13	SKN-1 OE	11
14	SKN-1 OE	11
15	SKN-1 OE	11
16	SKN-1 OE	11
17	SKN-1 OE	11
18	SKN-1 OE	11
19	SKN-1 OE	13
20	SKN-1 OE	13
21	SKN-1 OE	13
22	SKN-1 OE	13
23	SKN-1 OE	13
24	SKN-1 OE	13
25	SKN-1 OE	13
26	SKN-1 OE	13
27	SKN-1 OE	13
28	SKN-1 OE	13
29	SKN-1 OE	13
30	SKN-1 OE	13
31	SKN-1 OE	13
32	SKN-1 OE	13
33	SKN-1 OE	13
34	SKN-1 OE	13
35	SKN-1 OE	13
36	SKN-1 OE	13
37	SKN-1 OE	13
38	SKN-1 OE	13
39	SKN-1 OE	13
40	SKN-1 OE	13
41	SKN-1 OE	13
42	SKN-1 OE	13
43	SKN-1 OE	13
44	SKN-1 OE	13
45	SKN-1 OE	13
46	SKN-1 OE	13
47	SKN-1 OE	13
48	SKN-1 OE	13
49	SKN-1 OE	13
50	SKN-1 OE	13
51	SKN-1 OE	13
52	SKN-1 OE	13
53	SKN-1 OE	13
54	SKN-1 OE	13
55	SKN-1 OE	13
56	SKN-1 OE	13
57	SKN-1 OE	13
58	SKN-1 OE	13
59	SKN-1 OE	13
60	SKN-1 OE	13
61	SKN-1 OE	13
62	SKN-1 OE	13
63	SKN-1 OE	13
64	SKN-1 OE	13
65	SKN-1 OE	13
66	SKN-1 OE	13
67	SKN-1 OE	13
68	SKN-1 OE	13
69	SKN-1 OE	13
70	SKN-1 OE	13
71	SKN-1 OE	13
72	SKN-1 OE	13
73	SKN-1 OE	15
74	SKN-1 OE	15
75	SKN-1 OE	15
76	SKN-1 OE	15
77	SKN-1 OE	15
78	SKN-1 OE	15
79	SKN-1 OE	15
80	SKN-1 OE	15
81	SKN-1 OE	15
82	SKN-1 OE	15
83	SKN-1 OE	15
84	SKN-1 OE	15
85	SKN-1 OE	15
86	SKN-1 OE	15
87	SKN-1 OE	15
88	SKN-1 OE	15
89	SKN-1 OE	15
90	SKN-1 OE	15
91	SKN-1 OE	15
92	SKN-1 OE	15
93	SKN-1 OE	15
94	SKN-1 OE	15
95	SKN-1 OE	15
96	SKN-1 OE	15
97	SKN-1 OE	15
98	SKN-1 OE	15
99	SKN-1 OE	15
100	SKN-1 OE	15
101	SKN-1 OE	15
102	SKN-1 OE	15
103	SKN-1 OE	15
104	SKN-1 OE	15
105	SKN-1 OE	15
106	SKN-1 OE	15
107	SKN-1 OE	15
108	SKN-1 OE	15
109	SKN-1 OE	15
110	SKN-1 OE	15
111	SKN-1 OE	15
112	SKN-1 OE	15
113	SKN-1 OE	15
114	SKN-1 OE	15
115	SKN-1 OE	15
116	SKN-1 OE	15
117	SKN-1 OE	15
118	SKN-1 OE	15
119	SKN-1 OE	15
120	SKN-1 OE	15
121	SKN-1 OE	15
122	SKN-1 OE	15
123	SKN-1 OE	15
124	SKN-1 OE	15
125	SKN-1 OE	15
126	SKN-1 OE	15
127	SKN-1 OE	15
128	SKN-1 OE	15
129	SKN-1 OE	15
130	SKN-1 OE	15
131	SKN-1 OE	15
132	SKN-1 OE	16
133	SKN-1 OE	16
134	SKN-1 OE	16
135	SKN-1 OE	16
136	SKN-1 OE	16
137	SKN-1 OE	16
138	SKN-1 OE	16
139	SKN-1 OE	16
140	SKN-1 OE	16
141	SKN-1 OE	16
142	SKN-1 OE	16
143	SKN-1 OE	16
144	SKN-1 OE	16
145	SKN-1 OE	16
146	SKN-1 OE	16
147	SKN-1 OE	16
148	SKN-1 OE	16
149	SKN-1 OE	16
150	SKN-1 OE	16
151	SKN-1 OE	16
152	SKN-1 OE	16
153	SKN-1 OE	16
154	SKN-1 OE	16
155	SKN-1 OE	16
156	SKN-1 OE	16
157	SKN-1 OE	17
158	SKN-1 OE	17
