1	hif-1	27
2	hif-1	27
3	hif-1	27
4	hif-1	27
5	hif-1	27
6	hif-1	27
7	hif-1	29
8	hif-1	29
9	hif-1	29
10	hif-1	31
11	hif-1	31
12	hif-1	31
13	hif-1	31
14	hif-1	31
15	hif-1	31
16	hif-1	34
17	hif-1	34
18	hif-1	34
19	hif-1	36
20	hif-1	36
21	hif-1	36
22	hif-1	38
23	hif-1	38
24	hif-1	38
25	hif-1	38
26	hif-1	41
27	hif-1	41
28	hif-1	41
29	hif-1	41
30	hif-1	41
31	hif-1	41
32	hif-1	41
33	hif-1	41
34	hif-1	41
35	hif-1	41
36	hif-1	43
37	hif-1	43
38	hif-1	45
39	hif-1	45
40	hif-1	45
41	hif-1	48
42	hif-1	48
43	hif-1	48
44	hif-1	50
45	hif-1	50
46	hif-1	50
47	hif-1	24
48	hif-1	24
49	hif-1	24
50	hif-1	24
51	hif-1	24
52	hif-1	27
53	hif-1	27
54	hif-1	27
55	hif-1	27
56	hif-1	29
57	hif-1	29
58	hif-1	29
59	hif-1	29
60	hif-1	29
61	hif-1	29
62	hif-1	29
63	hif-1	31
64	hif-1	14
65	hif-1	17
66	hif-1	21
67	hif-1	24
68	hif-1	24
69	hif-1	24
70	hif-1	24
71	hif-1	24
72	hif-1	24
73	hif-1	24
74	hif-1	24
75	hif-1	24
76	hif-1	24
77	hif-1	24
78	hif-1	27
79	hif-1	27
80	hif-1	29
81	hif-1	31
82	hif-1	14
83	hif-1	21
84	hif-1	24
85	hif-1	24
86	hif-1	24
87	hif-1	24
88	hif-1	27
89	hif-1	29
90	hif-1	29
91	hif-1	29
92	hif-1	29
93	hif-1	29
94	hif-1	31
95	hif-1	31
96	hif-1	31
97	hif-1	34
98	hif-1	34
99	hif-1	34
100	hif-1	34
101	hif-1	34
102	hif-1	34
103	hif-1	34
104	hif-1	34
105	hif-1	34
106	hif-1	34
107	hif-1	36
108	hif-1	36
109	hif-1	36
110	hif-1	36
111	hif-1	36
112	hif-1	36
113	hif-1	36
114	hif-1	36
115	hif-1	38
116	hif-1	38
117	hif-1	38
118	hif-1	38
119	hif-1	38
120	hif-1	38
121	hif-1	38
122	hif-1	38
123	hif-1	38
124	hif-1	38
125	hif-1	38
126	hif-1	38
127	hif-1	38
128	hif-1	41
129	hif-1	41
130	hif-1	41
131	hif-1	41
132	hif-1	41
133	hif-1	41
134	hif-1	41
135	hif-1	41
136	hif-1	41
137	hif-1	41
138	hif-1	41
139	hif-1	41
140	hif-1	41
141	hif-1	41
142	hif-1	41
143	hif-1	41
144	hif-1	41
145	hif-1	41
146	hif-1	41
147	hif-1	41
148	hif-1	41
149	hif-1	41
150	hif-1	43
151	hif-1	43
152	hif-1	43
153	hif-1	43
154	hif-1	43
155	hif-1	43
156	hif-1	43
157	hif-1	43
158	hif-1	43
159	hif-1	43
160	hif-1	43
161	hif-1	43
162	hif-1	43
163	hif-1	43
164	hif-1	43
165	hif-1	43
166	hif-1	43
167	hif-1	43
168	hif-1	43
169	hif-1	43
170	hif-1	43
171	hif-1	43
172	hif-1	45
173	hif-1	45
174	hif-1	45
175	hif-1	45
176	hif-1	45
177	hif-1	45
178	hif-1	45
179	hif-1	45
180	hif-1	45
181	hif-1	45
182	hif-1	45
183	hif-1	45
184	hif-1	45
185	hif-1	45
186	hif-1	45
187	hif-1	45
188	hif-1	48
189	hif-1	48
190	hif-1	48
191	hif-1	48
192	hif-1	48
193	hif-1	48
194	hif-1	48
195	hif-1	48
196	hif-1	48
197	hif-1	50
198	hif-1	50
199	hif-1	50
200	hif-1	50
201	hif-1	21
202	hif-1	24
203	hif-1	24
204	hif-1	24
205	hif-1	24
206	hif-1	27
207	hif-1	27
208	hif-1	27
209	hif-1	27
210	hif-1	27
211	hif-1	27
212	hif-1	27
213	hif-1	27
214	hif-1	27
215	hif-1	27
216	hif-1	29
217	hif-1	29
218	hif-1	29
219	hif-1	29
220	hif-1	29
221	hif-1	29
222	hif-1	31
223	hif-1	31
224	hif-1	31
225	hif-1	31
226	hif-1	31
227	hif-1	31
228	hif-1	31
229	hif-1	31
230	hif-1	34
231	hif-1	34
232	hif-1	34
233	hif-1	34
234	hif-1	34
235	hif-1	34
236	hif-1	34
237	hif-1	34
238	hif-1	36
239	hif-1	36
240	hif-1	17
241	hif-1	21
242	hif-1	21
243	hif-1	21
244	hif-1	21
245	hif-1	21
246	hif-1	21
247	hif-1	21
248	hif-1	21
249	hif-1	21
250	hif-1	24
251	hif-1	24
252	hif-1	24
253	hif-1	24
254	hif-1	24
255	hif-1	24
256	hif-1	24
257	hif-1	24
258	hif-1	24
259	hif-1	24
260	hif-1	24
261	hif-1	24
262	hif-1	24
263	hif-1	24
264	hif-1	24
265	hif-1	24
266	hif-1	24
267	hif-1	24
268	hif-1	24
269	hif-1	24
270	hif-1	27
271	hif-1	27
272	hif-1	27
273	hif-1	27
274	hif-1	27
275	hif-1	27
276	hif-1	27
277	hif-1	27
278	hif-1	27
279	hif-1	27
280	hif-1	27
281	hif-1	27
282	hif-1	27
283	hif-1	27
284	hif-1	27
285	hif-1	27
286	hif-1	29
287	hif-1	29
288	hif-1	29
289	hif-1	29
290	hif-1	29
291	hif-1	31
292	hif-1	31
