1	hif-1	15
2	hif-1	17
3	hif-1	20
4	hif-1	20
5	hif-1	20
6	hif-1	20
7	hif-1	20
8	hif-1	20
9	hif-1	20
10	hif-1	20
11	hif-1	20
12	hif-1	22
13	hif-1	22
14	hif-1	22
15	hif-1	22
16	hif-1	22
17	hif-1	22
18	hif-1	22
19	hif-1	24
20	hif-1	24
21	hif-1	24
22	hif-1	24
23	hif-1	24
24	hif-1	24
25	hif-1	24
26	hif-1	24
27	hif-1	24
28	hif-1	24
29	hif-1	24
30	hif-1	24
31	hif-1	27
32	hif-1	31
33	hif-1	31
34	hif-1	34
35	hif-1	36
36	hif-1	17
37	hif-1	17
38	hif-1	17
39	hif-1	20
40	hif-1	20
41	hif-1	20
42	hif-1	20
43	hif-1	20
44	hif-1	20
45	hif-1	20
46	hif-1	22
47	hif-1	22
48	hif-1	22
49	hif-1	22
50	hif-1	24
51	hif-1	24
52	hif-1	24
53	hif-1	24
54	hif-1	24
55	hif-1	24
56	hif-1	24
57	hif-1	24
58	hif-1	27
59	hif-1	27
60	hif-1	27
61	hif-1	27
62	hif-1	29
63	hif-1	29
64	hif-1	29
