1	vhl-1	36
2	vhl-1	36
3	vhl-1	38
4	vhl-1	38
5	vhl-1	38
6	vhl-1	38
7	vhl-1	38
8	vhl-1	41
9	vhl-1	41
10	vhl-1	41
11	vhl-1	41
12	vhl-1	41
13	vhl-1	41
14	vhl-1	41
15	vhl-1	43
16	vhl-1	43
17	vhl-1	43
18	vhl-1	43
19	vhl-1	43
20	vhl-1	43
21	vhl-1	45
22	vhl-1	45
23	vhl-1	45
24	vhl-1	45
25	vhl-1	45
26	vhl-1	45
27	vhl-1	45
28	vhl-1	45
29	vhl-1	45
30	vhl-1	45
31	vhl-1	45
32	vhl-1	45
33	vhl-1	45
34	vhl-1	45
35	vhl-1	45
36	vhl-1	48
37	vhl-1	48
38	vhl-1	48
39	vhl-1	50
40	vhl-1	50
41	vhl-1	50
42	vhl-1	52
43	vhl-1	52
44	vhl-1	52
45	vhl-1	52
46	vhl-1	55
47	vhl-1	57
48	vhl-1	57
49	vhl-1	57
50	vhl-1	57
51	vhl-1	62
52	vhl-1	66
53	vhl-1	38
54	vhl-1	41
55	vhl-1	34
56	vhl-1	38
57	vhl-1	38
58	vhl-1	41
59	vhl-1	43
60	vhl-1	43
61	vhl-1	43
62	vhl-1	45
63	vhl-1	45
64	vhl-1	45
65	vhl-1	45
66	vhl-1	45
67	vhl-1	45
68	vhl-1	45
69	vhl-1	45
70	vhl-1	45
71	vhl-1	45
72	vhl-1	45
73	vhl-1	48
74	vhl-1	48
75	vhl-1	48
76	vhl-1	48
77	vhl-1	48
78	vhl-1	48
79	vhl-1	48
80	vhl-1	48
81	vhl-1	48
82	vhl-1	48
83	vhl-1	48
84	vhl-1	50
85	vhl-1	50
86	vhl-1	50
87	vhl-1	50
88	vhl-1	50
89	vhl-1	50
90	vhl-1	50
91	vhl-1	50
92	vhl-1	50
93	vhl-1	50
94	vhl-1	50
95	vhl-1	50
96	vhl-1	50
97	vhl-1	50
98	vhl-1	50
99	vhl-1	52
100	vhl-1	52
101	vhl-1	52
102	vhl-1	52
103	vhl-1	52
104	vhl-1	52
105	vhl-1	52
106	vhl-1	55
107	vhl-1	55
108	vhl-1	55
109	vhl-1	55
110	vhl-1	57
111	vhl-1	57
112	vhl-1	57
113	vhl-1	57
114	vhl-1	57
115	vhl-1	62
116	vhl-1	62
117	vhl-1	66
118	vhl-1	43
