1	0.mM.caffeine.15dgrC	31
2	0.mM.caffeine.15dgrC	31
3	0.mM.caffeine.15dgrC	31
4	0.mM.caffeine.15dgrC	31
5	0.mM.caffeine.15dgrC	31
6	0.mM.caffeine.15dgrC	31
7	0.mM.caffeine.15dgrC	31
8	0.mM.caffeine.15dgrC	31
9	0.mM.caffeine.15dgrC	31
10	0.mM.caffeine.15dgrC	31
11	0.mM.caffeine.15dgrC	28
12	0.mM.caffeine.15dgrC	31
13	0.mM.caffeine.15dgrC	38
14	0.mM.caffeine.15dgrC	38
15	0.mM.caffeine.15dgrC	28
16	0.mM.caffeine.15dgrC	28
17	0.mM.caffeine.15dgrC	28
18	0.mM.caffeine.15dgrC	28
19	0.mM.caffeine.15dgrC	28
20	0.mM.caffeine.15dgrC	31
21	0.mM.caffeine.15dgrC	31
22	0.mM.caffeine.15dgrC	31
23	0.mM.caffeine.15dgrC	31
24	0.mM.caffeine.15dgrC	31
25	0.mM.caffeine.15dgrC	31
26	0.mM.caffeine.15dgrC	31
27	0.mM.caffeine.15dgrC	31
28	0.mM.caffeine.15dgrC	31
29	0.mM.caffeine.15dgrC	31
30	0.mM.caffeine.15dgrC	31
31	0.mM.caffeine.15dgrC	31
32	0.mM.caffeine.15dgrC	31
33	0.mM.caffeine.15dgrC	31
34	0.mM.caffeine.15dgrC	31
35	0.mM.caffeine.15dgrC	38
36	0.mM.caffeine.15dgrC	23
37	0.mM.caffeine.15dgrC	28
38	0.mM.caffeine.15dgrC	31
39	0.mM.caffeine.15dgrC	28
40	0.mM.caffeine.15dgrC	28
41	0.mM.caffeine.15dgrC	28
42	0.mM.caffeine.15dgrC	28
43	0.mM.caffeine.15dgrC	28
44	0.mM.caffeine.15dgrC	28
45	0.mM.caffeine.15dgrC	28
46	0.mM.caffeine.15dgrC	28
47	0.mM.caffeine.15dgrC	28
48	0.mM.caffeine.15dgrC	38
49	0.mM.caffeine.15dgrC	31
50	0.mM.caffeine.15dgrC	31
51	0.mM.caffeine.15dgrC	31
52	0.mM.caffeine.15dgrC	31
53	0.mM.caffeine.15dgrC	31
54	0.mM.caffeine.15dgrC	31
55	0.mM.caffeine.15dgrC	31
56	0.mM.caffeine.15dgrC	38
57	0.mM.caffeine.15dgrC	38
58	0.mM.caffeine.15dgrC	38
59	0.mM.caffeine.15dgrC	25
60	0.mM.caffeine.15dgrC	25
61	0.mM.caffeine.15dgrC	28
62	0.mM.caffeine.15dgrC	31
63	0.mM.caffeine.15dgrC	31
64	0.mM.caffeine.15dgrC	31
65	0.mM.caffeine.15dgrC	31
66	0.mM.caffeine.15dgrC	31
67	0.mM.caffeine.15dgrC	31
68	0.mM.caffeine.15dgrC	35
69	0.mM.caffeine.15dgrC	35
70	0.mM.caffeine.15dgrC	38
71	0.mM.caffeine.15dgrC	38
72	0.mM.caffeine.15dgrC	25
73	0.mM.caffeine.15dgrC	25
74	0.mM.caffeine.15dgrC	25
75	0.mM.caffeine.15dgrC	35
