1	hif-1	23
2	hif-1	23
3	hif-1	28
4	hif-1	30
5	hif-1	30
6	hif-1	30
7	hif-1	33
8	hif-1	33
9	hif-1	33
10	hif-1	33
11	hif-1	44
12	hif-1	23
13	hif-1	26
14	hif-1	26
15	hif-1	26
16	hif-1	26
17	hif-1	26
18	hif-1	26
19	hif-1	28
20	hif-1	28
21	hif-1	28
22	hif-1	28
23	hif-1	28
24	hif-1	28
25	hif-1	28
26	hif-1	28
27	hif-1	30
28	hif-1	30
29	hif-1	33
30	hif-1	33
31	hif-1	33
32	hif-1	33
33	hif-1	33
34	hif-1	33
35	hif-1	33
36	hif-1	35
37	hif-1	37
38	hif-1	37
39	hif-1	21
40	hif-1	35
41	hif-1	37
42	hif-1	19
43	hif-1	19
44	hif-1	21
45	hif-1	23
46	hif-1	28
47	hif-1	28
48	hif-1	28
49	hif-1	28
50	hif-1	30
51	hif-1	30
52	hif-1	33
53	hif-1	33
54	hif-1	33
55	hif-1	33
56	hif-1	33
57	hif-1	35
58	hif-1	40
59	hif-1	40
60	hif-1	44
61	hif-1	47
62	hif-1	51
63	hif-1	58
64	hif-1	23
65	hif-1	26
66	hif-1	28
67	hif-1	33
68	hif-1	33
69	hif-1	33
70	hif-1	33
71	hif-1	33
72	hif-1	33
73	hif-1	33
74	hif-1	33
75	hif-1	35
76	hif-1	35
77	hif-1	35
78	hif-1	37
79	hif-1	37
80	hif-1	37
81	hif-1	21
82	hif-1	33
83	hif-1	35
84	hif-1	35
85	hif-1	35
86	hif-1	37
87	hif-1	40
88	hif-1	40
