1	N2.EV(RNAi)	19
2	N2.EV(RNAi)	28
3	N2.EV(RNAi)	30
4	N2.EV(RNAi)	30
5	N2.EV(RNAi)	30
6	N2.EV(RNAi)	30
7	N2.EV(RNAi)	30
8	N2.EV(RNAi)	33
9	N2.EV(RNAi)	33
10	N2.EV(RNAi)	33
11	N2.EV(RNAi)	35
12	N2.EV(RNAi)	35
13	N2.EV(RNAi)	37
14	N2.EV(RNAi)	19
15	N2.EV(RNAi)	21
16	N2.EV(RNAi)	21
17	N2.EV(RNAi)	21
18	N2.EV(RNAi)	21
19	N2.EV(RNAi)	21
20	N2.EV(RNAi)	21
21	N2.EV(RNAi)	23
22	N2.EV(RNAi)	23
23	N2.EV(RNAi)	23
24	N2.EV(RNAi)	23
25	N2.EV(RNAi)	23
26	N2.EV(RNAi)	23
27	N2.EV(RNAi)	23
28	N2.EV(RNAi)	23
29	N2.EV(RNAi)	23
30	N2.EV(RNAi)	26
31	N2.EV(RNAi)	26
32	N2.EV(RNAi)	26
33	N2.EV(RNAi)	26
34	N2.EV(RNAi)	26
35	N2.EV(RNAi)	26
36	N2.EV(RNAi)	26
37	N2.EV(RNAi)	26
38	N2.EV(RNAi)	26
39	N2.EV(RNAi)	26
40	N2.EV(RNAi)	26
41	N2.EV(RNAi)	26
42	N2.EV(RNAi)	26
43	N2.EV(RNAi)	26
44	N2.EV(RNAi)	28
45	N2.EV(RNAi)	28
46	N2.EV(RNAi)	28
47	N2.EV(RNAi)	28
48	N2.EV(RNAi)	28
49	N2.EV(RNAi)	28
50	N2.EV(RNAi)	28
51	N2.EV(RNAi)	28
52	N2.EV(RNAi)	28
53	N2.EV(RNAi)	28
54	N2.EV(RNAi)	30
55	N2.EV(RNAi)	30
56	N2.EV(RNAi)	30
57	N2.EV(RNAi)	33
58	N2.EV(RNAi)	19
59	N2.EV(RNAi)	26
60	N2.EV(RNAi)	26
61	N2.EV(RNAi)	26
62	N2.EV(RNAi)	26
63	N2.EV(RNAi)	28
64	N2.EV(RNAi)	28
65	N2.EV(RNAi)	16
66	N2.EV(RNAi)	19
67	N2.EV(RNAi)	19
68	N2.EV(RNAi)	28
69	N2.EV(RNAi)	28
70	N2.EV(RNAi)	30
71	N2.EV(RNAi)	33
72	N2.EV(RNAi)	33
73	N2.EV(RNAi)	33
74	N2.EV(RNAi)	33
75	N2.EV(RNAi)	33
76	N2.EV(RNAi)	33
77	N2.EV(RNAi)	33
78	N2.EV(RNAi)	35
79	N2.EV(RNAi)	35
80	N2.EV(RNAi)	35
81	N2.EV(RNAi)	37
82	N2.EV(RNAi)	37
83	N2.EV(RNAi)	19
84	N2.EV(RNAi)	19
85	N2.EV(RNAi)	21
86	N2.EV(RNAi)	21
87	N2.EV(RNAi)	23
88	N2.EV(RNAi)	23
89	N2.EV(RNAi)	23
90	N2.EV(RNAi)	23
91	N2.EV(RNAi)	23
92	N2.EV(RNAi)	23
93	N2.EV(RNAi)	23
94	N2.EV(RNAi)	23
95	N2.EV(RNAi)	26
96	N2.EV(RNAi)	26
97	N2.EV(RNAi)	26
98	N2.EV(RNAi)	26
99	N2.EV(RNAi)	26
100	N2.EV(RNAi)	26
101	N2.EV(RNAi)	26
102	N2.EV(RNAi)	26
103	N2.EV(RNAi)	26
104	N2.EV(RNAi)	28
105	N2.EV(RNAi)	28
106	N2.EV(RNAi)	28
107	N2.EV(RNAi)	28
108	N2.EV(RNAi)	28
109	N2.EV(RNAi)	28
110	N2.EV(RNAi)	30
111	N2.EV(RNAi)	30
112	N2.EV(RNAi)	30
113	N2.EV(RNAi)	30
114	N2.EV(RNAi)	33
115	N2.EV(RNAi)	35
116	N2.EV(RNAi)	19
117	N2.EV(RNAi)	19
118	N2.EV(RNAi)	21
119	N2.EV(RNAi)	26
120	N2.EV(RNAi)	26
121	N2.EV(RNAi)	28
122	N2.EV(RNAi)	28
123	N2.EV(RNAi)	30
