1	N2.rpl-9.(RNAi)	10
2	N2.rpl-9.(RNAi)	10
3	N2.rpl-9.(RNAi)	10
4	N2.rpl-9.(RNAi)	10
5	N2.rpl-9.(RNAi)	10
6	N2.rpl-9.(RNAi)	12
7	N2.rpl-9.(RNAi)	12
8	N2.rpl-9.(RNAi)	12
9	N2.rpl-9.(RNAi)	12
10	N2.rpl-9.(RNAi)	13
11	N2.rpl-9.(RNAi)	13
12	N2.rpl-9.(RNAi)	13
13	N2.rpl-9.(RNAi)	13
14	N2.rpl-9.(RNAi)	13
15	N2.rpl-9.(RNAi)	13
16	N2.rpl-9.(RNAi)	13
17	N2.rpl-9.(RNAi)	13
18	N2.rpl-9.(RNAi)	13
19	N2.rpl-9.(RNAi)	13
20	N2.rpl-9.(RNAi)	14
21	N2.rpl-9.(RNAi)	14
22	N2.rpl-9.(RNAi)	14
23	N2.rpl-9.(RNAi)	14
24	N2.rpl-9.(RNAi)	14
25	N2.rpl-9.(RNAi)	14
26	N2.rpl-9.(RNAi)	14
27	N2.rpl-9.(RNAi)	14
28	N2.rpl-9.(RNAi)	14
29	N2.rpl-9.(RNAi)	14
30	N2.rpl-9.(RNAi)	14
31	N2.rpl-9.(RNAi)	14
32	N2.rpl-9.(RNAi)	14
33	N2.rpl-9.(RNAi)	14
34	N2.rpl-9.(RNAi)	15
35	N2.rpl-9.(RNAi)	15
36	N2.rpl-9.(RNAi)	15
37	N2.rpl-9.(RNAi)	15
38	N2.rpl-9.(RNAi)	15
39	N2.rpl-9.(RNAi)	15
40	N2.rpl-9.(RNAi)	15
41	N2.rpl-9.(RNAi)	15
42	N2.rpl-9.(RNAi)	15
43	N2.rpl-9.(RNAi)	15
44	N2.rpl-9.(RNAi)	15
45	N2.rpl-9.(RNAi)	16
46	N2.rpl-9.(RNAi)	16
47	N2.rpl-9.(RNAi)	16
48	N2.rpl-9.(RNAi)	16
49	N2.rpl-9.(RNAi)	16
50	N2.rpl-9.(RNAi)	16
51	N2.rpl-9.(RNAi)	16
52	N2.rpl-9.(RNAi)	16
53	N2.rpl-9.(RNAi)	16
54	N2.rpl-9.(RNAi)	16
55	N2.rpl-9.(RNAi)	16
56	N2.rpl-9.(RNAi)	16
57	N2.rpl-9.(RNAi)	18
58	N2.rpl-9.(RNAi)	18
59	N2.rpl-9.(RNAi)	18
60	N2.rpl-9.(RNAi)	18
61	N2.rpl-9.(RNAi)	18
62	N2.rpl-9.(RNAi)	18
63	N2.rpl-9.(RNAi)	18
64	N2.rpl-9.(RNAi)	18
65	N2.rpl-9.(RNAi)	18
66	N2.rpl-9.(RNAi)	18
67	N2.rpl-9.(RNAi)	18
68	N2.rpl-9.(RNAi)	18
69	N2.rpl-9.(RNAi)	18
70	N2.rpl-9.(RNAi)	18
71	N2.rpl-9.(RNAi)	18
72	N2.rpl-9.(RNAi)	18
73	N2.rpl-9.(RNAi)	18
74	N2.rpl-9.(RNAi)	18
75	N2.rpl-9.(RNAi)	18
76	N2.rpl-9.(RNAi)	18
77	N2.rpl-9.(RNAi)	18
78	N2.rpl-9.(RNAi)	18
79	N2.rpl-9.(RNAi)	18
80	N2.rpl-9.(RNAi)	20
81	N2.rpl-9.(RNAi)	20
82	N2.rpl-9.(RNAi)	20
83	N2.rpl-9.(RNAi)	20
84	N2.rpl-9.(RNAi)	20
85	N2.rpl-9.(RNAi)	20
86	N2.rpl-9.(RNAi)	20
87	N2.rpl-9.(RNAi)	20
88	N2.rpl-9.(RNAi)	20
89	N2.rpl-9.(RNAi)	20
90	N2.rpl-9.(RNAi)	20
91	N2.rpl-9.(RNAi)	20
92	N2.rpl-9.(RNAi)	22
93	N2.rpl-9.(RNAi)	22
94	N2.rpl-9.(RNAi)	22
95	N2.rpl-9.(RNAi)	22
96	N2.rpl-9.(RNAi)	22
97	N2.rpl-9.(RNAi)	22
98	N2.rpl-9.(RNAi)	14
99	N2.rpl-9.(RNAi)	10
100	N2.rpl-9.(RNAi)	10
101	N2.rpl-9.(RNAi)	10
102	N2.rpl-9.(RNAi)	12
103	N2.rpl-9.(RNAi)	12
104	N2.rpl-9.(RNAi)	13
105	N2.rpl-9.(RNAi)	13
106	N2.rpl-9.(RNAi)	13
107	N2.rpl-9.(RNAi)	13
108	N2.rpl-9.(RNAi)	13
109	N2.rpl-9.(RNAi)	13
110	N2.rpl-9.(RNAi)	13
111	N2.rpl-9.(RNAi)	13
112	N2.rpl-9.(RNAi)	13
113	N2.rpl-9.(RNAi)	14
114	N2.rpl-9.(RNAi)	14
115	N2.rpl-9.(RNAi)	14
116	N2.rpl-9.(RNAi)	14
117	N2.rpl-9.(RNAi)	14
118	N2.rpl-9.(RNAi)	14
119	N2.rpl-9.(RNAi)	14
120	N2.rpl-9.(RNAi)	14
121	N2.rpl-9.(RNAi)	14
122	N2.rpl-9.(RNAi)	14
123	N2.rpl-9.(RNAi)	14
124	N2.rpl-9.(RNAi)	14
125	N2.rpl-9.(RNAi)	14
126	N2.rpl-9.(RNAi)	15
127	N2.rpl-9.(RNAi)	15
128	N2.rpl-9.(RNAi)	15
129	N2.rpl-9.(RNAi)	15
130	N2.rpl-9.(RNAi)	15
131	N2.rpl-9.(RNAi)	15
132	N2.rpl-9.(RNAi)	15
133	N2.rpl-9.(RNAi)	15
134	N2.rpl-9.(RNAi)	15
135	N2.rpl-9.(RNAi)	15
136	N2.rpl-9.(RNAi)	15
137	N2.rpl-9.(RNAi)	15
138	N2.rpl-9.(RNAi)	15
139	N2.rpl-9.(RNAi)	16
140	N2.rpl-9.(RNAi)	16
141	N2.rpl-9.(RNAi)	16
142	N2.rpl-9.(RNAi)	16
143	N2.rpl-9.(RNAi)	16
144	N2.rpl-9.(RNAi)	16
145	N2.rpl-9.(RNAi)	16
146	N2.rpl-9.(RNAi)	16
147	N2.rpl-9.(RNAi)	16
148	N2.rpl-9.(RNAi)	16
149	N2.rpl-9.(RNAi)	16
150	N2.rpl-9.(RNAi)	16
151	N2.rpl-9.(RNAi)	18
152	N2.rpl-9.(RNAi)	18
153	N2.rpl-9.(RNAi)	18
154	N2.rpl-9.(RNAi)	18
155	N2.rpl-9.(RNAi)	18
156	N2.rpl-9.(RNAi)	18
157	N2.rpl-9.(RNAi)	18
158	N2.rpl-9.(RNAi)	18
159	N2.rpl-9.(RNAi)	18
160	N2.rpl-9.(RNAi)	18
161	N2.rpl-9.(RNAi)	18
162	N2.rpl-9.(RNAi)	18
163	N2.rpl-9.(RNAi)	18
164	N2.rpl-9.(RNAi)	18
165	N2.rpl-9.(RNAi)	18
166	N2.rpl-9.(RNAi)	18
167	N2.rpl-9.(RNAi)	18
168	N2.rpl-9.(RNAi)	18
169	N2.rpl-9.(RNAi)	18
170	N2.rpl-9.(RNAi)	18
171	N2.rpl-9.(RNAi)	18
172	N2.rpl-9.(RNAi)	18
173	N2.rpl-9.(RNAi)	18
174	N2.rpl-9.(RNAi)	18
175	N2.rpl-9.(RNAi)	18
176	N2.rpl-9.(RNAi)	18
177	N2.rpl-9.(RNAi)	18
178	N2.rpl-9.(RNAi)	18
179	N2.rpl-9.(RNAi)	20
180	N2.rpl-9.(RNAi)	20
181	N2.rpl-9.(RNAi)	20
182	N2.rpl-9.(RNAi)	20
183	N2.rpl-9.(RNAi)	20
184	N2.rpl-9.(RNAi)	20
185	N2.rpl-9.(RNAi)	20
186	N2.rpl-9.(RNAi)	20
187	N2.rpl-9.(RNAi)	20
188	N2.rpl-9.(RNAi)	20
189	N2.rpl-9.(RNAi)	20
190	N2.rpl-9.(RNAi)	22
191	N2.rpl-9.(RNAi)	22
192	N2.rpl-9.(RNAi)	10
193	N2.rpl-9.(RNAi)	14
194	N2.rpl-9.(RNAi)	14
