1	N2.ATP-3(RNAi)	8
2	N2.ATP-3(RNAi)	8
3	N2.ATP-3(RNAi)	8
4	N2.ATP-3(RNAi)	8
5	N2.ATP-3(RNAi)	8
6	N2.ATP-3(RNAi)	8
7	N2.ATP-3(RNAi)	8
8	N2.ATP-3(RNAi)	8
9	N2.ATP-3(RNAi)	8
10	N2.ATP-3(RNAi)	8
11	N2.ATP-3(RNAi)	10
12	N2.ATP-3(RNAi)	10
13	N2.ATP-3(RNAi)	10
14	N2.ATP-3(RNAi)	12
15	N2.ATP-3(RNAi)	12
16	N2.ATP-3(RNAi)	12
17	N2.ATP-3(RNAi)	12
18	N2.ATP-3(RNAi)	12
19	N2.ATP-3(RNAi)	12
20	N2.ATP-3(RNAi)	13
21	N2.ATP-3(RNAi)	13
22	N2.ATP-3(RNAi)	13
23	N2.ATP-3(RNAi)	13
24	N2.ATP-3(RNAi)	13
25	N2.ATP-3(RNAi)	15
26	N2.ATP-3(RNAi)	15
27	N2.ATP-3(RNAi)	15
28	N2.ATP-3(RNAi)	15
29	N2.ATP-3(RNAi)	15
30	N2.ATP-3(RNAi)	15
31	N2.ATP-3(RNAi)	15
32	N2.ATP-3(RNAi)	15
33	N2.ATP-3(RNAi)	15
34	N2.ATP-3(RNAi)	15
35	N2.ATP-3(RNAi)	15
36	N2.ATP-3(RNAi)	15
37	N2.ATP-3(RNAi)	15
38	N2.ATP-3(RNAi)	15
39	N2.ATP-3(RNAi)	15
40	N2.ATP-3(RNAi)	15
41	N2.ATP-3(RNAi)	15
42	N2.ATP-3(RNAi)	15
43	N2.ATP-3(RNAi)	15
44	N2.ATP-3(RNAi)	17
45	N2.ATP-3(RNAi)	17
46	N2.ATP-3(RNAi)	17
47	N2.ATP-3(RNAi)	17
48	N2.ATP-3(RNAi)	17
49	N2.ATP-3(RNAi)	17
50	N2.ATP-3(RNAi)	19
51	N2.ATP-3(RNAi)	19
52	N2.ATP-3(RNAi)	19
53	N2.ATP-3(RNAi)	19
54	N2.ATP-3(RNAi)	21
55	N2.ATP-3(RNAi)	21
56	N2.ATP-3(RNAi)	8
57	N2.ATP-3(RNAi)	10
58	N2.ATP-3(RNAi)	12
59	N2.ATP-3(RNAi)	19
60	N2.ATP-3(RNAi)	12
61	N2.ATP-3(RNAi)	12
62	N2.ATP-3(RNAi)	8
63	N2.ATP-3(RNAi)	8
64	N2.ATP-3(RNAi)	8
65	N2.ATP-3(RNAi)	8
66	N2.ATP-3(RNAi)	8
67	N2.ATP-3(RNAi)	8
68	N2.ATP-3(RNAi)	8
69	N2.ATP-3(RNAi)	8
70	N2.ATP-3(RNAi)	8
71	N2.ATP-3(RNAi)	8
72	N2.ATP-3(RNAi)	8
73	N2.ATP-3(RNAi)	10
74	N2.ATP-3(RNAi)	10
75	N2.ATP-3(RNAi)	10
76	N2.ATP-3(RNAi)	10
77	N2.ATP-3(RNAi)	10
78	N2.ATP-3(RNAi)	10
79	N2.ATP-3(RNAi)	12
80	N2.ATP-3(RNAi)	12
81	N2.ATP-3(RNAi)	12
82	N2.ATP-3(RNAi)	12
83	N2.ATP-3(RNAi)	12
84	N2.ATP-3(RNAi)	12
85	N2.ATP-3(RNAi)	13
86	N2.ATP-3(RNAi)	13
87	N2.ATP-3(RNAi)	13
88	N2.ATP-3(RNAi)	13
89	N2.ATP-3(RNAi)	13
90	N2.ATP-3(RNAi)	13
91	N2.ATP-3(RNAi)	13
92	N2.ATP-3(RNAi)	13
93	N2.ATP-3(RNAi)	13
94	N2.ATP-3(RNAi)	13
95	N2.ATP-3(RNAi)	15
96	N2.ATP-3(RNAi)	15
97	N2.ATP-3(RNAi)	15
98	N2.ATP-3(RNAi)	15
99	N2.ATP-3(RNAi)	15
100	N2.ATP-3(RNAi)	15
101	N2.ATP-3(RNAi)	15
102	N2.ATP-3(RNAi)	15
103	N2.ATP-3(RNAi)	17
104	N2.ATP-3(RNAi)	17
105	N2.ATP-3(RNAi)	17
106	N2.ATP-3(RNAi)	17
107	N2.ATP-3(RNAi)	17
108	N2.ATP-3(RNAi)	17
109	N2.ATP-3(RNAi)	17
110	N2.ATP-3(RNAi)	17
111	N2.ATP-3(RNAi)	17
112	N2.ATP-3(RNAi)	19
113	N2.ATP-3(RNAi)	19
114	N2.ATP-3(RNAi)	19
115	N2.ATP-3(RNAi)	19
116	N2.ATP-3(RNAi)	19
117	N2.ATP-3(RNAi)	19
118	N2.ATP-3(RNAi)	19
119	N2.ATP-3(RNAi)	8
120	N2.ATP-3(RNAi)	10
121	N2.ATP-3(RNAi)	12
