1	vhl-1	10
2	vhl-1	10
3	vhl-1	18
4	vhl-1	18
5	vhl-1	20
6	vhl-1	20
7	vhl-1	22
8	vhl-1	24
9	vhl-1	29
10	vhl-1	29
11	vhl-1	29
12	vhl-1	29
13	vhl-1	31
14	vhl-1	31
15	vhl-1	31
16	vhl-1	31
17	vhl-1	31
18	vhl-1	34
19	vhl-1	34
20	vhl-1	36
21	vhl-1	36
22	vhl-1	36
23	vhl-1	36
24	vhl-1	36
25	vhl-1	36
26	vhl-1	36
27	vhl-1	36
28	vhl-1	36
29	vhl-1	36
30	vhl-1	36
31	vhl-1	38
32	vhl-1	38
33	vhl-1	38
34	vhl-1	38
35	vhl-1	38
36	vhl-1	38
37	vhl-1	38
38	vhl-1	38
39	vhl-1	38
40	vhl-1	41
41	vhl-1	41
42	vhl-1	41
43	vhl-1	41
44	vhl-1	41
45	vhl-1	41
46	vhl-1	41
47	vhl-1	41
48	vhl-1	41
49	vhl-1	41
50	vhl-1	41
51	vhl-1	41
52	vhl-1	41
53	vhl-1	41
54	vhl-1	41
55	vhl-1	41
56	vhl-1	41
57	vhl-1	41
58	vhl-1	41
59	vhl-1	41
60	vhl-1	41
61	vhl-1	41
62	vhl-1	41
63	vhl-1	41
64	vhl-1	41
65	vhl-1	41
66	vhl-1	43
67	vhl-1	43
68	vhl-1	43
69	vhl-1	45
70	vhl-1	31
71	vhl-1	38
72	vhl-1	38
73	vhl-1	41
74	vhl-1	31
75	vhl-1	34
76	vhl-1	24
77	vhl-1	24
78	vhl-1	24
79	vhl-1	24
80	vhl-1	24
81	vhl-1	24
82	vhl-1	24
83	vhl-1	27
84	vhl-1	27
85	vhl-1	27
86	vhl-1	27
87	vhl-1	27
88	vhl-1	27
89	vhl-1	27
90	vhl-1	29
91	vhl-1	29
92	vhl-1	29
93	vhl-1	29
94	vhl-1	34
95	vhl-1	34
96	vhl-1	34
97	vhl-1	34
98	vhl-1	36
99	vhl-1	36
100	vhl-1	36
101	vhl-1	38
102	vhl-1	38
103	vhl-1	38
104	vhl-1	41
105	vhl-1	41
106	vhl-1	41
107	vhl-1	41
108	vhl-1	41
109	vhl-1	41
110	vhl-1	41
111	vhl-1	41
112	vhl-1	41
113	vhl-1	41
114	vhl-1	41
115	vhl-1	41
116	vhl-1	41
117	vhl-1	41
118	vhl-1	41
119	vhl-1	41
120	vhl-1	41
121	vhl-1	41
122	vhl-1	41
123	vhl-1	41
124	vhl-1	41
125	vhl-1	43
126	vhl-1	43
127	vhl-1	43
128	vhl-1	43
129	vhl-1	43
130	vhl-1	36
131	vhl-1	41
