1	WT.RPL-6(RNAi)	21
2	WT.RPL-6(RNAi)	21
3	WT.RPL-6(RNAi)	21
4	WT.RPL-6(RNAi)	21
5	WT.RPL-6(RNAi)	24
6	WT.RPL-6(RNAi)	31
7	WT.RPL-6(RNAi)	21
8	WT.RPL-6(RNAi)	21
9	WT.RPL-6(RNAi)	21
10	WT.RPL-6(RNAi)	28
11	WT.RPL-6(RNAi)	28
12	WT.RPL-6(RNAi)	28
13	WT.RPL-6(RNAi)	28
14	WT.RPL-6(RNAi)	28
15	WT.RPL-6(RNAi)	28
16	WT.RPL-6(RNAi)	28
17	WT.RPL-6(RNAi)	31
18	WT.RPL-6(RNAi)	18
19	WT.RPL-6(RNAi)	18
20	WT.RPL-6(RNAi)	18
21	WT.RPL-6(RNAi)	21
22	WT.RPL-6(RNAi)	21
23	WT.RPL-6(RNAi)	21
24	WT.RPL-6(RNAi)	21
25	WT.RPL-6(RNAi)	28
26	WT.RPL-6(RNAi)	18
27	WT.RPL-6(RNAi)	18
28	WT.RPL-6(RNAi)	18
29	WT.RPL-6(RNAi)	18
30	WT.RPL-6(RNAi)	18
31	WT.RPL-6(RNAi)	21
32	WT.RPL-6(RNAi)	21
33	WT.RPL-6(RNAi)	21
34	WT.RPL-6(RNAi)	21
35	WT.RPL-6(RNAi)	21
36	WT.RPL-6(RNAi)	28
37	WT.RPL-6(RNAi)	21
38	WT.RPL-6(RNAi)	28
39	WT.RPL-6(RNAi)	28
40	WT.RPL-6(RNAi)	28
41	WT.RPL-6(RNAi)	28
42	WT.RPL-6(RNAi)	28
43	WT.RPL-6(RNAi)	28
44	WT.RPL-6(RNAi)	28
45	WT.RPL-6(RNAi)	28
46	WT.RPL-6(RNAi)	28
47	WT.RPL-6(RNAi)	31
48	WT.RPL-6(RNAi)	18
49	WT.RPL-6(RNAi)	18
50	WT.RPL-6(RNAi)	21
51	WT.RPL-6(RNAi)	21
52	WT.RPL-6(RNAi)	21
53	WT.RPL-6(RNAi)	21
54	WT.RPL-6(RNAi)	21
55	WT.RPL-6(RNAi)	18
56	WT.RPL-6(RNAi)	21
57	WT.RPL-6(RNAi)	21
58	WT.RPL-6(RNAi)	21
59	WT.RPL-6(RNAi)	21
60	WT.RPL-6(RNAi)	21
61	WT.RPL-6(RNAi)	21
62	WT.RPL-6(RNAi)	21
63	WT.RPL-6(RNAi)	21
64	WT.RPL-6(RNAi)	21
65	WT.RPL-6(RNAi)	21
66	WT.RPL-6(RNAi)	28
67	WT.RPL-6(RNAi)	28
68	WT.RPL-6(RNAi)	28
69	WT.RPL-6(RNAi)	21
70	WT.RPL-6(RNAi)	21
71	WT.RPL-6(RNAi)	21
72	WT.RPL-6(RNAi)	21
73	WT.RPL-6(RNAi)	21
74	WT.RPL-6(RNAi)	21
75	WT.RPL-6(RNAi)	28
76	WT.RPL-6(RNAi)	28
77	WT.RPL-6(RNAi)	21
78	WT.RPL-6(RNAi)	21
79	WT.RPL-6(RNAi)	21
80	WT.RPL-6(RNAi)	21
81	WT.RPL-6(RNAi)	21
82	WT.RPL-6(RNAi)	21
83	WT.RPL-6(RNAi)	18
