1	N2.F-28(RNAi)	11
2	N2.F-28(RNAi)	11
3	N2.F-28(RNAi)	19
4	N2.F-28(RNAi)	19
5	N2.F-28(RNAi)	21
6	N2.F-28(RNAi)	21
7	N2.F-28(RNAi)	21
8	N2.F-28(RNAi)	21
9	N2.F-28(RNAi)	21
10	N2.F-28(RNAi)	21
11	N2.F-28(RNAi)	21
12	N2.F-28(RNAi)	21
13	N2.F-28(RNAi)	23
14	N2.F-28(RNAi)	23
15	N2.F-28(RNAi)	23
16	N2.F-28(RNAi)	25
17	N2.F-28(RNAi)	25
18	N2.F-28(RNAi)	25
19	N2.F-28(RNAi)	25
20	N2.F-28(RNAi)	25
21	N2.F-28(RNAi)	25
22	N2.F-28(RNAi)	25
23	N2.F-28(RNAi)	25
24	N2.F-28(RNAi)	27
25	N2.F-28(RNAi)	27
26	N2.F-28(RNAi)	11
27	N2.F-28(RNAi)	14
28	N2.F-28(RNAi)	14
29	N2.F-28(RNAi)	19
30	N2.F-28(RNAi)	19
31	N2.F-28(RNAi)	19
32	N2.F-28(RNAi)	21
33	N2.F-28(RNAi)	21
34	N2.F-28(RNAi)	21
35	N2.F-28(RNAi)	21
36	N2.F-28(RNAi)	21
37	N2.F-28(RNAi)	21
38	N2.F-28(RNAi)	23
39	N2.F-28(RNAi)	23
40	N2.F-28(RNAi)	23
41	N2.F-28(RNAi)	23
42	N2.F-28(RNAi)	23
43	N2.F-28(RNAi)	23
44	N2.F-28(RNAi)	23
45	N2.F-28(RNAi)	23
46	N2.F-28(RNAi)	23
47	N2.F-28(RNAi)	23
48	N2.F-28(RNAi)	25
49	N2.F-28(RNAi)	25
50	N2.F-28(RNAi)	25
51	N2.F-28(RNAi)	25
52	N2.F-28(RNAi)	25
53	N2.F-28(RNAi)	25
54	N2.F-28(RNAi)	25
55	N2.F-28(RNAi)	25
56	N2.F-28(RNAi)	25
57	N2.F-28(RNAi)	25
58	N2.F-28(RNAi)	25
59	N2.F-28(RNAi)	25
60	N2.F-28(RNAi)	25
61	N2.F-28(RNAi)	25
62	N2.F-28(RNAi)	27
63	N2.F-28(RNAi)	27
64	N2.F-28(RNAi)	27
65	N2.F-28(RNAi)	27
66	N2.F-28(RNAi)	27
67	N2.F-28(RNAi)	31
68	N2.F-28(RNAi)	19
69	N2.F-28(RNAi)	19
70	N2.F-28(RNAi)	19
