1	N2.F-28.RNAi	10
2	N2.F-28.RNAi	14
3	N2.F-28.RNAi	23
4	N2.F-28.RNAi	14
5	N2.F-28.RNAi	20
6	N2.F-28.RNAi	20
7	N2.F-28.RNAi	20
8	N2.F-28.RNAi	23
9	N2.F-28.RNAi	23
10	N2.F-28.RNAi	27
11	N2.F-28.RNAi	27
12	N2.F-28.RNAi	27
13	N2.F-28.RNAi	17
14	N2.F-28.RNAi	20
15	N2.F-28.RNAi	20
16	N2.F-28.RNAi	20
17	N2.F-28.RNAi	20
18	N2.F-28.RNAi	23
19	N2.F-28.RNAi	23
20	N2.F-28.RNAi	23
21	N2.F-28.RNAi	23
22	N2.F-28.RNAi	23
23	N2.F-28.RNAi	23
24	N2.F-28.RNAi	23
25	N2.F-28.RNAi	23
26	N2.F-28.RNAi	23
27	N2.F-28.RNAi	27
28	N2.F-28.RNAi	27
29	N2.F-28.RNAi	27
30	N2.F-28.RNAi	27
31	N2.F-28.RNAi	27
32	N2.F-28.RNAi	27
33	N2.F-28.RNAi	27
34	N2.F-28.RNAi	27
35	N2.F-28.RNAi	27
36	N2.F-28.RNAi	27
37	N2.F-28.RNAi	27
38	N2.F-28.RNAi	27
39	N2.F-28.RNAi	27
40	N2.F-28.RNAi	29
41	N2.F-28.RNAi	31
42	N2.F-28.RNAi	10
43	N2.F-28.RNAi	14
44	N2.F-28.RNAi	14
45	N2.F-28.RNAi	17
46	N2.F-28.RNAi	17
47	N2.F-28.RNAi	17
48	N2.F-28.RNAi	17
49	N2.F-28.RNAi	27
50	N2.F-28.RNAi	27
51	N2.F-28.RNAi	14
52	N2.F-28.RNAi	20
53	N2.F-28.RNAi	23
54	N2.F-28.RNAi	23
55	N2.F-28.RNAi	23
56	N2.F-28.RNAi	27
57	N2.F-28.RNAi	14
58	N2.F-28.RNAi	14
59	N2.F-28.RNAi	14
60	N2.F-28.RNAi	20
61	N2.F-28.RNAi	20
62	N2.F-28.RNAi	20
63	N2.F-28.RNAi	20
64	N2.F-28.RNAi	20
65	N2.F-28.RNAi	23
66	N2.F-28.RNAi	23
67	N2.F-28.RNAi	23
68	N2.F-28.RNAi	23
69	N2.F-28.RNAi	23
70	N2.F-28.RNAi	23
71	N2.F-28.RNAi	27
72	N2.F-28.RNAi	27
73	N2.F-28.RNAi	27
74	N2.F-28.RNAi	27
75	N2.F-28.RNAi	27
76	N2.F-28.RNAi	27
77	N2.F-28.RNAi	27
78	N2.F-28.RNAi	27
79	N2.F-28.RNAi	27
80	N2.F-28.RNAi	14
81	N2.F-28.RNAi	17
82	N2.F-28.RNAi	20
83	N2.F-28.RNAi	23
84	N2.F-28.RNAi	23
85	N2.F-28.RNAi	23
86	N2.F-28.RNAi	27
87	N2.F-28.RNAi	27
88	N2.F-28.RNAi	27
89	N2.F-28.RNAi	27
90	N2.F-28.RNAi	29
91	N2.F-28.RNAi	14
92	N2.F-28.RNAi	14
93	N2.F-28.RNAi	23
94	N2.F-28.RNAi	27
95	N2.F-28.RNAi	27
96	N2.F-28.RNAi	27
97	N2.F-28.RNAi	14
98	N2.F-28.RNAi	14
99	N2.F-28.RNAi	14
100	N2.F-28.RNAi	20
101	N2.F-28.RNAi	20
102	N2.F-28.RNAi	20
103	N2.F-28.RNAi	23
104	N2.F-28.RNAi	23
105	N2.F-28.RNAi	23
106	N2.F-28.RNAi	23
107	N2.F-28.RNAi	23
108	N2.F-28.RNAi	23
109	N2.F-28.RNAi	27
110	N2.F-28.RNAi	27
111	N2.F-28.RNAi	27
112	N2.F-28.RNAi	27
113	N2.F-28.RNAi	27
114	N2.F-28.RNAi	27
115	N2.F-28.RNAi	27
116	N2.F-28.RNAi	27
117	N2.F-28.RNAi	29
