1	atm-1	7
2	atm-1	7
3	atm-1	9
4	atm-1	9
5	atm-1	9
6	atm-1	9
7	atm-1	9
8	atm-1	11
9	atm-1	11
10	atm-1	11
11	atm-1	11
12	atm-1	13
13	atm-1	13
14	atm-1	7
15	atm-1	9
16	atm-1	11
17	atm-1	13
18	atm-1	14
19	atm-1	14
20	atm-1	15
21	atm-1	13
22	atm-1	9
23	atm-1	9
24	atm-1	9
25	atm-1	11
26	atm-1	11
27	atm-1	11
28	atm-1	11
29	atm-1	11
30	atm-1	11
31	atm-1	11
32	atm-1	11
33	atm-1	11
34	atm-1	11
35	atm-1	11
36	atm-1	11
37	atm-1	11
38	atm-1	11
39	atm-1	11
40	atm-1	13
41	atm-1	13
42	atm-1	13
43	atm-1	13
44	atm-1	13
45	atm-1	13
46	atm-1	13
47	atm-1	13
48	atm-1	13
49	atm-1	13
50	atm-1	13
51	atm-1	13
52	atm-1	14
53	atm-1	14
54	atm-1	14
55	atm-1	14
56	atm-1	14
57	atm-1	14
58	atm-1	14
59	atm-1	14
60	atm-1	14
61	atm-1	14
62	atm-1	15
63	atm-1	15
64	atm-1	15
65	atm-1	15
66	atm-1	15
67	atm-1	15
68	atm-1	15
69	atm-1	16
70	atm-1	16
71	atm-1	16
72	atm-1	16
73	atm-1	16
74	atm-1	16
75	atm-1	16
76	atm-1	16
77	atm-1	16
78	atm-1	16
79	atm-1	16
80	atm-1	16
81	atm-1	17
82	atm-1	17
83	atm-1	17
84	atm-1	17
85	atm-1	17
86	atm-1	17
87	atm-1	17
88	atm-1	17
89	atm-1	17
90	atm-1	17
91	atm-1	17
92	atm-1	17
93	atm-1	17
94	atm-1	17
95	atm-1	17
96	atm-1	17
97	atm-1	17
98	atm-1	19
99	atm-1	19
100	atm-1	19
101	atm-1	19
102	atm-1	19
103	atm-1	19
104	atm-1	19
105	atm-1	19
106	atm-1	19
107	atm-1	19
108	atm-1	19
109	atm-1	19
110	atm-1	19
111	atm-1	19
112	atm-1	19
113	atm-1	19
114	atm-1	19
115	atm-1	19
116	atm-1	20
117	atm-1	20
118	atm-1	20
119	atm-1	20
120	atm-1	20
121	atm-1	20
122	atm-1	20
123	atm-1	20
124	atm-1	20
125	atm-1	22
126	atm-1	22
127	atm-1	22
128	atm-1	22
129	atm-1	22
130	atm-1	22
131	atm-1	22
132	atm-1	22
133	atm-1	22
134	atm-1	22
135	atm-1	22
136	atm-1	22
137	atm-1	22
138	atm-1	22
139	atm-1	22
140	atm-1	24
141	atm-1	24
142	atm-1	24
143	atm-1	27
144	atm-1	27
