1	hif-1	18
2	hif-1	18
3	hif-1	24
4	hif-1	24
5	hif-1	24
6	hif-1	24
7	hif-1	26
8	hif-1	26
9	hif-1	26
10	hif-1	26
11	hif-1	30
12	hif-1	30
13	hif-1	30
14	hif-1	30
15	hif-1	30
16	hif-1	30
17	hif-1	30
18	hif-1	30
19	hif-1	30
20	hif-1	30
21	hif-1	30
22	hif-1	30
23	hif-1	30
24	hif-1	30
25	hif-1	30
26	hif-1	30
27	hif-1	30
28	hif-1	30
29	hif-1	30
30	hif-1	30
31	hif-1	30
32	hif-1	30
33	hif-1	30
34	hif-1	32
35	hif-1	32
36	hif-1	34
37	hif-1	34
38	hif-1	34
39	hif-1	34
40	hif-1	37
41	hif-1	37
42	hif-1	37
43	hif-1	37
44	hif-1	37
45	hif-1	37
46	hif-1	37
47	hif-1	37
48	hif-1	37
49	hif-1	37
50	hif-1	37
51	hif-1	37
52	hif-1	37
53	hif-1	37
54	hif-1	37
55	hif-1	37
56	hif-1	37
57	hif-1	37
58	hif-1	37
59	hif-1	37
60	hif-1	37
61	hif-1	37
62	hif-1	37
63	hif-1	39
64	hif-1	39
65	hif-1	39
66	hif-1	39
67	hif-1	39
68	hif-1	39
69	hif-1	39
70	hif-1	39
71	hif-1	39
72	hif-1	39
73	hif-1	39
74	hif-1	41
75	hif-1	41
76	hif-1	41
77	hif-1	41
78	hif-1	41
79	hif-1	41
80	hif-1	45
81	hif-1	45
82	hif-1	45
83	hif-1	45
84	hif-1	45
85	hif-1	45
86	hif-1	45
87	hif-1	45
88	hif-1	45
89	hif-1	45
90	hif-1	45
91	hif-1	45
92	hif-1	51
93	hif-1	24
94	hif-1	24
95	hif-1	26
96	hif-1	26
97	hif-1	30
98	hif-1	30
99	hif-1	30
100	hif-1	30
101	hif-1	30
102	hif-1	30
103	hif-1	30
104	hif-1	30
105	hif-1	30
106	hif-1	30
107	hif-1	30
108	hif-1	30
109	hif-1	30
110	hif-1	30
111	hif-1	30
112	hif-1	32
113	hif-1	32
114	hif-1	32
115	hif-1	32
116	hif-1	32
117	hif-1	32
118	hif-1	34
119	hif-1	34
120	hif-1	34
121	hif-1	34
122	hif-1	37
123	hif-1	37
124	hif-1	39
125	hif-1	39
126	hif-1	39
127	hif-1	39
128	hif-1	41
129	hif-1	41
130	hif-1	18
131	hif-1	24
132	hif-1	24
133	hif-1	24
134	hif-1	26
135	hif-1	26
136	hif-1	26
137	hif-1	26
138	hif-1	26
139	hif-1	26
140	hif-1	26
141	hif-1	26
142	hif-1	26
143	hif-1	30
144	hif-1	30
145	hif-1	30
146	hif-1	32
147	hif-1	32
148	hif-1	34
149	hif-1	34
150	hif-1	39
151	hif-1	41
152	hif-1	18
153	hif-1	24
154	hif-1	24
155	hif-1	26
156	hif-1	30
157	hif-1	30
158	hif-1	39
159	hif-1	39
160	hif-1	39
161	hif-1	41
162	hif-1	41
163	hif-1	41
164	hif-1	24
165	hif-1	26
166	hif-1	30
167	hif-1	30
168	hif-1	30
169	hif-1	30
170	hif-1	30
171	hif-1	30
172	hif-1	30
173	hif-1	30
174	hif-1	30
175	hif-1	30
176	hif-1	30
177	hif-1	30
178	hif-1	30
179	hif-1	30
180	hif-1	32
181	hif-1	32
182	hif-1	39
183	hif-1	41
184	hif-1	18
185	hif-1	18
186	hif-1	18
187	hif-1	24
188	hif-1	24
189	hif-1	24
190	hif-1	24
191	hif-1	26
192	hif-1	26
193	hif-1	26
194	hif-1	26
195	hif-1	26
196	hif-1	26
197	hif-1	26
198	hif-1	26
199	hif-1	30
200	hif-1	30
201	hif-1	30
202	hif-1	30
203	hif-1	30
204	hif-1	30
205	hif-1	30
