1	egl-9	21
2	egl-9	21
3	egl-9	23
4	egl-9	23
5	egl-9	23
6	egl-9	23
7	egl-9	23
8	egl-9	23
9	egl-9	23
10	egl-9	23
11	egl-9	25
12	egl-9	25
13	egl-9	25
14	egl-9	25
15	egl-9	25
16	egl-9	25
17	egl-9	25
18	egl-9	25
19	egl-9	25
20	egl-9	28
21	egl-9	28
22	egl-9	28
23	egl-9	28
24	egl-9	28
25	egl-9	28
26	egl-9	28
27	egl-9	28
28	egl-9	28
29	egl-9	28
30	egl-9	28
31	egl-9	28
32	egl-9	30
33	egl-9	30
34	egl-9	30
35	egl-9	30
36	egl-9	30
37	egl-9	30
38	egl-9	30
39	egl-9	30
40	egl-9	30
41	egl-9	32
42	egl-9	32
43	egl-9	32
44	egl-9	32
45	egl-9	32
46	egl-9	32
47	egl-9	32
48	egl-9	32
49	egl-9	32
50	egl-9	32
51	egl-9	32
52	egl-9	32
53	egl-9	32
54	egl-9	35
55	egl-9	35
56	egl-9	35
57	egl-9	35
58	egl-9	35
59	egl-9	35
60	egl-9	35
61	egl-9	35
62	egl-9	35
63	egl-9	35
64	egl-9	37
65	egl-9	37
66	egl-9	37
67	egl-9	37
68	egl-9	37
69	egl-9	37
70	egl-9	18
71	egl-9	14
72	egl-9	21
73	egl-9	21
74	egl-9	23
75	egl-9	23
76	egl-9	23
77	egl-9	23
78	egl-9	25
79	egl-9	25
80	egl-9	25
81	egl-9	25
82	egl-9	28
83	egl-9	28
84	egl-9	28
85	egl-9	28
86	egl-9	28
87	egl-9	28
88	egl-9	28
89	egl-9	28
90	egl-9	28
91	egl-9	28
92	egl-9	28
93	egl-9	30
94	egl-9	30
95	egl-9	30
96	egl-9	30
97	egl-9	30
98	egl-9	30
99	egl-9	30
100	egl-9	30
101	egl-9	30
102	egl-9	30
103	egl-9	30
104	egl-9	30
105	egl-9	30
106	egl-9	30
107	egl-9	30
108	egl-9	30
109	egl-9	30
110	egl-9	30
111	egl-9	30
112	egl-9	30
113	egl-9	30
114	egl-9	30
115	egl-9	30
116	egl-9	30
117	egl-9	30
118	egl-9	30
119	egl-9	30
120	egl-9	30
121	egl-9	32
122	egl-9	32
123	egl-9	32
124	egl-9	32
125	egl-9	32
126	egl-9	32
127	egl-9	32
128	egl-9	32
129	egl-9	32
130	egl-9	32
131	egl-9	32
132	egl-9	32
133	egl-9	32
134	egl-9	32
135	egl-9	32
136	egl-9	32
137	egl-9	32
138	egl-9	32
139	egl-9	32
140	egl-9	32
141	egl-9	32
142	egl-9	32
143	egl-9	32
144	egl-9	32
145	egl-9	35
146	egl-9	35
147	egl-9	35
148	egl-9	35
149	egl-9	35
150	egl-9	35
151	egl-9	35
152	egl-9	35
153	egl-9	35
154	egl-9	35
155	egl-9	35
156	egl-9	35
157	egl-9	35
158	egl-9	37
159	egl-9	37
160	egl-9	37
161	egl-9	37
162	egl-9	14
163	egl-9	14
164	egl-9	14
165	egl-9	18
166	egl-9	18
167	egl-9	21
168	egl-9	21
169	egl-9	23
170	egl-9	23
171	egl-9	25
172	egl-9	25
173	egl-9	25
174	egl-9	28
175	egl-9	28
176	egl-9	28
177	egl-9	28
178	egl-9	28
179	egl-9	28
180	egl-9	28
181	egl-9	28
182	egl-9	28
183	egl-9	30
184	egl-9	30
185	egl-9	30
186	egl-9	30
187	egl-9	30
188	egl-9	30
189	egl-9	30
190	egl-9	30
191	egl-9	30
192	egl-9	32
193	egl-9	32
194	egl-9	32
195	egl-9	32
196	egl-9	32
197	egl-9	32
198	egl-9	32
199	egl-9	32
200	egl-9	32
201	egl-9	32
202	egl-9	32
203	egl-9	35
204	egl-9	35
205	egl-9	35
206	egl-9	35
207	egl-9	35
208	egl-9	35
209	egl-9	35
210	egl-9	35
211	egl-9	35
212	egl-9	35
213	egl-9	35
214	egl-9	35
215	egl-9	35
216	egl-9	35
217	egl-9	37
218	egl-9	37
219	egl-9	37
220	egl-9	37
221	egl-9	37
222	egl-9	37
223	egl-9	37
224	egl-9	37
225	egl-9	39
226	egl-9	39
227	egl-9	39
