1	N2.HIF-1(RNAi)	13
2	N2.HIF-1(RNAi)	13
3	N2.HIF-1(RNAi)	13
4	N2.HIF-1(RNAi)	13
5	N2.HIF-1(RNAi)	15
6	N2.HIF-1(RNAi)	15
7	N2.HIF-1(RNAi)	15
8	N2.HIF-1(RNAi)	15
9	N2.HIF-1(RNAi)	15
10	N2.HIF-1(RNAi)	15
11	N2.HIF-1(RNAi)	17
12	N2.HIF-1(RNAi)	17
13	N2.HIF-1(RNAi)	17
14	N2.HIF-1(RNAi)	17
15	N2.HIF-1(RNAi)	17
16	N2.HIF-1(RNAi)	17
17	N2.HIF-1(RNAi)	17
18	N2.HIF-1(RNAi)	17
19	N2.HIF-1(RNAi)	20
20	N2.HIF-1(RNAi)	20
21	N2.HIF-1(RNAi)	20
22	N2.HIF-1(RNAi)	20
23	N2.HIF-1(RNAi)	20
24	N2.HIF-1(RNAi)	20
25	N2.HIF-1(RNAi)	20
26	N2.HIF-1(RNAi)	20
27	N2.HIF-1(RNAi)	20
28	N2.HIF-1(RNAi)	20
29	N2.HIF-1(RNAi)	22
30	N2.HIF-1(RNAi)	22
31	N2.HIF-1(RNAi)	22
32	N2.HIF-1(RNAi)	22
33	N2.HIF-1(RNAi)	24
34	N2.HIF-1(RNAi)	24
35	N2.HIF-1(RNAi)	24
36	N2.HIF-1(RNAi)	27
37	N2.HIF-1(RNAi)	13
38	N2.HIF-1(RNAi)	13
39	N2.HIF-1(RNAi)	13
40	N2.HIF-1(RNAi)	13
41	N2.HIF-1(RNAi)	15
42	N2.HIF-1(RNAi)	13
43	N2.HIF-1(RNAi)	13
44	N2.HIF-1(RNAi)	15
45	N2.HIF-1(RNAi)	15
46	N2.HIF-1(RNAi)	15
47	N2.HIF-1(RNAi)	17
48	N2.HIF-1(RNAi)	17
49	N2.HIF-1(RNAi)	17
50	N2.HIF-1(RNAi)	17
51	N2.HIF-1(RNAi)	17
52	N2.HIF-1(RNAi)	17
53	N2.HIF-1(RNAi)	17
54	N2.HIF-1(RNAi)	20
55	N2.HIF-1(RNAi)	22
56	N2.HIF-1(RNAi)	22
57	N2.HIF-1(RNAi)	22
58	N2.HIF-1(RNAi)	24
59	N2.HIF-1(RNAi)	24
60	N2.HIF-1(RNAi)	24
61	N2.HIF-1(RNAi)	29
62	N2.HIF-1(RNAi)	13
63	N2.HIF-1(RNAi)	13
64	N2.HIF-1(RNAi)	17
65	N2.HIF-1(RNAi)	17
66	N2.HIF-1(RNAi)	13
67	N2.HIF-1(RNAi)	15
68	N2.HIF-1(RNAi)	15
69	N2.HIF-1(RNAi)	15
70	N2.HIF-1(RNAi)	15
71	N2.HIF-1(RNAi)	17
72	N2.HIF-1(RNAi)	17
73	N2.HIF-1(RNAi)	17
74	N2.HIF-1(RNAi)	17
75	N2.HIF-1(RNAi)	17
76	N2.HIF-1(RNAi)	20
77	N2.HIF-1(RNAi)	20
78	N2.HIF-1(RNAi)	20
79	N2.HIF-1(RNAi)	20
80	N2.HIF-1(RNAi)	20
81	N2.HIF-1(RNAi)	20
82	N2.HIF-1(RNAi)	20
83	N2.HIF-1(RNAi)	22
84	N2.HIF-1(RNAi)	22
85	N2.HIF-1(RNAi)	22
86	N2.HIF-1(RNAi)	24
87	N2.HIF-1(RNAi)	24
88	N2.HIF-1(RNAi)	27
89	N2.HIF-1(RNAi)	13
90	N2.HIF-1(RNAi)	13
