1	SKN-1(OE)	21
2	SKN-1(OE)	25
3	SKN-1(OE)	29
4	SKN-1(OE)	29
5	SKN-1(OE)	29
6	SKN-1(OE)	32
7	SKN-1(OE)	32
8	SKN-1(OE)	32
9	SKN-1(OE)	32
10	SKN-1(OE)	32
11	SKN-1(OE)	32
12	SKN-1(OE)	32
13	SKN-1(OE)	32
14	SKN-1(OE)	32
15	SKN-1(OE)	32
16	SKN-1(OE)	32
17	SKN-1(OE)	32
18	SKN-1(OE)	34
19	SKN-1(OE)	34
20	SKN-1(OE)	34
21	SKN-1(OE)	34
22	SKN-1(OE)	34
23	SKN-1(OE)	34
24	SKN-1(OE)	36
25	SKN-1(OE)	36
26	SKN-1(OE)	36
27	SKN-1(OE)	39
28	SKN-1(OE)	39
29	SKN-1(OE)	39
30	SKN-1(OE)	39
31	SKN-1(OE)	39
32	SKN-1(OE)	39
33	SKN-1(OE)	39
34	SKN-1(OE)	39
35	SKN-1(OE)	39
36	SKN-1(OE)	39
37	SKN-1(OE)	39
38	SKN-1(OE)	39
39	SKN-1(OE)	39
40	SKN-1(OE)	39
41	SKN-1(OE)	39
42	SKN-1(OE)	39
43	SKN-1(OE)	39
44	SKN-1(OE)	39
45	SKN-1(OE)	39
46	SKN-1(OE)	39
47	SKN-1(OE)	39
48	SKN-1(OE)	39
49	SKN-1(OE)	39
50	SKN-1(OE)	41
51	SKN-1(OE)	41
52	SKN-1(OE)	41
53	SKN-1(OE)	41
54	SKN-1(OE)	41
55	SKN-1(OE)	41
56	SKN-1(OE)	41
57	SKN-1(OE)	41
58	SKN-1(OE)	41
59	SKN-1(OE)	41
60	SKN-1(OE)	43
61	SKN-1(OE)	43
62	SKN-1(OE)	43
63	SKN-1(OE)	43
64	SKN-1(OE)	43
65	SKN-1(OE)	43
66	SKN-1(OE)	43
67	SKN-1(OE)	43
68	SKN-1(OE)	43
69	SKN-1(OE)	43
70	SKN-1(OE)	43
71	SKN-1(OE)	46
72	SKN-1(OE)	46
73	SKN-1(OE)	46
74	SKN-1(OE)	46
75	SKN-1(OE)	46
76	SKN-1(OE)	46
77	SKN-1(OE)	46
78	SKN-1(OE)	46
79	SKN-1(OE)	46
80	SKN-1(OE)	46
81	SKN-1(OE)	46
82	SKN-1(OE)	46
83	SKN-1(OE)	48
84	SKN-1(OE)	48
85	SKN-1(OE)	48
86	SKN-1(OE)	48
87	SKN-1(OE)	48
88	SKN-1(OE)	48
89	SKN-1(OE)	48
90	SKN-1(OE)	48
91	SKN-1(OE)	48
92	SKN-1(OE)	48
93	SKN-1(OE)	48
94	SKN-1(OE)	50
95	SKN-1(OE)	50
96	SKN-1(OE)	50
97	SKN-1(OE)	50
98	SKN-1(OE)	50
99	SKN-1(OE)	50
100	SKN-1(OE)	50
101	SKN-1(OE)	50
102	SKN-1(OE)	50
103	SKN-1(OE)	53
104	SKN-1(OE)	53
105	SKN-1(OE)	53
106	SKN-1(OE)	53
107	SKN-1(OE)	53
108	SKN-1(OE)	55
109	SKN-1(OE)	55
110	SKN-1(OE)	55
111	SKN-1(OE)	55
112	SKN-1(OE)	60
113	SKN-1(OE)	27
114	SKN-1(OE)	29
115	SKN-1(OE)	32
116	SKN-1(OE)	34
117	SKN-1(OE)	36
118	SKN-1(OE)	36
119	SKN-1(OE)	36
120	SKN-1(OE)	36
121	SKN-1(OE)	39
122	SKN-1(OE)	39
123	SKN-1(OE)	39
124	SKN-1(OE)	39
125	SKN-1(OE)	39
126	SKN-1(OE)	41
127	SKN-1(OE)	43
128	SKN-1(OE)	46
129	SKN-1(OE)	46
