1	WT.daf-2(RNAi)	10
2	WT.daf-2(RNAi)	16
3	WT.daf-2(RNAi)	16
4	WT.daf-2(RNAi)	18
5	WT.daf-2(RNAi)	21
6	WT.daf-2(RNAi)	21
7	WT.daf-2(RNAi)	24
8	WT.daf-2(RNAi)	24
9	WT.daf-2(RNAi)	26
10	WT.daf-2(RNAi)	29
11	WT.daf-2(RNAi)	29
12	WT.daf-2(RNAi)	29
13	WT.daf-2(RNAi)	29
14	WT.daf-2(RNAi)	29
15	WT.daf-2(RNAi)	29
16	WT.daf-2(RNAi)	29
17	WT.daf-2(RNAi)	31
18	WT.daf-2(RNAi)	31
19	WT.daf-2(RNAi)	31
20	WT.daf-2(RNAi)	31
21	WT.daf-2(RNAi)	31
22	WT.daf-2(RNAi)	33
23	WT.daf-2(RNAi)	33
24	WT.daf-2(RNAi)	33
25	WT.daf-2(RNAi)	33
26	WT.daf-2(RNAi)	33
27	WT.daf-2(RNAi)	33
28	WT.daf-2(RNAi)	36
29	WT.daf-2(RNAi)	36
30	WT.daf-2(RNAi)	36
31	WT.daf-2(RNAi)	38
32	WT.daf-2(RNAi)	38
33	WT.daf-2(RNAi)	38
34	WT.daf-2(RNAi)	40
35	WT.daf-2(RNAi)	40
36	WT.daf-2(RNAi)	40
37	WT.daf-2(RNAi)	40
38	WT.daf-2(RNAi)	40
39	WT.daf-2(RNAi)	40
40	WT.daf-2(RNAi)	44
41	WT.daf-2(RNAi)	44
42	WT.daf-2(RNAi)	44
43	WT.daf-2(RNAi)	44
44	WT.daf-2(RNAi)	44
45	WT.daf-2(RNAi)	44
46	WT.daf-2(RNAi)	44
47	WT.daf-2(RNAi)	44
48	WT.daf-2(RNAi)	44
49	WT.daf-2(RNAi)	44
50	WT.daf-2(RNAi)	44
51	WT.daf-2(RNAi)	46
52	WT.daf-2(RNAi)	46
53	WT.daf-2(RNAi)	46
54	WT.daf-2(RNAi)	46
55	WT.daf-2(RNAi)	46
56	WT.daf-2(RNAi)	48
57	WT.daf-2(RNAi)	48
58	WT.daf-2(RNAi)	48
59	WT.daf-2(RNAi)	48
60	WT.daf-2(RNAi)	51
61	WT.daf-2(RNAi)	51
62	WT.daf-2(RNAi)	55
63	WT.daf-2(RNAi)	55
64	WT.daf-2(RNAi)	60
