1	hif-1	14
2	hif-1	14
3	hif-1	14
4	hif-1	16
5	hif-1	16
6	hif-1	16
7	hif-1	16
8	hif-1	16
9	hif-1	16
10	hif-1	16
11	hif-1	16
12	hif-1	18
13	hif-1	18
14	hif-1	18
15	hif-1	18
16	hif-1	18
17	hif-1	18
18	hif-1	18
19	hif-1	21
20	hif-1	21
21	hif-1	21
22	hif-1	21
23	hif-1	21
24	hif-1	21
25	hif-1	21
26	hif-1	21
27	hif-1	21
28	hif-1	23
29	hif-1	14
30	hif-1	14
31	hif-1	16
32	hif-1	16
33	hif-1	18
34	hif-1	18
35	hif-1	18
36	hif-1	18
37	hif-1	18
38	hif-1	18
39	hif-1	18
40	hif-1	21
41	hif-1	21
42	hif-1	21
43	hif-1	21
44	hif-1	21
45	hif-1	21
46	hif-1	21
47	hif-1	21
48	hif-1	21
49	hif-1	23
50	hif-1	23
51	hif-1	23
52	hif-1	23
