1	trpa-1	21
2	trpa-1	23
3	trpa-1	23
4	trpa-1	23
5	trpa-1	23
6	trpa-1	26
7	trpa-1	26
8	trpa-1	26
9	trpa-1	26
10	trpa-1	28
11	trpa-1	28
12	trpa-1	28
13	trpa-1	28
14	trpa-1	30
15	trpa-1	30
16	trpa-1	30
17	trpa-1	30
18	trpa-1	30
19	trpa-1	30
20	trpa-1	30
21	trpa-1	30
22	trpa-1	33
23	trpa-1	33
24	trpa-1	33
25	trpa-1	33
26	trpa-1	33
27	trpa-1	33
28	trpa-1	33
29	trpa-1	33
30	trpa-1	33
31	trpa-1	33
32	trpa-1	35
33	trpa-1	35
34	trpa-1	35
35	trpa-1	35
36	trpa-1	35
37	trpa-1	35
38	trpa-1	37
39	trpa-1	37
40	trpa-1	37
41	trpa-1	16
42	trpa-1	19
43	trpa-1	19
44	trpa-1	19
45	trpa-1	19
46	trpa-1	19
47	trpa-1	21
48	trpa-1	23
49	trpa-1	23
50	trpa-1	26
51	trpa-1	26
52	trpa-1	26
53	trpa-1	26
54	trpa-1	26
55	trpa-1	26
56	trpa-1	26
57	trpa-1	26
58	trpa-1	26
59	trpa-1	28
60	trpa-1	28
61	trpa-1	28
62	trpa-1	28
63	trpa-1	28
64	trpa-1	28
65	trpa-1	28
66	trpa-1	28
67	trpa-1	30
68	trpa-1	30
69	trpa-1	30
70	trpa-1	33
71	trpa-1	13
72	trpa-1	16
73	trpa-1	23
74	trpa-1	13
75	trpa-1	19
76	trpa-1	19
77	trpa-1	21
78	trpa-1	21
79	trpa-1	21
80	trpa-1	23
81	trpa-1	23
82	trpa-1	23
83	trpa-1	23
84	trpa-1	26
85	trpa-1	26
86	trpa-1	26
87	trpa-1	26
88	trpa-1	26
89	trpa-1	26
90	trpa-1	28
91	trpa-1	28
92	trpa-1	28
93	trpa-1	28
94	trpa-1	28
95	trpa-1	28
96	trpa-1	28
97	trpa-1	28
98	trpa-1	30
99	trpa-1	30
100	trpa-1	30
101	trpa-1	30
102	trpa-1	30
103	trpa-1	30
104	trpa-1	30
105	trpa-1	30
106	trpa-1	33
107	trpa-1	33
108	trpa-1	33
109	trpa-1	33
110	trpa-1	35
111	trpa-1	35
112	trpa-1	35
113	trpa-1	35
114	trpa-1	35
115	trpa-1	35
116	trpa-1	35
117	trpa-1	35
118	trpa-1	37
119	trpa-1	37
120	trpa-1	37
121	trpa-1	40
122	trpa-1	40
123	trpa-1	16
124	trpa-1	19
125	trpa-1	19
126	trpa-1	19
127	trpa-1	19
128	trpa-1	19
129	trpa-1	19
130	trpa-1	19
131	trpa-1	19
132	trpa-1	19
133	trpa-1	19
134	trpa-1	21
135	trpa-1	21
136	trpa-1	21
137	trpa-1	21
138	trpa-1	23
139	trpa-1	28
140	trpa-1	13
141	trpa-1	16
142	trpa-1	16
143	trpa-1	16
