1	rol-6	11
2	rol-6	11
3	rol-6	11
4	rol-6	13
5	rol-6	11
6	rol-6	7
7	rol-6	9
8	rol-6	11
9	rol-6	11
10	rol-6	11
11	rol-6	11
12	rol-6	11
13	rol-6	13
14	rol-6	13
15	rol-6	13
16	rol-6	13
17	rol-6	13
18	rol-6	13
19	rol-6	13
20	rol-6	13
21	rol-6	13
22	rol-6	13
23	rol-6	13
24	rol-6	13
25	rol-6	13
26	rol-6	13
27	rol-6	13
28	rol-6	13
29	rol-6	14
30	rol-6	14
31	rol-6	14
32	rol-6	14
33	rol-6	14
34	rol-6	14
35	rol-6	14
36	rol-6	14
37	rol-6	14
38	rol-6	14
39	rol-6	14
40	rol-6	14
41	rol-6	14
42	rol-6	14
43	rol-6	14
44	rol-6	14
45	rol-6	14
46	rol-6	14
47	rol-6	14
48	rol-6	14
49	rol-6	14
50	rol-6	14
51	rol-6	14
52	rol-6	15
53	rol-6	15
54	rol-6	15
55	rol-6	15
56	rol-6	15
57	rol-6	15
58	rol-6	15
59	rol-6	15
60	rol-6	15
61	rol-6	15
62	rol-6	15
63	rol-6	15
64	rol-6	15
65	rol-6	15
66	rol-6	15
67	rol-6	16
68	rol-6	16
69	rol-6	16
70	rol-6	16
71	rol-6	16
72	rol-6	16
73	rol-6	16
74	rol-6	16
75	rol-6	16
76	rol-6	16
77	rol-6	16
78	rol-6	17
79	rol-6	19
80	rol-6	19
