1	cep-1	10
2	cep-1	17
3	cep-1	17
4	cep-1	21
5	cep-1	21
6	cep-1	23
7	cep-1	23
8	cep-1	25
9	cep-1	25
10	cep-1	25
11	cep-1	25
12	cep-1	25
13	cep-1	25
14	cep-1	25
15	cep-1	25
16	cep-1	25
17	cep-1	28
18	cep-1	28
19	cep-1	28
20	cep-1	28
21	cep-1	28
22	cep-1	28
23	cep-1	28
24	cep-1	28
25	cep-1	28
26	cep-1	28
27	cep-1	28
28	cep-1	28
29	cep-1	28
30	cep-1	28
31	cep-1	28
32	cep-1	28
33	cep-1	28
34	cep-1	28
35	cep-1	28
36	cep-1	28
37	cep-1	28
38	cep-1	28
39	cep-1	28
40	cep-1	28
41	cep-1	28
42	cep-1	28
43	cep-1	28
44	cep-1	28
45	cep-1	30
46	cep-1	30
47	cep-1	30
48	cep-1	30
49	cep-1	30
50	cep-1	30
51	cep-1	30
52	cep-1	30
53	cep-1	30
54	cep-1	30
55	cep-1	30
56	cep-1	30
57	cep-1	30
58	cep-1	30
59	cep-1	30
60	cep-1	30
61	cep-1	30
62	cep-1	30
63	cep-1	30
64	cep-1	30
65	cep-1	30
66	cep-1	32
67	cep-1	32
68	cep-1	32
69	cep-1	32
70	cep-1	32
71	cep-1	32
72	cep-1	32
73	cep-1	32
74	cep-1	32
75	cep-1	32
76	cep-1	32
77	cep-1	32
78	cep-1	32
79	cep-1	32
80	cep-1	32
81	cep-1	32
82	cep-1	35
83	cep-1	35
84	cep-1	35
85	cep-1	35
86	cep-1	35
87	cep-1	35
88	cep-1	35
89	cep-1	35
90	cep-1	35
91	cep-1	35
92	cep-1	35
93	cep-1	35
94	cep-1	35
95	cep-1	35
96	cep-1	35
97	cep-1	35
98	cep-1	35
99	cep-1	35
100	cep-1	35
101	cep-1	35
102	cep-1	35
103	cep-1	35
104	cep-1	35
105	cep-1	35
106	cep-1	37
107	cep-1	37
108	cep-1	37
109	cep-1	37
110	cep-1	37
111	cep-1	37
112	cep-1	39
113	cep-1	39
114	cep-1	21
115	cep-1	21
116	cep-1	23
117	cep-1	23
118	cep-1	25
119	cep-1	25
120	cep-1	25
121	cep-1	25
122	cep-1	25
123	cep-1	25
124	cep-1	25
125	cep-1	25
126	cep-1	25
127	cep-1	14
128	cep-1	17
129	cep-1	17
130	cep-1	19
131	cep-1	19
132	cep-1	23
133	cep-1	23
134	cep-1	23
135	cep-1	10
136	cep-1	14
137	cep-1	21
138	cep-1	25
139	cep-1	25
140	cep-1	25
141	cep-1	17
142	cep-1	17
143	cep-1	19
144	cep-1	19
145	cep-1	21
146	cep-1	21
147	cep-1	25
148	cep-1	25
149	cep-1	25
150	cep-1	25
151	cep-1	25
152	cep-1	28
153	cep-1	28
154	cep-1	28
155	cep-1	28
156	cep-1	28
157	cep-1	28
158	cep-1	28
159	cep-1	28
160	cep-1	28
161	cep-1	28
162	cep-1	28
163	cep-1	28
164	cep-1	28
165	cep-1	28
166	cep-1	28
167	cep-1	30
168	cep-1	30
169	cep-1	30
170	cep-1	30
171	cep-1	30
172	cep-1	30
173	cep-1	30
174	cep-1	30
175	cep-1	30
176	cep-1	30
177	cep-1	30
178	cep-1	30
179	cep-1	30
180	cep-1	32
181	cep-1	32
182	cep-1	32
183	cep-1	32
184	cep-1	32
185	cep-1	32
186	cep-1	32
187	cep-1	32
188	cep-1	32
189	cep-1	32
190	cep-1	32
191	cep-1	32
192	cep-1	35
193	cep-1	35
194	cep-1	35
195	cep-1	35
196	cep-1	35
197	cep-1	35
198	cep-1	35
199	cep-1	35
200	cep-1	35
201	cep-1	35
202	cep-1	35
203	cep-1	37
204	cep-1	37
205	cep-1	37
206	cep-1	14
