1	N2.FMO-2(RNAi)	10
2	N2.FMO-2(RNAi)	12
3	N2.FMO-2(RNAi)	15
4	N2.FMO-2(RNAi)	15
5	N2.FMO-2(RNAi)	15
6	N2.FMO-2(RNAi)	15
7	N2.FMO-2(RNAi)	15
8	N2.FMO-2(RNAi)	17
9	N2.FMO-2(RNAi)	17
10	N2.FMO-2(RNAi)	17
11	N2.FMO-2(RNAi)	17
12	N2.FMO-2(RNAi)	17
13	N2.FMO-2(RNAi)	17
14	N2.FMO-2(RNAi)	17
15	N2.FMO-2(RNAi)	17
16	N2.FMO-2(RNAi)	17
17	N2.FMO-2(RNAi)	17
18	N2.FMO-2(RNAi)	17
19	N2.FMO-2(RNAi)	17
20	N2.FMO-2(RNAi)	17
21	N2.FMO-2(RNAi)	17
22	N2.FMO-2(RNAi)	17
23	N2.FMO-2(RNAi)	17
24	N2.FMO-2(RNAi)	17
25	N2.FMO-2(RNAi)	17
26	N2.FMO-2(RNAi)	22
27	N2.FMO-2(RNAi)	22
28	N2.FMO-2(RNAi)	22
29	N2.FMO-2(RNAi)	22
30	N2.FMO-2(RNAi)	22
31	N2.FMO-2(RNAi)	22
32	N2.FMO-2(RNAi)	22
33	N2.FMO-2(RNAi)	22
34	N2.FMO-2(RNAi)	22
35	N2.FMO-2(RNAi)	22
36	N2.FMO-2(RNAi)	22
37	N2.FMO-2(RNAi)	22
38	N2.FMO-2(RNAi)	22
39	N2.FMO-2(RNAi)	22
40	N2.FMO-2(RNAi)	22
41	N2.FMO-2(RNAi)	22
42	N2.FMO-2(RNAi)	22
43	N2.FMO-2(RNAi)	22
44	N2.FMO-2(RNAi)	22
45	N2.FMO-2(RNAi)	22
46	N2.FMO-2(RNAi)	22
47	N2.FMO-2(RNAi)	22
48	N2.FMO-2(RNAi)	24
49	N2.FMO-2(RNAi)	24
50	N2.FMO-2(RNAi)	24
51	N2.FMO-2(RNAi)	24
52	N2.FMO-2(RNAi)	24
53	N2.FMO-2(RNAi)	24
54	N2.FMO-2(RNAi)	24
55	N2.FMO-2(RNAi)	24
56	N2.FMO-2(RNAi)	24
57	N2.FMO-2(RNAi)	24
58	N2.FMO-2(RNAi)	24
59	N2.FMO-2(RNAi)	24
60	N2.FMO-2(RNAi)	24
61	N2.FMO-2(RNAi)	24
62	N2.FMO-2(RNAi)	24
63	N2.FMO-2(RNAi)	24
64	N2.FMO-2(RNAi)	24
65	N2.FMO-2(RNAi)	24
66	N2.FMO-2(RNAi)	24
67	N2.FMO-2(RNAi)	24
68	N2.FMO-2(RNAi)	24
69	N2.FMO-2(RNAi)	24
70	N2.FMO-2(RNAi)	24
71	N2.FMO-2(RNAi)	24
72	N2.FMO-2(RNAi)	24
73	N2.FMO-2(RNAi)	24
74	N2.FMO-2(RNAi)	24
75	N2.FMO-2(RNAi)	24
76	N2.FMO-2(RNAi)	24
77	N2.FMO-2(RNAi)	24
78	N2.FMO-2(RNAi)	24
79	N2.FMO-2(RNAi)	26
80	N2.FMO-2(RNAi)	26
81	N2.FMO-2(RNAi)	26
82	N2.FMO-2(RNAi)	26
83	N2.FMO-2(RNAi)	26
84	N2.FMO-2(RNAi)	26
85	N2.FMO-2(RNAi)	26
86	N2.FMO-2(RNAi)	26
87	N2.FMO-2(RNAi)	26
88	N2.FMO-2(RNAi)	26
89	N2.FMO-2(RNAi)	26
90	N2.FMO-2(RNAi)	26
91	N2.FMO-2(RNAi)	26
92	N2.FMO-2(RNAi)	26
93	N2.FMO-2(RNAi)	26
94	N2.FMO-2(RNAi)	26
95	N2.FMO-2(RNAi)	26
96	N2.FMO-2(RNAi)	26
97	N2.FMO-2(RNAi)	26
98	N2.FMO-2(RNAi)	26
99	N2.FMO-2(RNAi)	29
100	N2.FMO-2(RNAi)	29
101	N2.FMO-2(RNAi)	29
102	N2.FMO-2(RNAi)	29
103	N2.FMO-2(RNAi)	29
104	N2.FMO-2(RNAi)	29
105	N2.FMO-2(RNAi)	29
106	N2.FMO-2(RNAi)	29
107	N2.FMO-2(RNAi)	29
108	N2.FMO-2(RNAi)	29
109	N2.FMO-2(RNAi)	15
110	N2.FMO-2(RNAi)	17
111	N2.FMO-2(RNAi)	17
112	N2.FMO-2(RNAi)	15
113	N2.FMO-2(RNAi)	15
114	N2.FMO-2(RNAi)	15
115	N2.FMO-2(RNAi)	10
116	N2.FMO-2(RNAi)	12
117	N2.FMO-2(RNAi)	17
118	N2.FMO-2(RNAi)	17
119	N2.FMO-2(RNAi)	17
120	N2.FMO-2(RNAi)	17
121	N2.FMO-2(RNAi)	17
122	N2.FMO-2(RNAi)	17
123	N2.FMO-2(RNAi)	17
124	N2.FMO-2(RNAi)	17
125	N2.FMO-2(RNAi)	22
126	N2.FMO-2(RNAi)	22
127	N2.FMO-2(RNAi)	22
128	N2.FMO-2(RNAi)	22
129	N2.FMO-2(RNAi)	22
130	N2.FMO-2(RNAi)	22
131	N2.FMO-2(RNAi)	22
132	N2.FMO-2(RNAi)	22
133	N2.FMO-2(RNAi)	22
134	N2.FMO-2(RNAi)	22
135	N2.FMO-2(RNAi)	22
136	N2.FMO-2(RNAi)	22
137	N2.FMO-2(RNAi)	22
138	N2.FMO-2(RNAi)	22
139	N2.FMO-2(RNAi)	22
140	N2.FMO-2(RNAi)	22
141	N2.FMO-2(RNAi)	22
142	N2.FMO-2(RNAi)	22
143	N2.FMO-2(RNAi)	22
144	N2.FMO-2(RNAi)	24
145	N2.FMO-2(RNAi)	24
146	N2.FMO-2(RNAi)	24
147	N2.FMO-2(RNAi)	24
148	N2.FMO-2(RNAi)	24
149	N2.FMO-2(RNAi)	24
150	N2.FMO-2(RNAi)	24
151	N2.FMO-2(RNAi)	24
152	N2.FMO-2(RNAi)	24
153	N2.FMO-2(RNAi)	24
154	N2.FMO-2(RNAi)	24
155	N2.FMO-2(RNAi)	24
156	N2.FMO-2(RNAi)	24
157	N2.FMO-2(RNAi)	24
158	N2.FMO-2(RNAi)	24
159	N2.FMO-2(RNAi)	24
160	N2.FMO-2(RNAi)	24
161	N2.FMO-2(RNAi)	24
162	N2.FMO-2(RNAi)	24
163	N2.FMO-2(RNAi)	24
164	N2.FMO-2(RNAi)	24
165	N2.FMO-2(RNAi)	26
166	N2.FMO-2(RNAi)	26
167	N2.FMO-2(RNAi)	26
168	N2.FMO-2(RNAi)	26
169	N2.FMO-2(RNAi)	26
170	N2.FMO-2(RNAi)	26
171	N2.FMO-2(RNAi)	26
172	N2.FMO-2(RNAi)	26
173	N2.FMO-2(RNAi)	26
174	N2.FMO-2(RNAi)	26
175	N2.FMO-2(RNAi)	26
176	N2.FMO-2(RNAi)	26
177	N2.FMO-2(RNAi)	26
178	N2.FMO-2(RNAi)	26
179	N2.FMO-2(RNAi)	26
180	N2.FMO-2(RNAi)	29
181	N2.FMO-2(RNAi)	15
182	N2.FMO-2(RNAi)	15
183	N2.FMO-2(RNAi)	15
