strain	replicate	age.at.death	rupture	
1	N2.EV	2	10	0
2	N2.EV	2	10	0
3	N2.EV	2	10	0
4	N2.EV	2	14	0
5	N2.EV	2	17	0
6	N2.EV	2	17	0
7	N2.EV	2	17	0
8	N2.EV	2	23	0
9	N2.EV	2	27	0
10	N2.EV	2	17	1
11	N2.EV	2	20	1
12	N2.EV	2	23	1
13	N2.EV	2	27	1
14	N2.EV	2	27	1
15	N2.EV	2	17	2
16	N2.EV	2	20	2
17	N2.EV	2	20	2
18	N2.EV	2	20	2
19	N2.EV	2	20	2
20	N2.EV	2	20	2
21	N2.EV	2	20	2
22	N2.EV	2	20	2
23	N2.EV	2	20	2
24	N2.EV	2	23	2
25	N2.EV	2	23	2
26	N2.EV	2	23	2
27	N2.EV	2	23	2
28	N2.EV	2	23	2
29	N2.EV	2	23	2
30	N2.EV	2	23	2
31	N2.EV	2	23	2
32	N2.EV	2	23	2
33	N2.EV	2	27	2
34	N2.EV	2	27	2
35	N2.EV	2	27	2
36	N2.EV	2	27	2
37	N2.EV	2	27	2
38	N2.EV	2	27	2
39	N2.EV	2	27	2
40	N2.EV	2	27	2
41	N2.EV	2	27	2
42	N2.EV	2	27	2
43	N2.EV	3	14	0
44	N2.EV	3	14	0
45	N2.EV	3	17	0
46	N2.EV	3	20	0
47	N2.EV	3	20	0
48	N2.EV	3	20	0
49	N2.EV	3	27	0
50	N2.EV	3	27	0
51	N2.EV	3	27	0
52	N2.EV	3	27	0
53	N2.EV	3	29	0
54	N2.EV	3	29	0
55	N2.EV	3	29	0
56	N2.EV	3	14	1
57	N2.EV	3	14	1
58	N2.EV	3	17	1
59	N2.EV	3	23	1
60	N2.EV	3	23	1
61	N2.EV	3	27	1
62	N2.EV	3	27	1
63	N2.EV	3	27	1
64	N2.EV	3	27	1
65	N2.EV	3	14	2
66	N2.EV	3	14	2
67	N2.EV	3	17	2
68	N2.EV	3	17	2
69	N2.EV	3	17	2
70	N2.EV	3	20	2
71	N2.EV	3	20	2
72	N2.EV	3	20	2
73	N2.EV	3	20	2
74	N2.EV	3	20	2
75	N2.EV	3	20	2
76	N2.EV	3	20	2
77	N2.EV	3	20	2
78	N2.EV	3	20	2
79	N2.EV	3	20	2
80	N2.EV	3	20	2
81	N2.EV	3	23	2
82	N2.EV	3	23	2
83	N2.EV	3	23	2
84	N2.EV	3	23	2
85	N2.EV	3	23	2
86	N2.EV	3	23	2
87	N2.EV	3	23	2
88	N2.EV	3	23	2
89	N2.EV	3	23	2
90	N2.EV	3	23	2
91	N2.EV	3	23	2
92	N2.EV	3	23	2
93	N2.EV	3	27	2
94	N2.EV	3	27	2
95	N2.EV	3	27	2
96	N2.EV	3	27	2
97	N2.EV	3	27	2
98	N2.EV	3	27	2
99	N2.EV	3	27	2
100	N2.EV	3	27	2
101	N2.EV	3	27	2
102	N2.EV	3	27	2
103	N2.EV	3	29	2
104	N2.EV	3	29	2
105	N2.HIF-1.RNAi	1	10	0
106	N2.HIF-1.RNAi	1	10	0
107	N2.HIF-1.RNAi	1	14	0
108	N2.HIF-1.RNAi	1	17	0
109	N2.HIF-1.RNAi	1	17	0
110	N2.HIF-1.RNAi	1	20	0
111	N2.HIF-1.RNAi	1	20	0
112	N2.HIF-1.RNAi	1	23	0
113	N2.HIF-1.RNAi	1	23	0
114	N2.HIF-1.RNAi	1	27	0
115	N2.HIF-1.RNAi	1	10	1
116	N2.HIF-1.RNAi	1	14	1
117	N2.HIF-1.RNAi	1	20	1
118	N2.HIF-1.RNAi	1	20	1
119	N2.HIF-1.RNAi	1	23	1
120	N2.HIF-1.RNAi	1	23	1
121	N2.HIF-1.RNAi	1	27	1
122	N2.HIF-1.RNAi	1	14	2
123	N2.HIF-1.RNAi	1	14	2
124	N2.HIF-1.RNAi	1	17	2
125	N2.HIF-1.RNAi	1	17	2
126	N2.HIF-1.RNAi	1	20	2
127	N2.HIF-1.RNAi	1	20	2
128	N2.HIF-1.RNAi	1	20	2
129	N2.HIF-1.RNAi	1	20	2
130	N2.HIF-1.RNAi	1	20	2
131	N2.HIF-1.RNAi	1	20	2
132	N2.HIF-1.RNAi	1	20	2
133	N2.HIF-1.RNAi	1	20	2
134	N2.HIF-1.RNAi	1	20	2
135	N2.HIF-1.RNAi	1	20	2
136	N2.HIF-1.RNAi	1	20	2
137	N2.HIF-1.RNAi	1	20	2
138	N2.HIF-1.RNAi	1	20	2
139	N2.HIF-1.RNAi	1	23	2
140	N2.HIF-1.RNAi	1	23	2
141	N2.HIF-1.RNAi	1	23	2
142	N2.HIF-1.RNAi	1	23	2
143	N2.HIF-1.RNAi	1	23	2
144	N2.HIF-1.RNAi	1	23	2
145	N2.HIF-1.RNAi	1	23	2
146	N2.HIF-1.RNAi	1	23	2
147	N2.HIF-1.RNAi	1	23	2
148	N2.HIF-1.RNAi	1	23	2
149	N2.HIF-1.RNAi	1	27	2
150	N2.HIF-1.RNAi	1	27	2
151	N2.HIF-1.RNAi	1	27	2
152	N2.HIF-1.RNAi	1	27	2
153	N2.HIF-1.RNAi	1	27	2
154	N2.HIF-1.RNAi	1	27	2
155	N2.HIF-1.RNAi	1	27	2
156	N2.HIF-1.RNAi	1	27	2
157	N2.HIF-1.RNAi	2	10	0
158	N2.HIF-1.RNAi	2	14	0
159	N2.HIF-1.RNAi	2	14	0
160	N2.HIF-1.RNAi	2	17	0
161	N2.HIF-1.RNAi	2	17	0
162	N2.HIF-1.RNAi	2	17	0
163	N2.HIF-1.RNAi	2	27	0
164	N2.HIF-1.RNAi	2	10	1
165	N2.HIF-1.RNAi	2	10	1
166	N2.HIF-1.RNAi	2	14	1
167	N2.HIF-1.RNAi	2	17	1
168	N2.HIF-1.RNAi	2	17	1
169	N2.HIF-1.RNAi	2	20	1
170	N2.HIF-1.RNAi	2	27	1
171	N2.HIF-1.RNAi	2	10	2
172	N2.HIF-1.RNAi	2	14	2
173	N2.HIF-1.RNAi	2	17	2
174	N2.HIF-1.RNAi	2	20	2
175	N2.HIF-1.RNAi	2	20	2
176	N2.HIF-1.RNAi	2	20	2
177	N2.HIF-1.RNAi	2	20	2
178	N2.HIF-1.RNAi	2	20	2
179	N2.HIF-1.RNAi	2	20	2
180	N2.HIF-1.RNAi	2	20	2
181	N2.HIF-1.RNAi	2	20	2
182	N2.HIF-1.RNAi	2	23	2
183	N2.HIF-1.RNAi	2	23	2
184	N2.HIF-1.RNAi	2	23	2
185	N2.HIF-1.RNAi	2	23	2
186	N2.HIF-1.RNAi	2	23	2
187	N2.HIF-1.RNAi	2	27	2
188	N2.HIF-1.RNAi	2	27	2
189	N2.HIF-1.RNAi	3	10	0
190	N2.HIF-1.RNAi	3	10	0
191	N2.HIF-1.RNAi	3	14	0
192	N2.HIF-1.RNAi	3	14	0
193	N2.HIF-1.RNAi	3	17	0
194	N2.HIF-1.RNAi	3	17	0
195	N2.HIF-1.RNAi	3	20	0
196	N2.HIF-1.RNAi	3	20	0
197	N2.HIF-1.RNAi	3	23	0
198	N2.HIF-1.RNAi	3	23	0
199	N2.HIF-1.RNAi	3	23	0
200	N2.HIF-1.RNAi	3	23	0
201	N2.HIF-1.RNAi	3	27	0
202	N2.HIF-1.RNAi	3	14	1
203	N2.HIF-1.RNAi	3	14	1
204	N2.HIF-1.RNAi	3	17	1
205	N2.HIF-1.RNAi	3	17	1
206	N2.HIF-1.RNAi	3	20	1
207	N2.HIF-1.RNAi	3	20	1
208	N2.HIF-1.RNAi	3	27	1
209	N2.HIF-1.RNAi	3	27	1
210	N2.HIF-1.RNAi	3	27	1
211	N2.HIF-1.RNAi	3	14	2
212	N2.HIF-1.RNAi	3	17	2
213	N2.HIF-1.RNAi	3	20	2
214	N2.HIF-1.RNAi	3	20	2
215	N2.HIF-1.RNAi	3	20	2
216	N2.HIF-1.RNAi	3	20	2
217	N2.HIF-1.RNAi	3	20	2
218	N2.HIF-1.RNAi	3	20	2
219	N2.HIF-1.RNAi	3	20	2
220	N2.HIF-1.RNAi	3	23	2
221	N2.HIF-1.RNAi	3	23	2
222	N2.HIF-1.RNAi	3	23	2
223	N2.HIF-1.RNAi	3	23	2
224	N2.HIF-1.RNAi	3	23	2
225	N2.HIF-1.RNAi	3	23	2
226	N2.HIF-1.RNAi	3	23	2
227	N2.HIF-1.RNAi	3	23	2
228	N2.HIF-1.RNAi	3	23	2
229	N2.HIF-1.RNAi	3	23	2
230	N2.HIF-1.RNAi	3	23	2
231	N2.HIF-1.RNAi	3	23	2
232	N2.HIF-1.RNAi	3	27	2
233	N2.HIF-1.RNAi	3	27	2
234	N2.HIF-1.RNAi	3	27	2
235	N2.HIF-1.RNAi	3	27	2
236	N2.HIF-1.RNAi	3	27	2
237	N2.HIF-1.RNAi	3	27	2
238	N2.HIF-1.RNAi	3	27	2
239	N2.HIF-1.RNAi	3	27	2
240	N2.HIF-1.RNAi	3	27	2
241	N2.HIF-1.RNAi	3	27	2
242	N2.HIF-1.RNAi	3	27	2
243	N2.HIF-1.RNAi	3	27	2
244	N2.HIF-1.RNAi	3	27	2
245	N2.HIF-1.RNAi	3	27	2
246	N2.HIF-1.RNAi	3	27	2
247	N2.HIF-1.RNAi	3	27	2
248	N2.HIF-1.RNAi	3	27	2
249	N2.F-28.RNAi	1	10	0
250	N2.F-28.RNAi	1	14	0
251	N2.F-28.RNAi	1	23	0
252	N2.F-28.RNAi	1	14	1
253	N2.F-28.RNAi	1	20	1
254	N2.F-28.RNAi	1	20	1
255	N2.F-28.RNAi	1	20	1
256	N2.F-28.RNAi	1	23	1
257	N2.F-28.RNAi	1	23	1
258	N2.F-28.RNAi	1	27	1
259	N2.F-28.RNAi	1	27	1
260	N2.F-28.RNAi	1	27	1
261	N2.F-28.RNAi	1	17	2
262	N2.F-28.RNAi	1	20	2
263	N2.F-28.RNAi	1	20	2
264	N2.F-28.RNAi	1	20	2
265	N2.F-28.RNAi	1	20	2
266	N2.F-28.RNAi	1	23	2
267	N2.F-28.RNAi	1	23	2
268	N2.F-28.RNAi	1	23	2
269	N2.F-28.RNAi	1	23	2
270	N2.F-28.RNAi	1	23	2
271	N2.F-28.RNAi	1	23	2
272	N2.F-28.RNAi	1	23	2
273	N2.F-28.RNAi	1	23	2
274	N2.F-28.RNAi	1	23	2
275	N2.F-28.RNAi	1	27	2
276	N2.F-28.RNAi	1	27	2
277	N2.F-28.RNAi	1	27	2
278	N2.F-28.RNAi	1	27	2
279	N2.F-28.RNAi	1	27	2
280	N2.F-28.RNAi	1	27	2
281	N2.F-28.RNAi	1	27	2
282	N2.F-28.RNAi	1	27	2
283	N2.F-28.RNAi	1	27	2
284	N2.F-28.RNAi	1	27	2
285	N2.F-28.RNAi	1	27	2
286	N2.F-28.RNAi	1	27	2
287	N2.F-28.RNAi	1	27	2
288	N2.F-28.RNAi	1	29	2
289	N2.F-28.RNAi	1	31	2
290	N2.F-28.RNAi	2	10	0
291	N2.F-28.RNAi	2	14	0
292	N2.F-28.RNAi	2	14	0
293	N2.F-28.RNAi	2	17	0
294	N2.F-28.RNAi	2	17	0
295	N2.F-28.RNAi	2	17	0
296	N2.F-28.RNAi	2	17	0
297	N2.F-28.RNAi	2	27	0
298	N2.F-28.RNAi	2	27	0
299	N2.F-28.RNAi	2	14	1
300	N2.F-28.RNAi	2	20	1
301	N2.F-28.RNAi	2	23	1
302	N2.F-28.RNAi	2	23	1
303	N2.F-28.RNAi	2	23	1
304	N2.F-28.RNAi	2	27	1
305	N2.F-28.RNAi	2	14	2
306	N2.F-28.RNAi	2	14	2
307	N2.F-28.RNAi	2	14	2
308	N2.F-28.RNAi	2	20	2
309	N2.F-28.RNAi	2	20	2
310	N2.F-28.RNAi	2	20	2
311	N2.F-28.RNAi	2	20	2
312	N2.F-28.RNAi	2	20	2
313	N2.F-28.RNAi	2	23	2
314	N2.F-28.RNAi	2	23	2
315	N2.F-28.RNAi	2	23	2
316	N2.F-28.RNAi	2	23	2
317	N2.F-28.RNAi	2	23	2
318	N2.F-28.RNAi	2	23	2
319	N2.F-28.RNAi	2	27	2
320	N2.F-28.RNAi	2	27	2
321	N2.F-28.RNAi	2	27	2
322	N2.F-28.RNAi	2	27	2
323	N2.F-28.RNAi	2	27	2
324	N2.F-28.RNAi	2	27	2
325	N2.F-28.RNAi	2	27	2
326	N2.F-28.RNAi	2	27	2
327	N2.F-28.RNAi	2	27	2
328	N2.F-28.RNAi	3	14	0
329	N2.F-28.RNAi	3	17	0
330	N2.F-28.RNAi	3	20	0
331	N2.F-28.RNAi	3	23	0
332	N2.F-28.RNAi	3	23	0
333	N2.F-28.RNAi	3	23	0
334	N2.F-28.RNAi	3	27	0
335	N2.F-28.RNAi	3	27	0
336	N2.F-28.RNAi	3	27	0
337	N2.F-28.RNAi	3	27	0
338	N2.F-28.RNAi	3	29	0
339	N2.F-28.RNAi	3	14	1
340	N2.F-28.RNAi	3	14	1
341	N2.F-28.RNAi	3	23	1
342	N2.F-28.RNAi	3	27	1
343	N2.F-28.RNAi	3	27	1
344	N2.F-28.RNAi	3	27	1
345	N2.F-28.RNAi	3	14	2
346	N2.F-28.RNAi	3	14	2
347	N2.F-28.RNAi	3	14	2
348	N2.F-28.RNAi	3	20	2
349	N2.F-28.RNAi	3	20	2
350	N2.F-28.RNAi	3	20	2
351	N2.F-28.RNAi	3	23	2
352	N2.F-28.RNAi	3	23	2
353	N2.F-28.RNAi	3	23	2
354	N2.F-28.RNAi	3	23	2
355	N2.F-28.RNAi	3	23	2
356	N2.F-28.RNAi	3	23	2
357	N2.F-28.RNAi	3	27	2
358	N2.F-28.RNAi	3	27	2
359	N2.F-28.RNAi	3	27	2
360	N2.F-28.RNAi	3	27	2
361	N2.F-28.RNAi	3	27	2
362	N2.F-28.RNAi	3	27	2
363	N2.F-28.RNAi	3	27	2
364	N2.F-28.RNAi	3	27	2
365	N2.F-28.RNAi	3	29	2
366	N2.CAH-4.RNAi	1	14	0
367	N2.CAH-4.RNAi	1	14	0
368	N2.CAH-4.RNAi	1	14	0
369	N2.CAH-4.RNAi	1	14	0
370	N2.CAH-4.RNAi	1	23	0
371	N2.CAH-4.RNAi	1	23	0
372	N2.CAH-4.RNAi	1	27	0
373	N2.CAH-4.RNAi	1	27	0
374	N2.CAH-4.RNAi	1	27	0
375	N2.CAH-4.RNAi	1	27	0
376	N2.CAH-4.RNAi	1	29	0
377	N2.CAH-4.RNAi	1	29	0
378	N2.CAH-4.RNAi	1	14	1
379	N2.CAH-4.RNAi	1	27	1
380	N2.CAH-4.RNAi	1	27	1
381	N2.CAH-4.RNAi	1	20	2
382	N2.CAH-4.RNAi	1	20	2
383	N2.CAH-4.RNAi	1	20	2
384	N2.CAH-4.RNAi	1	20	2
385	N2.CAH-4.RNAi	1	20	2
386	N2.CAH-4.RNAi	1	20	2
387	N2.CAH-4.RNAi	1	23	2
388	N2.CAH-4.RNAi	1	23	2
389	N2.CAH-4.RNAi	1	23	2
390	N2.CAH-4.RNAi	1	23	2
391	N2.CAH-4.RNAi	1	23	2
392	N2.CAH-4.RNAi	1	23	2
393	N2.CAH-4.RNAi	1	23	2
394	N2.CAH-4.RNAi	1	23	2
395	N2.CAH-4.RNAi	1	23	2
396	N2.CAH-4.RNAi	1	23	2
397	N2.CAH-4.RNAi	1	23	2
398	N2.CAH-4.RNAi	1	27	2
399	N2.CAH-4.RNAi	1	27	2
400	N2.CAH-4.RNAi	1	27	2
401	N2.CAH-4.RNAi	1	27	2
402	N2.CAH-4.RNAi	1	27	2
403	N2.CAH-4.RNAi	1	27	2
404	N2.CAH-4.RNAi	1	27	2
405	N2.CAH-4.RNAi	1	27	2
406	N2.CAH-4.RNAi	1	27	2
407	N2.CAH-4.RNAi	2	10	0
408	N2.CAH-4.RNAi	2	14	0
409	N2.CAH-4.RNAi	2	14	0
410	N2.CAH-4.RNAi	2	17	0
411	N2.CAH-4.RNAi	2	20	0
412	N2.CAH-4.RNAi	2	27	0
413	N2.CAH-4.RNAi	2	27	0
414	N2.CAH-4.RNAi	2	14	1
415	N2.CAH-4.RNAi	2	14	1
416	N2.CAH-4.RNAi	2	14	1
417	N2.CAH-4.RNAi	2	17	1
418	N2.CAH-4.RNAi	2	20	1
419	N2.CAH-4.RNAi	2	23	1
420	N2.CAH-4.RNAi	2	14	2
421	N2.CAH-4.RNAi	2	14	2
422	N2.CAH-4.RNAi	2	17	2
423	N2.CAH-4.RNAi	2	20	2
424	N2.CAH-4.RNAi	2	20	2
425	N2.CAH-4.RNAi	2	20	2
426	N2.CAH-4.RNAi	2	20	2
427	N2.CAH-4.RNAi	2	23	2
428	N2.CAH-4.RNAi	2	23	2
429	N2.CAH-4.RNAi	2	23	2
430	N2.CAH-4.RNAi	2	23	2
431	N2.CAH-4.RNAi	2	23	2
432	N2.CAH-4.RNAi	2	23	2
433	N2.CAH-4.RNAi	2	23	2
434	N2.CAH-4.RNAi	2	27	2
435	N2.CAH-4.RNAi	2	27	2
436	N2.CAH-4.RNAi	2	27	2
437	N2.CAH-4.RNAi	2	27	2
438	N2.CAH-4.RNAi	2	27	2
439	N2.CAH-4.RNAi	2	27	2
440	N2.CAH-4.RNAi	2	27	2
441	N2.CAH-4.RNAi	2	27	2
442	N2.CAH-4.RNAi	2	27	2
443	N2.CAH-4.RNAi	2	27	2
444	N2.CAH-4.RNAi	2	27	2
445	N2.CAH-4.RNAi	2	27	2
446	N2.CAH-4.RNAi	2	27	2
447	N2.CAH-4.RNAi	2	27	2
448	N2.CAH-4.RNAi	3	10	0
449	N2.CAH-4.RNAi	3	10	0
450	N2.CAH-4.RNAi	3	20	0
451	N2.CAH-4.RNAi	3	23	0
452	N2.CAH-4.RNAi	3	27	0
453	N2.CAH-4.RNAi	3	27	0
454	N2.CAH-4.RNAi	3	14	1
455	N2.CAH-4.RNAi	3	14	1
456	N2.CAH-4.RNAi	3	23	1
457	N2.CAH-4.RNAi	3	27	1
458	N2.CAH-4.RNAi	3	27	1
459	N2.CAH-4.RNAi	3	20	2
460	N2.CAH-4.RNAi	3	20	2
461	N2.CAH-4.RNAi	3	20	2
462	N2.CAH-4.RNAi	3	20	2
463	N2.CAH-4.RNAi	3	20	2
464	N2.CAH-4.RNAi	3	20	2
465	N2.CAH-4.RNAi	3	20	2
466	N2.CAH-4.RNAi	3	20	2
467	N2.CAH-4.RNAi	3	20	2
468	N2.CAH-4.RNAi	3	20	2
469	N2.CAH-4.RNAi	3	20	2
470	N2.CAH-4.RNAi	3	20	2
471	N2.CAH-4.RNAi	3	23	2
472	N2.CAH-4.RNAi	3	23	2
473	N2.CAH-4.RNAi	3	23	2
474	N2.CAH-4.RNAi	3	23	2
475	N2.CAH-4.RNAi	3	23	2
476	N2.CAH-4.RNAi	3	23	2
477	N2.CAH-4.RNAi	3	23	2
478	N2.CAH-4.RNAi	3	23	2
479	N2.CAH-4.RNAi	3	23	2
480	N2.CAH-4.RNAi	3	27	2
481	N2.CAH-4.RNAi	3	27	2
482	N2.CAH-4.RNAi	3	27	2
483	N2.CAH-4.RNAi	3	27	2
484	N2.CAH-4.RNAi	3	27	2
485	N2.CAH-4.RNAi	3	27	2
486	N2.CAH-4.RNAi	3	27	2
487	N2.CAH-4.RNAi	3	27	2
488	N2.CAH-4.RNAi	3	27	2
489	N2.CAH-4.RNAi	3	27	2
490	N2.CAH-4.RNAi	3	27	2
491	N2.CAH-4.RNAi	3	27	2
492	N2.CAH-4.RNAi	3	27	2
493	N2.CAH-4.RNAi	3	27	2
494	N2.CAH-4.RNAi	3	27	2
495	N2.CAH-4.RNAi	3	27	2
496	N2.CAH-4.RNAi	3	27	2
