1	vhl-1	16
2	vhl-1	16
3	vhl-1	19
4	vhl-1	19
5	vhl-1	19
6	vhl-1	21
7	vhl-1	21
8	vhl-1	21
9	vhl-1	21
10	vhl-1	21
11	vhl-1	21
12	vhl-1	21
13	vhl-1	21
14	vhl-1	23
15	vhl-1	23
16	vhl-1	23
17	vhl-1	23
18	vhl-1	23
19	vhl-1	23
20	vhl-1	23
21	vhl-1	23
22	vhl-1	23
23	vhl-1	26
24	vhl-1	26
25	vhl-1	26
26	vhl-1	26
27	vhl-1	26
28	vhl-1	28
29	vhl-1	30
30	vhl-1	30
31	vhl-1	33
32	vhl-1	19
33	vhl-1	21
34	vhl-1	21
35	vhl-1	21
36	vhl-1	21
37	vhl-1	23
38	vhl-1	23
39	vhl-1	23
40	vhl-1	23
41	vhl-1	26
42	vhl-1	26
43	vhl-1	26
44	vhl-1	30
45	vhl-1	30
46	vhl-1	33
