1	tyr-2	18
2	tyr-2	18
3	tyr-2	18
4	tyr-2	18
5	tyr-2	18
6	tyr-2	18
7	tyr-2	18
8	tyr-2	18
9	tyr-2	18
10	tyr-2	18
11	tyr-2	18
12	tyr-2	18
13	tyr-2	18
14	tyr-2	18
15	tyr-2	18
16	tyr-2	18
17	tyr-2	18
18	tyr-2	18
19	tyr-2	18
20	tyr-2	18
21	tyr-2	18
22	tyr-2	18
23	tyr-2	18
24	tyr-2	18
25	tyr-2	18
26	tyr-2	18
27	tyr-2	18
28	tyr-2	20
29	tyr-2	20
30	tyr-2	20
31	tyr-2	20
32	tyr-2	20
33	tyr-2	20
34	tyr-2	20
35	tyr-2	20
36	tyr-2	20
37	tyr-2	20
38	tyr-2	20
39	tyr-2	20
40	tyr-2	20
41	tyr-2	20
42	tyr-2	20
43	tyr-2	20
44	tyr-2	23
45	tyr-2	23
46	tyr-2	23
47	tyr-2	23
48	tyr-2	23
49	tyr-2	23
50	tyr-2	23
51	tyr-2	23
52	tyr-2	23
53	tyr-2	23
54	tyr-2	23
55	tyr-2	23
56	tyr-2	23
57	tyr-2	23
58	tyr-2	23
59	tyr-2	23
60	tyr-2	23
61	tyr-2	23
62	tyr-2	23
63	tyr-2	23
64	tyr-2	23
65	tyr-2	23
66	tyr-2	23
67	tyr-2	23
68	tyr-2	23
69	tyr-2	23
70	tyr-2	23
71	tyr-2	23
72	tyr-2	23
73	tyr-2	23
74	tyr-2	23
75	tyr-2	23
76	tyr-2	25
77	tyr-2	25
78	tyr-2	25
79	tyr-2	25
80	tyr-2	25
81	tyr-2	25
82	tyr-2	25
83	tyr-2	25
84	tyr-2	27
85	tyr-2	18
86	tyr-2	18
87	tyr-2	18
88	tyr-2	18
89	tyr-2	18
90	tyr-2	20
91	tyr-2	20
92	tyr-2	20
93	tyr-2	20
94	tyr-2	20
95	tyr-2	27
96	tyr-2	18
97	tyr-2	18
98	tyr-2	18
99	tyr-2	18
100	tyr-2	18
101	tyr-2	18
102	tyr-2	18
103	tyr-2	18
104	tyr-2	18
105	tyr-2	18
106	tyr-2	18
107	tyr-2	18
108	tyr-2	18
109	tyr-2	18
110	tyr-2	18
111	tyr-2	18
112	tyr-2	18
113	tyr-2	18
114	tyr-2	18
115	tyr-2	18
116	tyr-2	18
117	tyr-2	18
118	tyr-2	18
119	tyr-2	18
120	tyr-2	18
121	tyr-2	18
122	tyr-2	18
123	tyr-2	18
124	tyr-2	18
125	tyr-2	18
126	tyr-2	18
127	tyr-2	18
128	tyr-2	18
129	tyr-2	20
130	tyr-2	20
131	tyr-2	20
132	tyr-2	20
133	tyr-2	20
134	tyr-2	20
135	tyr-2	20
136	tyr-2	23
137	tyr-2	23
138	tyr-2	23
139	tyr-2	23
140	tyr-2	23
141	tyr-2	23
142	tyr-2	25
143	tyr-2	25
144	tyr-2	25
145	tyr-2	25
146	tyr-2	27
147	tyr-2	18
148	tyr-2	18
149	tyr-2	18
150	tyr-2	18
151	tyr-2	18
152	tyr-2	18
153	tyr-2	18
154	tyr-2	18
155	tyr-2	20
156	tyr-2	20
157	tyr-2	20
158	tyr-2	20
159	tyr-2	20
160	tyr-2	20
161	tyr-2	20
162	tyr-2	20
163	tyr-2	23
164	tyr-2	18
165	tyr-2	18
