1	N2.EV(RNAi)	17
2	N2.EV(RNAi)	17
3	N2.EV(RNAi)	17
4	N2.EV(RNAi)	17
5	N2.EV(RNAi)	22
6	N2.EV(RNAi)	22
7	N2.EV(RNAi)	22
8	N2.EV(RNAi)	22
9	N2.EV(RNAi)	22
10	N2.EV(RNAi)	22
11	N2.EV(RNAi)	22
12	N2.EV(RNAi)	22
13	N2.EV(RNAi)	22
14	N2.EV(RNAi)	22
15	N2.EV(RNAi)	22
16	N2.EV(RNAi)	22
17	N2.EV(RNAi)	22
18	N2.EV(RNAi)	22
19	N2.EV(RNAi)	22
20	N2.EV(RNAi)	22
21	N2.EV(RNAi)	22
22	N2.EV(RNAi)	22
23	N2.EV(RNAi)	22
24	N2.EV(RNAi)	22
25	N2.EV(RNAi)	22
26	N2.EV(RNAi)	22
27	N2.EV(RNAi)	24
28	N2.EV(RNAi)	24
29	N2.EV(RNAi)	24
30	N2.EV(RNAi)	24
31	N2.EV(RNAi)	24
32	N2.EV(RNAi)	24
33	N2.EV(RNAi)	24
34	N2.EV(RNAi)	24
35	N2.EV(RNAi)	24
36	N2.EV(RNAi)	24
37	N2.EV(RNAi)	24
38	N2.EV(RNAi)	24
39	N2.EV(RNAi)	24
40	N2.EV(RNAi)	24
41	N2.EV(RNAi)	24
42	N2.EV(RNAi)	24
43	N2.EV(RNAi)	24
44	N2.EV(RNAi)	24
45	N2.EV(RNAi)	24
46	N2.EV(RNAi)	24
47	N2.EV(RNAi)	24
48	N2.EV(RNAi)	24
49	N2.EV(RNAi)	24
50	N2.EV(RNAi)	24
51	N2.EV(RNAi)	24
52	N2.EV(RNAi)	24
53	N2.EV(RNAi)	24
54	N2.EV(RNAi)	26
55	N2.EV(RNAi)	26
56	N2.EV(RNAi)	26
57	N2.EV(RNAi)	26
58	N2.EV(RNAi)	26
59	N2.EV(RNAi)	26
60	N2.EV(RNAi)	26
61	N2.EV(RNAi)	26
62	N2.EV(RNAi)	26
63	N2.EV(RNAi)	26
64	N2.EV(RNAi)	26
65	N2.EV(RNAi)	29
66	N2.EV(RNAi)	29
67	N2.EV(RNAi)	29
68	N2.EV(RNAi)	29
69	N2.EV(RNAi)	29
70	N2.EV(RNAi)	29
71	N2.EV(RNAi)	15
72	N2.EV(RNAi)	15
73	N2.EV(RNAi)	17
74	N2.EV(RNAi)	17
75	N2.EV(RNAi)	17
76	N2.EV(RNAi)	17
77	N2.EV(RNAi)	22
78	N2.EV(RNAi)	22
79	N2.EV(RNAi)	22
80	N2.EV(RNAi)	22
81	N2.EV(RNAi)	22
82	N2.EV(RNAi)	22
83	N2.EV(RNAi)	22
84	N2.EV(RNAi)	22
85	N2.EV(RNAi)	22
86	N2.EV(RNAi)	22
87	N2.EV(RNAi)	22
88	N2.EV(RNAi)	22
89	N2.EV(RNAi)	22
90	N2.EV(RNAi)	22
91	N2.EV(RNAi)	22
92	N2.EV(RNAi)	22
93	N2.EV(RNAi)	22
94	N2.EV(RNAi)	22
95	N2.EV(RNAi)	22
96	N2.EV(RNAi)	22
97	N2.EV(RNAi)	22
98	N2.EV(RNAi)	22
99	N2.EV(RNAi)	22
100	N2.EV(RNAi)	22
101	N2.EV(RNAi)	22
102	N2.EV(RNAi)	22
103	N2.EV(RNAi)	22
104	N2.EV(RNAi)	22
105	N2.EV(RNAi)	22
106	N2.EV(RNAi)	22
107	N2.EV(RNAi)	22
108	N2.EV(RNAi)	22
109	N2.EV(RNAi)	22
110	N2.EV(RNAi)	22
111	N2.EV(RNAi)	22
112	N2.EV(RNAi)	24
113	N2.EV(RNAi)	24
114	N2.EV(RNAi)	24
115	N2.EV(RNAi)	24
116	N2.EV(RNAi)	24
117	N2.EV(RNAi)	24
118	N2.EV(RNAi)	24
119	N2.EV(RNAi)	24
120	N2.EV(RNAi)	24
121	N2.EV(RNAi)	24
122	N2.EV(RNAi)	24
123	N2.EV(RNAi)	24
124	N2.EV(RNAi)	24
125	N2.EV(RNAi)	24
126	N2.EV(RNAi)	24
127	N2.EV(RNAi)	24
128	N2.EV(RNAi)	24
129	N2.EV(RNAi)	24
130	N2.EV(RNAi)	24
131	N2.EV(RNAi)	24
132	N2.EV(RNAi)	24
133	N2.EV(RNAi)	24
134	N2.EV(RNAi)	24
135	N2.EV(RNAi)	24
136	N2.EV(RNAi)	24
137	N2.EV(RNAi)	24
138	N2.EV(RNAi)	26
139	N2.EV(RNAi)	26
140	N2.EV(RNAi)	26
141	N2.EV(RNAi)	26
142	N2.EV(RNAi)	26
143	N2.EV(RNAi)	26
144	N2.EV(RNAi)	26
145	N2.EV(RNAi)	26
146	N2.EV(RNAi)	26
147	N2.EV(RNAi)	26
148	N2.EV(RNAi)	26
149	N2.EV(RNAi)	26
150	N2.EV(RNAi)	26
151	N2.EV(RNAi)	29
152	N2.EV(RNAi)	29
153	N2.EV(RNAi)	29
154	N2.EV(RNAi)	29
155	N2.EV(RNAi)	29
156	N2.EV(RNAi)	29
157	N2.EV(RNAi)	29
158	N2.EV(RNAi)	29
159	N2.EV(RNAi)	29
160	N2.EV(RNAi)	29
161	N2.EV(RNAi)	29
162	N2.EV(RNAi)	29
163	N2.EV(RNAi)	29
164	N2.EV(RNAi)	29
165	N2.EV(RNAi)	29
166	N2.EV(RNAi)	29
167	N2.EV(RNAi)	29
168	N2.EV(RNAi)	29
169	N2.EV(RNAi)	31
170	N2.EV(RNAi)	31
171	N2.EV(RNAi)	31
172	N2.EV(RNAi)	31
173	N2.EV(RNAi)	31
174	N2.EV(RNAi)	31
175	N2.EV(RNAi)	33
176	N2.EV(RNAi)	33
177	N2.EV(RNAi)	33
178	N2.EV(RNAi)	33
179	N2.EV(RNAi)	33
180	N2.EV(RNAi)	33
181	N2.EV(RNAi)	22
182	N2.EV(RNAi)	29
183	N2.EV(RNAi)	17
184	N2.EV(RNAi)	26
185	N2.EV(RNAi)	26
186	N2.EV(RNAi)	17
187	N2.EV(RNAi)	22
188	N2.EV(RNAi)	26
189	N2.EV(RNAi)	29
