1	N2.EV(RNAi)	13
2	N2.EV(RNAi)	17
3	N2.EV(RNAi)	17
4	N2.EV(RNAi)	17
5	N2.EV(RNAi)	17
6	N2.EV(RNAi)	17
7	N2.EV(RNAi)	21
8	N2.EV(RNAi)	21
9	N2.EV(RNAi)	21
10	N2.EV(RNAi)	21
11	N2.EV(RNAi)	21
12	N2.EV(RNAi)	21
13	N2.EV(RNAi)	21
14	N2.EV(RNAi)	21
15	N2.EV(RNAi)	21
16	N2.EV(RNAi)	21
17	N2.EV(RNAi)	21
18	N2.EV(RNAi)	21
19	N2.EV(RNAi)	23
20	N2.EV(RNAi)	23
21	N2.EV(RNAi)	23
22	N2.EV(RNAi)	23
23	N2.EV(RNAi)	23
24	N2.EV(RNAi)	29
25	N2.EV(RNAi)	29
26	N2.EV(RNAi)	29
27	N2.EV(RNAi)	29
28	N2.EV(RNAi)	29
29	N2.EV(RNAi)	29
30	N2.EV(RNAi)	29
31	N2.EV(RNAi)	31
32	N2.EV(RNAi)	31
33	N2.EV(RNAi)	31
34	N2.EV(RNAi)	31
35	N2.EV(RNAi)	31
36	N2.EV(RNAi)	17
37	N2.EV(RNAi)	15
38	N2.EV(RNAi)	15
39	N2.EV(RNAi)	15
40	N2.EV(RNAi)	17
41	N2.EV(RNAi)	17
42	N2.EV(RNAi)	17
43	N2.EV(RNAi)	17
44	N2.EV(RNAi)	17
45	N2.EV(RNAi)	17
46	N2.EV(RNAi)	21
47	N2.EV(RNAi)	21
48	N2.EV(RNAi)	21
49	N2.EV(RNAi)	29
50	N2.EV(RNAi)	29
51	N2.EV(RNAi)	29
52	N2.EV(RNAi)	29
53	N2.EV(RNAi)	29
54	N2.EV(RNAi)	29
55	N2.EV(RNAi)	31
56	N2.EV(RNAi)	31
57	N2.EV(RNAi)	31
58	N2.EV(RNAi)	31
59	N2.EV(RNAi)	34
60	N2.EV(RNAi)	15
61	N2.EV(RNAi)	15
62	N2.EV(RNAi)	13
63	N2.EV(RNAi)	13
