1	daf-16	12
2	daf-16	14
3	daf-16	17
4	daf-16	17
5	daf-16	17
6	daf-16	19
7	daf-16	19
8	daf-16	19
9	daf-16	19
10	daf-16	24
11	daf-16	24
12	daf-16	26
13	daf-16	26
14	daf-16	26
15	daf-16	26
16	daf-16	26
17	daf-16	29
18	daf-16	29
19	daf-16	29
20	daf-16	14
21	daf-16	14
22	daf-16	14
23	daf-16	14
24	daf-16	14
25	daf-16	14
26	daf-16	14
27	daf-16	14
28	daf-16	14
29	daf-16	14
30	daf-16	17
31	daf-16	17
32	daf-16	17
33	daf-16	17
34	daf-16	17
35	daf-16	17
36	daf-16	17
37	daf-16	17
38	daf-16	17
39	daf-16	12
40	daf-16	12
41	daf-16	17
42	daf-16	17
43	daf-16	17
44	daf-16	17
45	daf-16	17
46	daf-16	17
47	daf-16	19
48	daf-16	19
49	daf-16	19
50	daf-16	21
51	daf-16	24
52	daf-16	24
53	daf-16	26
54	daf-16	26
55	daf-16	26
56	daf-16	26
57	daf-16	26
58	daf-16	29
59	daf-16	29
60	daf-16	29
61	daf-16	14
62	daf-16	14
63	daf-16	14
64	daf-16	14
65	daf-16	14
66	daf-16	14
67	daf-16	14
68	daf-16	14
69	daf-16	14
70	daf-16	14
71	daf-16	14
72	daf-16	14
73	daf-16	14
74	daf-16	14
75	daf-16	17
76	daf-16	17
77	daf-16	17
78	daf-16	17
79	daf-16	17
