1	aak-2	16
2	aak-2	19
3	aak-2	19
4	aak-2	22
5	aak-2	22
6	aak-2	24
7	aak-2	24
8	aak-2	24
9	aak-2	26
10	aak-2	26
11	aak-2	28
12	aak-2	28
13	aak-2	28
14	aak-2	28
15	aak-2	28
16	aak-2	30
17	aak-2	30
18	aak-2	30
19	aak-2	19
20	aak-2	22
21	aak-2	22
22	aak-2	22
23	aak-2	22
24	aak-2	22
25	aak-2	22
26	aak-2	22
27	aak-2	22
28	aak-2	22
29	aak-2	22
30	aak-2	22
31	aak-2	22
32	aak-2	22
33	aak-2	22
34	aak-2	24
35	aak-2	24
36	aak-2	24
37	aak-2	24
38	aak-2	24
39	aak-2	26
40	aak-2	28
41	aak-2	28
42	aak-2	28
43	aak-2	28
44	aak-2	28
45	aak-2	28
46	aak-2	30
47	aak-2	30
