{
  "status": "success",
  "statusCode": 200,
  "data": {
    "email": "TEST_EMAIL@and.digital",
    "contact_medium_id": 5004,
    "contact": "TEST_EMAIL@and.digital",
    "currency_id": 1,
    "theme_id": 402
  }
}
