<svg width="60" height="60" viewBox="0 0 60 60" fill="none" xmlns="http://www.w3.org/2000/svg">
<path d="M32.709 10.2578L3.32414 15.664C3.32414 15.664 -4.32035 35.6723 6.13946 42.731C7.11668 42.731 28.1112 42.731 29.1335 42.731C39.5931 35.6721 32.709 10.2578 32.709 10.2578Z" fill="#7B5341"/>
<path d="M6.28769 26.4944C4.73894 26.4944 3.4718 25.2273 3.4718 23.6785V22.614C3.4718 21.0652 4.73894 19.7981 6.28769 19.7981C7.83644 19.7981 9.10359 21.0652 9.10359 22.614V23.6785C9.10359 25.2272 7.83644 26.4944 6.28769 26.4944Z" fill="#F2BB88"/>
<path d="M29.9053 26.4944C28.3566 26.4944 27.0894 25.2273 27.0894 23.6785V22.614C27.0894 21.0652 28.3566 19.7981 29.9053 19.7981C31.4541 19.7981 32.7212 21.0652 32.7212 22.614V23.6785C32.7212 25.2272 31.4542 26.4944 29.9053 26.4944Z" fill="#F2BB88"/>
<path d="M23.1799 33.1682H13.0123V44.9175H23.1799V33.1682Z" fill="#E3A76F"/>
<path d="M23.1799 33.1682H18.0967V44.9175H23.1799V33.1682Z" fill="#F2BB88"/>
<path d="M36.1922 48.4135V52.8725C36.1922 53.4578 35.7171 53.933 35.1305 53.933H1.06289C0.47625 53.933 0 53.458 0 52.8725V48.4135C0 42.9485 4.26996 38.4822 9.65496 38.1683C9.84164 38.1562 10.0283 38.1513 10.2162 38.1501C10.2319 38.1489 10.2489 38.1489 10.2647 38.1489H12.2164C12.4064 38.1489 12.5884 38.2243 12.7227 38.3586L17.0217 42.6589C17.6156 43.2528 18.578 43.2528 19.1719 42.6589L23.4709 38.3587C23.6052 38.2244 23.7872 38.1489 23.9771 38.1489H25.9289C25.9446 38.1489 25.9774 38.1501 25.9774 38.1501C25.9774 38.1501 26.438 38.1585 26.6646 38.1768C31.9902 38.5525 36.1922 42.991 36.1922 48.4135Z" fill="#06638D"/>
<path d="M36.1922 48.4135V52.8725C36.1922 53.4578 35.7171 53.933 35.1305 53.933H5.58739C5.00075 53.933 4.52567 53.458 4.52567 52.8725V48.4135C4.52567 43.4527 8.04422 39.3137 12.7226 38.3586L17.0216 42.6589C17.6155 43.2528 18.5779 43.2528 19.1718 42.6589L23.6804 38.1489H25.9288C25.9445 38.1489 25.9773 38.1501 25.9773 38.1501C25.9773 38.1501 26.4379 38.1585 26.6645 38.1768C31.9902 38.5525 36.1922 42.991 36.1922 48.4135Z" fill="#3692D8"/>
<path d="M29.9224 13.7642V23.778C29.9224 29.649 25.5858 34.5565 19.9584 35.4558C19.3512 35.5527 18.7295 35.6037 18.0968 35.6037C11.5918 35.6037 6.26988 30.2817 6.26988 23.778V13.7642C6.26988 11.0602 8.48309 8.84814 11.1859 8.84814H25.0078C27.7105 8.84826 29.9224 11.0602 29.9224 13.7642Z" fill="#F2BB88"/>
<path d="M29.9224 13.7642V23.778C29.9224 29.649 25.5858 34.5565 19.9584 35.4558C14.331 34.5565 9.99445 29.649 9.99445 23.778V13.7642C9.99445 11.0602 12.2064 8.84814 14.9092 8.84814H25.0078C27.7105 8.84826 29.9224 11.0602 29.9224 13.7642Z" fill="#F2D1A5"/>
<path d="M11.5724 22.1025C12.4446 22.1025 13.1516 21.3955 13.1516 20.5233C13.1516 19.6511 12.4446 18.9441 11.5724 18.9441C10.7002 18.9441 9.99317 19.6511 9.99317 20.5233C9.99317 21.3955 10.7002 22.1025 11.5724 22.1025Z" fill="#7B5341"/>
<path d="M25.1556 22.1025C26.0278 22.1025 26.7348 21.3955 26.7348 20.5233C26.7348 19.6511 26.0278 18.9441 25.1556 18.9441C24.2834 18.9441 23.5764 19.6511 23.5764 20.5233C23.5764 21.3955 24.2834 22.1025 25.1556 22.1025Z" fill="#7B5341"/>
<path d="M19.4952 28.0681H17.7971C16.4201 28.0681 15.2996 26.9477 15.2996 25.5706V19.4207C15.2996 18.9187 15.7066 18.5117 16.2087 18.5117C16.7107 18.5117 17.1177 18.9187 17.1177 19.4207V25.5706C17.1177 25.9453 17.4225 26.2501 17.7971 26.2501H19.4952C19.9972 26.2501 20.4042 26.6571 20.4042 27.1591C20.4042 27.6611 19.9972 28.0681 19.4952 28.0681Z" fill="#7B5341"/>
<path d="M33.6749 6.5102V9.82379C33.6749 10.5352 33.2628 11.1849 32.6143 11.4806C23.1569 15.8014 15.1624 17.1359 9.88289 17.4607C7.67215 17.5964 5.93777 17.5564 4.77058 17.4838C3.80941 17.4243 3.06164 16.6269 3.06164 15.6645V8.77906C3.06164 5.06668 6.09902 2.0293 9.8114 2.0293H21.3971C23.9194 2.0293 26.124 3.45711 27.244 5.54539C27.6573 4.24004 28.8814 3.28742 30.3189 3.28742H30.4522C32.2253 3.28742 33.6749 4.73691 33.6749 6.5102Z" fill="#9C6A53"/>
<path d="M33.6749 6.51019V9.82379C33.6749 10.5352 33.2629 11.1849 32.6143 11.4806C23.157 15.8014 15.1624 17.1359 9.88289 17.4607C9.01875 17.3116 8.3727 16.5589 8.3727 15.6644V8.77906C8.3727 5.06668 11.4101 2.0293 15.1225 2.0293H21.3972C23.9194 2.0293 26.124 3.45711 27.244 5.54539C27.6573 4.24004 28.8814 3.28742 30.3189 3.28742H30.4522C32.2253 3.28742 33.6749 4.73691 33.6749 6.51019Z" fill="#AD7B64"/>
<path d="M18.0967 47.6742C18.6786 47.6742 19.1503 47.2024 19.1503 46.6205C19.1503 46.0386 18.6786 45.5669 18.0967 45.5669C17.5148 45.5669 17.043 46.0386 17.043 46.6205C17.043 47.2024 17.5148 47.6742 18.0967 47.6742Z" fill="#06638D"/>
<path d="M18.0967 51.5284C18.6786 51.5284 19.1503 51.0567 19.1503 50.4748C19.1503 49.8929 18.6786 49.4211 18.0967 49.4211C17.5148 49.4211 17.043 49.8929 17.043 50.4748C17.043 51.0567 17.5148 51.5284 18.0967 51.5284Z" fill="#06638D"/>
<path d="M57.1166 22.1671V57.9703H34.2493C32.6701 57.929 31.3963 56.6588 31.3501 55.0796V54.9936L31.3513 22.1671C31.3513 20.8582 32.4118 19.7976 33.7208 19.7976H54.747C56.0561 19.7977 57.1166 20.8582 57.1166 22.1671Z" fill="#7FBED7"/>
<path d="M57.1166 22.1671V57.9703H37.9472C36.368 57.929 35.0929 56.6588 35.048 55.0796C35.048 55.0505 35.0468 55.0226 35.0468 54.9936L35.0493 22.1671C35.0493 20.8582 36.1098 19.7976 37.4188 19.7976H54.7471C56.056 19.7977 57.1166 20.8582 57.1166 22.1671Z" fill="#D9EEF7"/>
<path d="M58.4892 49.73H38.6576C37.8232 49.73 37.1468 50.4064 37.1468 51.2408V55.1055C37.1468 56.5626 36.0451 57.7975 34.6316 57.9705H57.0095V57.9681C57.0383 57.9688 57.0672 57.9705 57.096 57.9705H57.1349C58.7106 57.9705 59.9999 56.6813 59.9999 55.1055V51.2408C60 50.4065 59.3236 49.73 58.4892 49.73Z" fill="#3993B7"/>
<path d="M39.6332 34.0713C42.3951 34.0713 44.634 31.8323 44.634 29.0704C44.634 26.3085 42.3951 24.0696 39.6332 24.0696C36.8713 24.0696 34.6323 26.3085 34.6323 29.0704C34.6323 31.8323 36.8713 34.0713 39.6332 34.0713Z" fill="#FFEA06"/>
<path d="M42.213 27.1179C41.7109 27.1179 41.304 27.5248 41.304 28.0269C41.304 28.948 40.5546 29.6973 39.6336 29.6973C38.7127 29.6973 37.9631 28.9479 37.9631 28.0269C37.9631 27.5248 37.5562 27.1179 37.0541 27.1179C36.552 27.1179 36.1451 27.5248 36.1451 28.0269C36.1451 29.9505 37.71 31.5154 39.6336 31.5154C41.5571 31.5154 43.1221 29.9505 43.1221 28.0269C43.1221 27.5249 42.7152 27.1179 42.213 27.1179Z" fill="#D2C100"/>
<path d="M39.6332 47.1382C42.3951 47.1382 44.634 44.8992 44.634 42.1373C44.634 39.3754 42.3951 37.1365 39.6332 37.1365C36.8713 37.1365 34.6323 39.3754 34.6323 42.1373C34.6323 44.8992 36.8713 47.1382 39.6332 47.1382Z" fill="#F44545"/>
<path d="M39.6336 40.6658C37.71 40.6658 36.1451 42.2307 36.1451 44.1542C36.1451 44.6564 36.552 45.0632 37.0541 45.0632C37.5562 45.0632 37.9631 44.6564 37.9631 44.1542C37.9631 43.2331 38.7127 42.4838 39.6336 42.4838C40.5546 42.4838 41.304 43.2332 41.304 44.1542C41.304 44.6564 41.7109 45.0632 42.213 45.0632C42.7152 45.0632 43.1221 44.6564 43.1221 44.1542C43.1221 42.2308 41.5571 40.6658 39.6336 40.6658Z" fill="#D63030"/>
<path d="M49.6949 31.6178C49.257 31.6178 48.8554 31.4165 48.5931 31.0656L47.1321 29.1098C46.8316 28.7076 46.9141 28.138 47.3164 27.8375C47.7185 27.5372 48.2883 27.6194 48.5887 28.0219L49.6598 29.4555L52.4449 24.9268C52.708 24.4991 53.2679 24.3658 53.6953 24.6287C54.1229 24.8917 54.2565 25.4516 53.9934 25.8791L50.8671 30.9626C50.6147 31.3731 50.1764 31.6178 49.6949 31.6178Z" fill="#1B87B3"/>
<path d="M17.8762 32.5366C17.1244 32.5366 16.4655 32.4147 15.9191 32.2504C14.2103 31.7368 13.2094 30.7045 13.1675 30.6609C12.8641 30.3437 12.8754 29.8406 13.1927 29.5372C13.509 29.2346 14.0103 29.2449 14.3141 29.5598C14.4472 29.6957 17.4526 32.6724 21.9913 29.4626C22.3498 29.2092 22.8456 29.2941 23.0991 29.6527C23.3525 30.0111 23.2675 30.507 22.909 30.7605C20.9937 32.1149 19.2744 32.5366 17.8762 32.5366Z" fill="#7B5341"/>
</svg>
