{
    "pool-head-table" : [
        "Coin", "Revenue", "Pool Hashrate", "Network", "Minimum payment", "Earning Mode", "Action"
    ],
    "pool-head-table-edit" : ["Name", "Data"],
    "referral-head-table": ["Name", "Conversion", "Percent"],
    "permissions-head-table": ["Name", "Email", "Accesses", "Action"],
    "roles-head-table" : ["Name", "Permissions", "Action"],
    "nav-tab-permission" : [
        {
            "id": "admins",
            "current": true,
            "name": "Administration"
        },
        {
            "id": "roles",
            "current": false,
            "name": "Roles"
        },
        {
            "id": "permission",
            "current": false,
            "name": "Permission"
        }
    ],
    "nav-tab-system" : [
        {
            "id": "main",
            "current": true,
            "name": "Main"
        },
        {
            "id": "feedback",
            "current": false,
            "name": "Feedback"
        },
        {
            "id": "referral",
            "current": false,
            "name": "Ref. program"
        }
    ],
    "nav-tab-seo" : [
        {
            "id": "seo",
            "current": true,
            "name": "SEO"
        },
        {
            "id": "gtm",
            "current": false,
            "name": "GTM"
        },
        {
            "id": "facebook-pixel",
            "current": false,
            "name": "Facebook Pixel"
        }
    ]
}
