{
    "select-user": {
        "id": "users-list",
        "name": "users_list",
        "className": "",
        "options": [
            {"value": "all", "name": "All users"},
            {"value": "active", "name": "Active"},
            {"value": "inactive", "name": "Inactive"}
        ]
    },
    "users-head-table" : [
        "Name", "Power", "Daily profit", "Earning", "Actions"
    ],
    "nav-tab-users" : [
        {
            "id": "profile",
            "current": true,
            "name": "Profile"
        },
        {
            "id": "active_currencies",
            "current": false,
            "name": "Active Currencies"
        },
        {
            "id": "financial_statistics",
            "current": false,
            "name": "Financial Statistics"
        },
        {
            "id": "notes",
            "current": false,
            "name": "Notes"
        }
    ],
    "select-financial-statistic" : {
        "id": "financial-statistic-list",
        "name": "financial_statistic_list",
        "className": "",
        "options": [
            {"value": "all", "name": "All"},
            {"value": "", "name": "Deposit"},
            {"value": "payouts", "name": "Payouts"}
        ]
    }

}
