^C:\GIT\STODOLYA_J\EXAM20.02.20 TASK5\EXAM20.02.20 TASK5.CPP
/c /ZI /JMC /nologo /W3 /WX- /diagnostics:column /sdl /Od /Oy- /D WIN32 /D _DEBUG /D _CONSOLE /D _UNICODE /D UNICODE /Gm- /EHsc /RTC1 /MDd /GS /fp:precise /permissive- /Zc:wchar_t /Zc:forScope /Zc:inline /Fo"DEBUG\\" /Fd"DEBUG\VC142.PDB" /Gd /TP /analyze- /FC C:\GIT\STODOLYA_J\EXAM20.02.20 TASK5\EXAM20.02.20 TASK5.CPP
^C:\GIT\STODOLYA_J\EXAM20.02.20 TASK5\QUEUESTRUCT.CPP
/c /ZI /JMC /nologo /W3 /WX- /diagnostics:column /sdl /Od /Oy- /D WIN32 /D _DEBUG /D _CONSOLE /D _UNICODE /D UNICODE /Gm- /EHsc /RTC1 /MDd /GS /fp:precise /permissive- /Zc:wchar_t /Zc:forScope /Zc:inline /Fo"DEBUG\\" /Fd"DEBUG\VC142.PDB" /Gd /TP /analyze- /FC C:\GIT\STODOLYA_J\EXAM20.02.20 TASK5\QUEUESTRUCT.CPP
^C:\GIT\STODOLYA_J\EXAM20.02.20 TASK5\TUSERINTERFACE.CPP
/c /ZI /JMC /nologo /W3 /WX- /diagnostics:column /sdl /Od /Oy- /D WIN32 /D _DEBUG /D _CONSOLE /D _UNICODE /D UNICODE /Gm- /EHsc /RTC1 /MDd /GS /fp:precise /permissive- /Zc:wchar_t /Zc:forScope /Zc:inline /Fo"DEBUG\\" /Fd"DEBUG\VC142.PDB" /Gd /TP /analyze- /FC C:\GIT\STODOLYA_J\EXAM20.02.20 TASK5\TUSERINTERFACE.CPP
