<?xml version="1.0" encoding="utf-8"?>
<!DOCTYPE eagle SYSTEM "eagle.dtd">
<eagle version="9.2.2">
<drawing>
<settings>
<setting alwaysvectorfont="no"/>
<setting verticaltext="up"/>
</settings>
<grid distance="0.1" unitdist="inch" unit="inch" style="lines" multiple="1" display="no" altdistance="0.01" altunitdist="inch" altunit="inch"/>
<layers>
<layer number="1" name="Top" color="4" fill="1" visible="yes" active="yes"/>
<layer number="2" name="Route2" color="16" fill="1" visible="no" active="yes"/>
<layer number="3" name="Route3" color="17" fill="1" visible="no" active="yes"/>
<layer number="4" name="Route4" color="18" fill="1" visible="no" active="yes"/>
<layer number="5" name="Route5" color="19" fill="1" visible="no" active="yes"/>
<layer number="6" name="Route6" color="25" fill="1" visible="no" active="yes"/>
<layer number="7" name="Route7" color="26" fill="1" visible="no" active="yes"/>
<layer number="8" name="Route8" color="27" fill="1" visible="no" active="yes"/>
<layer number="9" name="Route9" color="28" fill="1" visible="no" active="yes"/>
<layer number="10" name="Route10" color="29" fill="1" visible="no" active="yes"/>
<layer number="11" name="Route11" color="30" fill="1" visible="no" active="yes"/>
<layer number="12" name="Route12" color="20" fill="1" visible="no" active="yes"/>
<layer number="13" name="Route13" color="21" fill="1" visible="no" active="yes"/>
<layer number="14" name="Route14" color="22" fill="1" visible="no" active="yes"/>
<layer number="15" name="Route15" color="23" fill="1" visible="no" active="yes"/>
<layer number="16" name="Bottom" color="1" fill="1" visible="yes" active="yes"/>
<layer number="17" name="Pads" color="2" fill="1" visible="yes" active="yes"/>
<layer number="18" name="Vias" color="2" fill="1" visible="yes" active="yes"/>
<layer number="19" name="Unrouted" color="6" fill="1" visible="yes" active="yes"/>
<layer number="20" name="Dimension" color="24" fill="1" visible="yes" active="yes"/>
<layer number="21" name="tPlace" color="7" fill="1" visible="yes" active="yes"/>
<layer number="22" name="bPlace" color="7" fill="1" visible="yes" active="yes"/>
<layer number="23" name="tOrigins" color="15" fill="1" visible="yes" active="yes"/>
<layer number="24" name="bOrigins" color="15" fill="1" visible="yes" active="yes"/>
<layer number="25" name="tNames" color="7" fill="1" visible="yes" active="yes"/>
<layer number="26" name="bNames" color="7" fill="1" visible="yes" active="yes"/>
<layer number="27" name="tValues" color="7" fill="1" visible="yes" active="yes"/>
<layer number="28" name="bValues" color="7" fill="1" visible="yes" active="yes"/>
<layer number="29" name="tStop" color="7" fill="3" visible="no" active="yes"/>
<layer number="30" name="bStop" color="7" fill="6" visible="no" active="yes"/>
<layer number="31" name="tCream" color="7" fill="4" visible="no" active="yes"/>
<layer number="32" name="bCream" color="7" fill="5" visible="no" active="yes"/>
<layer number="33" name="tFinish" color="6" fill="3" visible="no" active="yes"/>
<layer number="34" name="bFinish" color="6" fill="6" visible="no" active="yes"/>
<layer number="35" name="tGlue" color="7" fill="4" visible="no" active="yes"/>
<layer number="36" name="bGlue" color="7" fill="5" visible="no" active="yes"/>
<layer number="37" name="tTest" color="7" fill="1" visible="no" active="yes"/>
<layer number="38" name="bTest" color="7" fill="1" visible="no" active="yes"/>
<layer number="39" name="tKeepout" color="4" fill="11" visible="yes" active="yes"/>
<layer number="40" name="bKeepout" color="1" fill="11" visible="yes" active="yes"/>
<layer number="41" name="tRestrict" color="4" fill="10" visible="yes" active="yes"/>
<layer number="42" name="bRestrict" color="1" fill="10" visible="yes" active="yes"/>
<layer number="43" name="vRestrict" color="2" fill="10" visible="yes" active="yes"/>
<layer number="44" name="Drills" color="7" fill="1" visible="no" active="yes"/>
<layer number="45" name="Holes" color="7" fill="1" visible="no" active="yes"/>
<layer number="46" name="Milling" color="3" fill="1" visible="no" active="yes"/>
<layer number="47" name="Measures" color="7" fill="1" visible="no" active="yes"/>
<layer number="48" name="Document" color="7" fill="1" visible="yes" active="yes"/>
<layer number="49" name="Reference" color="7" fill="1" visible="yes" active="yes"/>
<layer number="51" name="tDocu" color="7" fill="1" visible="yes" active="yes"/>
<layer number="52" name="bDocu" color="7" fill="1" visible="yes" active="yes"/>
<layer number="88" name="SimResults" color="9" fill="1" visible="yes" active="yes"/>
<layer number="89" name="SimProbes" color="9" fill="1" visible="yes" active="yes"/>
<layer number="90" name="Modules" color="5" fill="1" visible="yes" active="yes"/>
<layer number="91" name="Nets" color="2" fill="1" visible="yes" active="yes"/>
<layer number="92" name="Busses" color="1" fill="1" visible="yes" active="yes"/>
<layer number="93" name="Pins" color="2" fill="1" visible="yes" active="yes"/>
<layer number="94" name="Symbols" color="4" fill="1" visible="yes" active="yes"/>
<layer number="95" name="Names" color="7" fill="1" visible="yes" active="yes"/>
<layer number="96" name="Values" color="7" fill="1" visible="yes" active="yes"/>
<layer number="97" name="Info" color="7" fill="1" visible="yes" active="yes"/>
<layer number="98" name="Guide" color="6" fill="1" visible="yes" active="yes"/>
</layers>
<library>
<packages>
<package name="CHERRY-MX-RGB">
<description>Cherry MX Keyswitch footprint</description>
<wire x1="-7.62" y1="7.62" x2="7.62" y2="7.62" width="0.127" layer="21"/>
<wire x1="7.62" y1="7.62" x2="7.62" y2="-7.62" width="0.127" layer="21"/>
<wire x1="7.62" y1="-7.62" x2="-7.62" y2="-7.62" width="0.127" layer="21"/>
<wire x1="-7.62" y1="-7.62" x2="-7.62" y2="7.62" width="0.127" layer="21"/>
<pad name="SW1" x="-3.81" y="2.54" drill="1.5" diameter="2.54"/>
<pad name="SW2" x="2.54" y="5.08" drill="1.5" diameter="2.54"/>
<pad name="P$3" x="-5.08" y="0" drill="1.7144" diameter="1.9304"/>
<pad name="P$4" x="5.08" y="0" drill="1.7144" diameter="1.9304"/>
<hole x="0" y="0" drill="4.0004"/>
<smd name="VDD" x="-3.35" y="-3.19" dx="1.5" dy="1" layer="16"/>
<smd name="DOUT" x="-3.35" y="-6.39" dx="1.5" dy="1" layer="16"/>
<smd name="DIN" x="3.25" y="-3.19" dx="1.5" dy="1" layer="16"/>
<smd name="VSS" x="3.25" y="-6.39" dx="1.5" dy="1" layer="16"/>
<wire x1="-2.55" y1="-2.29" x2="2.45" y2="-2.29" width="0.127" layer="21"/>
<wire x1="2.45" y1="-2.29" x2="2.45" y2="-7.29" width="0.127" layer="21"/>
<wire x1="2.45" y1="-7.29" x2="-2.55" y2="-7.29" width="0.127" layer="21"/>
<wire x1="-2.55" y1="-7.29" x2="-2.55" y2="-2.29" width="0.127" layer="21"/>
<wire x1="-2.55" y1="-2.29" x2="2.45" y2="-2.29" width="0.127" layer="20"/>
<wire x1="2.45" y1="-2.29" x2="2.45" y2="-7.29" width="0.127" layer="20"/>
<wire x1="2.45" y1="-7.29" x2="-2.55" y2="-7.29" width="0.127" layer="20"/>
<wire x1="-2.55" y1="-7.29" x2="-2.55" y2="-2.29" width="0.127" layer="20"/>
</package>
<package name="MODULE_ESP-WROOM-32">
<wire x1="-9" y1="-9.755" x2="9" y2="-9.755" width="0.127" layer="51"/>
<wire x1="9" y1="-9.755" x2="9" y2="15.745" width="0.127" layer="51"/>
<wire x1="9" y1="15.745" x2="-9" y2="15.745" width="0.127" layer="51"/>
<wire x1="-9" y1="15.745" x2="-9" y2="-9.755" width="0.127" layer="51"/>
<wire x1="-9" y1="-9" x2="-9" y2="-9.75" width="0.127" layer="21"/>
<wire x1="-9" y1="-9.75" x2="-6.5" y2="-9.75" width="0.127" layer="21"/>
<wire x1="6.5" y1="-9.75" x2="9" y2="-9.75" width="0.127" layer="21"/>
<wire x1="9" y1="-9.75" x2="9" y2="-9" width="0.127" layer="21"/>
<wire x1="-9" y1="9.25" x2="-9" y2="15.75" width="0.127" layer="21"/>
<wire x1="-9" y1="15.75" x2="9" y2="15.75" width="0.127" layer="21"/>
<wire x1="9" y1="15.75" x2="9" y2="9.25" width="0.127" layer="21"/>
<rectangle x1="-8.02203125" y1="10.5289" x2="-7.5" y2="15" layer="21"/>
<rectangle x1="-8.009109375" y1="14.5165" x2="-5" y2="15" layer="21"/>
<rectangle x1="-5.52168125" y1="12.0474" x2="-5" y2="14.5" layer="21"/>
<rectangle x1="-5.508290625" y1="12.0181" x2="-2.5" y2="12.5" layer="21"/>
<rectangle x1="-3.01023125" y1="12.0408" x2="-2.5" y2="14.5" layer="21"/>
<rectangle x1="-3.01011875" y1="14.5488" x2="0" y2="15" layer="21"/>
<rectangle x1="-0.502034375" y1="12.0488" x2="0" y2="14.5" layer="21"/>
<rectangle x1="-0.5020875" y1="12.0501" x2="2.5" y2="12.5" layer="21"/>
<rectangle x1="2.0088" y1="12.0528" x2="2.5" y2="14.5" layer="21"/>
<rectangle x1="2.01156875" y1="14.5137" x2="7.5" y2="15" layer="21"/>
<rectangle x1="7.0207" y1="10.0296" x2="7.5" y2="15" layer="21"/>
<rectangle x1="4.513959375" y1="10.0311" x2="5" y2="15" layer="21"/>
<rectangle x1="7.01886875" y1="9.525609375" x2="7.5" y2="10" layer="21"/>
<rectangle x1="4.508090625" y1="9.51706875" x2="5" y2="10" layer="21"/>
<rectangle x1="-8.02033125" y1="10.0254" x2="-7.5" y2="10.5" layer="21"/>
<rectangle x1="2.007940625" y1="13.5536" x2="2.5" y2="15" layer="21"/>
<rectangle x1="-8.03838125" y1="10.5504" x2="-7.5" y2="15" layer="51"/>
<rectangle x1="-8.04086875" y1="14.5741" x2="-5" y2="15" layer="51"/>
<rectangle x1="-5.51816875" y1="12.0396" x2="-5" y2="14.5" layer="51"/>
<rectangle x1="-5.5155" y1="12.0339" x2="-2.5" y2="12.5" layer="51"/>
<rectangle x1="-3.01036875" y1="12.0415" x2="-2.5" y2="14.5" layer="51"/>
<rectangle x1="-3.0064" y1="14.531" x2="0" y2="15" layer="51"/>
<rectangle x1="-0.501671875" y1="12.0402" x2="0" y2="14.5" layer="51"/>
<rectangle x1="-0.500515625" y1="12.0123" x2="2.5" y2="12.5" layer="51"/>
<rectangle x1="2.007690625" y1="12.0461" x2="2.5" y2="14.5" layer="51"/>
<rectangle x1="2.015290625" y1="14.5407" x2="7.5" y2="15" layer="51"/>
<rectangle x1="7.0261" y1="10.0373" x2="7.5" y2="15" layer="51"/>
<rectangle x1="4.514609375" y1="10.0326" x2="5" y2="15" layer="51"/>
<rectangle x1="7.02153125" y1="9.52923125" x2="7.5" y2="10" layer="51"/>
<rectangle x1="4.522840625" y1="9.548240625" x2="5" y2="10" layer="51"/>
<rectangle x1="-8.02665" y1="10.0334" x2="-7.5" y2="10.5" layer="51"/>
<rectangle x1="2.007590625" y1="13.5513" x2="2.5" y2="15" layer="51"/>
<wire x1="-9.25" y1="16" x2="9.25" y2="16" width="0.05" layer="39"/>
<wire x1="9.25" y1="16" x2="9.25" y2="9" width="0.05" layer="39"/>
<wire x1="9.25" y1="9" x2="10.1" y2="9" width="0.05" layer="39"/>
<wire x1="10.1" y1="9" x2="10.1" y2="-9" width="0.05" layer="39"/>
<wire x1="10.1" y1="-9" x2="9.25" y2="-9" width="0.05" layer="39"/>
<wire x1="9.25" y1="-9" x2="9.25" y2="-10" width="0.05" layer="39"/>
<wire x1="9.25" y1="-10" x2="6.5" y2="-10" width="0.05" layer="39"/>
<wire x1="6.5" y1="-10" x2="6.5" y2="-10.855" width="0.05" layer="39"/>
<wire x1="6.5" y1="-10.855" x2="-6.5" y2="-10.855" width="0.05" layer="39"/>
<wire x1="-6.5" y1="-10.855" x2="-6.5" y2="-10" width="0.05" layer="39"/>
<wire x1="-6.5" y1="-10" x2="-9.25" y2="-10" width="0.05" layer="39"/>
<wire x1="-9.25" y1="-10" x2="-9.25" y2="-9" width="0.05" layer="39"/>
<wire x1="-9.25" y1="-9" x2="-10.1" y2="-9" width="0.05" layer="39"/>
<wire x1="-10.1" y1="-9" x2="-10.1" y2="9" width="0.05" layer="39"/>
<wire x1="-10.1" y1="9" x2="-9.25" y2="9" width="0.05" layer="39"/>
<wire x1="-9.25" y1="9" x2="-9.25" y2="16" width="0.05" layer="39"/>
<text x="-9.03255" y="16.3088" size="1.68246875" layer="25">&gt;NAME</text>
<text x="-9.037009375" y="-12.5515" size="1.683309375" layer="27">&gt;VALUE</text>
<rectangle x1="-9.02585" y1="9.02585" x2="9" y2="15.75" layer="41"/>
<rectangle x1="-9.01176875" y1="9.01176875" x2="9" y2="15.75" layer="42"/>
<rectangle x1="-9.024490625" y1="9.024490625" x2="9" y2="15.75" layer="43"/>
<circle x="-10.365" y="8.2754" radius="0.1" width="0.2" layer="21"/>
<circle x="-7.425" y="8.2754" radius="0.1" width="0.2" layer="51"/>
<smd name="38" x="9" y="8.255" dx="1.7" dy="0.9" layer="1" roundness="22" rot="R180"/>
<smd name="37" x="9" y="6.985" dx="1.7" dy="0.9" layer="1" roundness="22" rot="R180"/>
<smd name="36" x="9" y="5.715" dx="1.7" dy="0.9" layer="1" roundness="22" rot="R180"/>
<smd name="35" x="9" y="4.445" dx="1.7" dy="0.9" layer="1" roundness="22" rot="R180"/>
<smd name="34" x="9" y="3.175" dx="1.7" dy="0.9" layer="1" roundness="22" rot="R180"/>
<smd name="33" x="9" y="1.905" dx="1.7" dy="0.9" layer="1" roundness="22" rot="R180"/>
<smd name="32" x="9" y="0.635" dx="1.7" dy="0.9" layer="1" roundness="22" rot="R180"/>
<smd name="31" x="9" y="-0.635" dx="1.7" dy="0.9" layer="1" roundness="22" rot="R180"/>
<smd name="30" x="9" y="-1.905" dx="1.7" dy="0.9" layer="1" roundness="22" rot="R180"/>
<smd name="29" x="9" y="-3.175" dx="1.7" dy="0.9" layer="1" roundness="22" rot="R180"/>
<smd name="28" x="9" y="-4.445" dx="1.7" dy="0.9" layer="1" roundness="22" rot="R180"/>
<smd name="27" x="9" y="-5.715" dx="1.7" dy="0.9" layer="1" roundness="22" rot="R180"/>
<smd name="26" x="9" y="-6.985" dx="1.7" dy="0.9" layer="1" roundness="22" rot="R180"/>
<smd name="25" x="9" y="-8.255" dx="1.7" dy="0.9" layer="1" roundness="22" rot="R180"/>
<smd name="24" x="5.715" y="-9.755" dx="1.7" dy="0.9" layer="1" roundness="22" rot="R90"/>
<smd name="23" x="4.445" y="-9.755" dx="1.7" dy="0.9" layer="1" roundness="22" rot="R90"/>
<smd name="22" x="3.175" y="-9.755" dx="1.7" dy="0.9" layer="1" roundness="22" rot="R90"/>
<smd name="21" x="1.905" y="-9.755" dx="1.7" dy="0.9" layer="1" roundness="22" rot="R90"/>
<smd name="20" x="0.635" y="-9.755" dx="1.7" dy="0.9" layer="1" roundness="22" rot="R90"/>
<smd name="19" x="-0.635" y="-9.755" dx="1.7" dy="0.9" layer="1" roundness="22" rot="R90"/>
<smd name="18" x="-1.905" y="-9.755" dx="1.7" dy="0.9" layer="1" roundness="22" rot="R90"/>
<smd name="17" x="-3.175" y="-9.755" dx="1.7" dy="0.9" layer="1" roundness="22" rot="R90"/>
<smd name="16" x="-4.445" y="-9.755" dx="1.7" dy="0.9" layer="1" roundness="22" rot="R90"/>
<smd name="15" x="-5.715" y="-9.755" dx="1.7" dy="0.9" layer="1" roundness="22" rot="R90"/>
<smd name="14" x="-9" y="-8.255" dx="1.7" dy="0.9" layer="1" roundness="22"/>
<smd name="13" x="-9" y="-6.985" dx="1.7" dy="0.9" layer="1" roundness="22"/>
<smd name="12" x="-9" y="-5.715" dx="1.7" dy="0.9" layer="1" roundness="22"/>
<smd name="11" x="-9" y="-4.445" dx="1.7" dy="0.9" layer="1" roundness="22"/>
<smd name="10" x="-9" y="-3.175" dx="1.7" dy="0.9" layer="1" roundness="22"/>
<smd name="9" x="-9" y="-1.905" dx="1.7" dy="0.9" layer="1" roundness="22"/>
<smd name="8" x="-9" y="-0.635" dx="1.7" dy="0.9" layer="1" roundness="22"/>
<smd name="7" x="-9" y="0.635" dx="1.7" dy="0.9" layer="1" roundness="22"/>
<smd name="6" x="-9" y="1.905" dx="1.7" dy="0.9" layer="1" roundness="22"/>
<smd name="5" x="-9" y="3.175" dx="1.7" dy="0.9" layer="1" roundness="22"/>
<smd name="4" x="-9" y="4.445" dx="1.7" dy="0.9" layer="1" roundness="22"/>
<smd name="3" x="-9" y="5.715" dx="1.7" dy="0.9" layer="1" roundness="22"/>
<smd name="2" x="-9" y="6.985" dx="1.7" dy="0.9" layer="1" roundness="22"/>
<smd name="1" x="-9" y="8.255" dx="1.7" dy="0.9" layer="1" roundness="22"/>
<smd name="1.1" x="-0.7" y="0.845" dx="4" dy="4" layer="1" rot="R180"/>
</package>
<package name="D0402" urn="urn:adsk.eagle:footprint:23043/3" locally_modified="yes">
<description>&lt;b&gt;Chip RESISTOR 0402 EIA (1005 Metric)&lt;/b&gt;</description>
<wire x1="-1" y1="0.483" x2="1" y2="0.483" width="0.0508" layer="39"/>
<wire x1="1" y1="0.483" x2="1" y2="-0.483" width="0.0508" layer="39"/>
<wire x1="1" y1="-0.483" x2="-1" y2="-0.483" width="0.0508" layer="39"/>
<wire x1="-1" y1="-0.483" x2="-1" y2="0.483" width="0.0508" layer="39"/>
<smd name="1" x="-0.5" y="0" dx="0.6" dy="0.7" layer="1"/>
<smd name="2" x="0.5" y="0" dx="0.6" dy="0.7" layer="1"/>
<text x="-0.635" y="0.635" size="1.27" layer="25">&gt;NAME</text>
<text x="-0.635" y="-1.905" size="1.27" layer="27">&gt;VALUE</text>
<rectangle x1="-0.1999" y1="-0.35" x2="0.1999" y2="0.35" layer="35"/>
<wire x1="-0.2" y1="0.2" x2="-0.2" y2="-0.2" width="0.127" layer="21"/>
<wire x1="-0.2" y1="-0.2" x2="0.2" y2="0" width="0.127" layer="21"/>
<wire x1="0.2" y1="0" x2="-0.2" y2="0.2" width="0.127" layer="21"/>
<wire x1="0.2" y1="0.2" x2="0.2" y2="-0.2" width="0.127" layer="21"/>
<wire x1="-0.1" y1="0.1" x2="-0.1" y2="-0.1" width="0.127" layer="21"/>
<wire x1="0.1" y1="0" x2="0" y2="0" width="0.127" layer="21"/>
</package>
<package name="D0603" urn="urn:adsk.eagle:footprint:23044/1" locally_modified="yes">
<description>&lt;b&gt;RESISTOR&lt;/b&gt;</description>
<wire x1="-1.473" y1="0.983" x2="1.473" y2="0.983" width="0.0508" layer="39"/>
<wire x1="1.473" y1="0.983" x2="1.473" y2="-0.983" width="0.0508" layer="39"/>
<wire x1="1.473" y1="-0.983" x2="-1.473" y2="-0.983" width="0.0508" layer="39"/>
<wire x1="-1.473" y1="-0.983" x2="-1.473" y2="0.983" width="0.0508" layer="39"/>
<smd name="1" x="-0.85" y="0" dx="1" dy="1.1" layer="1"/>
<smd name="2" x="0.85" y="0" dx="1" dy="1.1" layer="1"/>
<text x="-0.635" y="0.635" size="1.27" layer="25">&gt;NAME</text>
<text x="-0.635" y="-1.905" size="1.27" layer="27">&gt;VALUE</text>
<rectangle x1="-0.1999" y1="-0.4001" x2="0.1999" y2="0.4001" layer="35"/>
<polygon width="0.127" layer="21">
<vertex x="-0.3" y="-0.4"/>
<vertex x="-0.3" y="0.4"/>
<vertex x="0.3" y="0"/>
</polygon>
<wire x1="0.3" y1="0.4" x2="0.3" y2="-0.4" width="0.127" layer="21"/>
</package>
<package name="D0805" urn="urn:adsk.eagle:footprint:23045/1" locally_modified="yes">
<description>&lt;b&gt;RESISTOR&lt;/b&gt;&lt;p&gt;</description>
<wire x1="-1.973" y1="0.983" x2="1.973" y2="0.983" width="0.0508" layer="39"/>
<wire x1="1.973" y1="0.983" x2="1.973" y2="-0.983" width="0.0508" layer="39"/>
<wire x1="1.973" y1="-0.983" x2="-1.973" y2="-0.983" width="0.0508" layer="39"/>
<wire x1="-1.973" y1="-0.983" x2="-1.973" y2="0.983" width="0.0508" layer="39"/>
<smd name="1" x="-0.95" y="0" dx="1.3" dy="1.5" layer="1"/>
<smd name="2" x="0.95" y="0" dx="1.3" dy="1.5" layer="1"/>
<text x="-0.635" y="1.27" size="1.27" layer="25">&gt;NAME</text>
<text x="-0.635" y="-2.54" size="1.27" layer="27">&gt;VALUE</text>
<rectangle x1="-0.1999" y1="-0.5001" x2="0.1999" y2="0.5001" layer="35"/>
<polygon width="0.127" layer="21">
<vertex x="-0.3" y="0.3"/>
<vertex x="-0.3" y="-0.3"/>
<vertex x="0.3" y="0"/>
</polygon>
<wire x1="0.3" y1="0.3" x2="0.3" y2="-0.3" width="0.127" layer="21"/>
</package>
<package name="D1206" urn="urn:adsk.eagle:footprint:23047/1" locally_modified="yes">
<description>&lt;b&gt;RESISTOR&lt;/b&gt;</description>
<wire x1="-2.473" y1="0.983" x2="2.473" y2="0.983" width="0.0508" layer="39"/>
<wire x1="2.473" y1="0.983" x2="2.473" y2="-0.983" width="0.0508" layer="39"/>
<wire x1="2.473" y1="-0.983" x2="-2.473" y2="-0.983" width="0.0508" layer="39"/>
<wire x1="-2.473" y1="-0.983" x2="-2.473" y2="0.983" width="0.0508" layer="39"/>
<smd name="2" x="1.422" y="0" dx="1.6" dy="1.803" layer="1"/>
<smd name="1" x="-1.422" y="0" dx="1.6" dy="1.803" layer="1"/>
<text x="-1.27" y="1.27" size="1.27" layer="25">&gt;NAME</text>
<text x="-1.27" y="-2.54" size="1.27" layer="27">&gt;VALUE</text>
<rectangle x1="-0.3" y1="-0.7" x2="0.3" y2="0.7" layer="35"/>
<polygon width="0.127" layer="21">
<vertex x="-0.5" y="0.3"/>
<vertex x="-0.5" y="-0.6"/>
<vertex x="0.4" y="0"/>
<vertex x="-0.5" y="0.6"/>
</polygon>
<wire x1="0.4" y1="0.6" x2="0.4" y2="-0.6" width="0.127" layer="21"/>
</package>
</packages>
<symbols>
<symbol name="CHERRY-MX">
<description>Basic part for Cherry MX series keyswitch</description>
<text x="-6.096" y="5.842" size="1.4224" layer="95">CHERRY-MX</text>
<pin name="PIN-1" x="-10.16" y="2.54" length="middle"/>
<pin name="PIN-2" x="-10.16" y="-2.54" length="middle"/>
<text x="-5.08" y="-7.62" size="1.778" layer="95">&gt;NAME</text>
<wire x1="-5.08" y1="5.08" x2="-5.08" y2="-5.08" width="0.254" layer="94"/>
<wire x1="-5.08" y1="-5.08" x2="5.08" y2="-5.08" width="0.254" layer="94"/>
<wire x1="5.08" y1="-5.08" x2="5.08" y2="5.08" width="0.254" layer="94"/>
<wire x1="5.08" y1="5.08" x2="-5.08" y2="5.08" width="0.254" layer="94"/>
</symbol>
<symbol name="SK6812">
<pin name="VDD" x="-2.54" y="0" visible="pad" length="short"/>
<pin name="DIN" x="-2.54" y="-5.08" visible="pad" length="short"/>
<pin name="VSS" x="6.985" y="0" visible="pad" length="short" rot="R180"/>
<pin name="DOUT" x="6.985" y="-5.08" visible="pad" length="short" rot="R180"/>
<wire x1="0" y1="0" x2="4.445" y2="0" width="0.254" layer="94"/>
<wire x1="4.445" y1="0" x2="4.445" y2="-5.08" width="0.254" layer="94"/>
<wire x1="4.445" y1="-5.08" x2="0" y2="-5.08" width="0.254" layer="94"/>
<wire x1="0" y1="-5.08" x2="0" y2="0" width="0.254" layer="94"/>
<wire x1="1.27" y1="-1.905" x2="1.27" y2="-4.445" width="0.254" layer="94"/>
<wire x1="1.27" y1="-4.445" x2="3.175" y2="-3.175" width="0.254" layer="94"/>
<wire x1="3.175" y1="-3.175" x2="1.27" y2="-1.905" width="0.254" layer="94"/>
<wire x1="3.175" y1="-1.905" x2="3.175" y2="-4.445" width="0.254" layer="94"/>
<wire x1="1.905" y1="-1.5875" x2="2.2225" y2="-0.9525" width="0.254" layer="94"/>
<wire x1="2.54" y1="-1.5875" x2="2.8575" y2="-0.9525" width="0.254" layer="94"/>
</symbol>
<symbol name="ESP-WROOM-32">
<wire x1="-15.24" y1="-27.94" x2="15.24" y2="-27.94" width="0.254" layer="94"/>
<wire x1="15.24" y1="-27.94" x2="15.24" y2="27.94" width="0.254" layer="94"/>
<wire x1="15.24" y1="27.94" x2="-15.24" y2="27.94" width="0.254" layer="94"/>
<wire x1="-15.24" y1="27.94" x2="-15.24" y2="-27.94" width="0.254" layer="94"/>
<text x="-15.2699" y="28.5037" size="2.54498125" layer="95">&gt;NAME</text>
<text x="-15.2772" y="-31.0638" size="2.5462" layer="96">&gt;VALUE</text>
<pin name="GND" x="20.32" y="-25.4" length="middle" direction="pwr" rot="R180"/>
<pin name="3V3" x="20.32" y="25.4" length="middle" direction="pwr" rot="R180"/>
<pin name="EN" x="-20.32" y="20.32" length="middle" direction="in"/>
<pin name="SENSOR_VP" x="-20.32" y="17.78" length="middle" direction="in"/>
<pin name="SENSOR_VN" x="-20.32" y="15.24" length="middle" direction="in"/>
<pin name="IO34" x="20.32" y="-17.78" length="middle" rot="R180"/>
<pin name="IO35" x="20.32" y="-20.32" length="middle" rot="R180"/>
<pin name="TXD0" x="-20.32" y="12.7" length="middle"/>
<pin name="RXD0" x="-20.32" y="10.16" length="middle"/>
<pin name="SWP/SD3" x="-20.32" y="-5.08" length="middle"/>
<pin name="SHD/SD2" x="-20.32" y="-2.54" length="middle"/>
<pin name="SCS/CMD" x="-20.32" y="7.62" length="middle"/>
<pin name="SCK/CLK" x="-20.32" y="5.08" length="middle" function="clk"/>
<pin name="SDO/SD0" x="-20.32" y="2.54" length="middle"/>
<pin name="SDI/SD1" x="-20.32" y="0" length="middle"/>
<pin name="IO0" x="-20.32" y="-10.16" length="middle"/>
<pin name="IO2" x="-20.32" y="-12.7" length="middle"/>
<pin name="IO4" x="-20.32" y="-15.24" length="middle"/>
<pin name="IO5" x="-20.32" y="-17.78" length="middle"/>
<pin name="IO12" x="-20.32" y="-20.32" length="middle"/>
<pin name="IO13" x="20.32" y="20.32" length="middle" rot="R180"/>
<pin name="IO14" x="20.32" y="17.78" length="middle" rot="R180"/>
<pin name="IO15" x="20.32" y="15.24" length="middle" rot="R180"/>
<pin name="IO16" x="20.32" y="12.7" length="middle" rot="R180"/>
<pin name="IO17" x="20.32" y="10.16" length="middle" rot="R180"/>
<pin name="IO18" x="20.32" y="7.62" length="middle" rot="R180"/>
<pin name="IO19" x="20.32" y="5.08" length="middle" rot="R180"/>
<pin name="IO21" x="20.32" y="2.54" length="middle" rot="R180"/>
<pin name="IO22" x="20.32" y="0" length="middle" rot="R180"/>
<pin name="IO23" x="20.32" y="-2.54" length="middle" rot="R180"/>
<pin name="IO25" x="20.32" y="-5.08" length="middle" rot="R180"/>
<pin name="IO26" x="20.32" y="-7.62" length="middle" rot="R180"/>
<pin name="IO27" x="20.32" y="-10.16" length="middle" rot="R180"/>
<pin name="IO32" x="20.32" y="-12.7" length="middle" rot="R180"/>
<pin name="IO33" x="20.32" y="-15.24" length="middle" rot="R180"/>
</symbol>
<symbol name="+3V3">
<wire x1="1.27" y1="-1.905" x2="0" y2="0" width="0.254" layer="94"/>
<wire x1="0" y1="0" x2="-1.27" y2="-1.905" width="0.254" layer="94"/>
<text x="-2.54" y="-5.08" size="1.778" layer="96" rot="R90">&gt;VALUE</text>
<pin name="+3V3" x="0" y="-2.54" visible="off" length="short" direction="sup" rot="R90"/>
</symbol>
<symbol name="+5V">
<wire x1="1.27" y1="-1.905" x2="0" y2="0" width="0.254" layer="94"/>
<wire x1="0" y1="0" x2="-1.27" y2="-1.905" width="0.254" layer="94"/>
<text x="-2.54" y="-5.08" size="1.778" layer="96" rot="R90">&gt;VALUE</text>
<pin name="+5V" x="0" y="-2.54" visible="off" length="short" direction="sup" rot="R90"/>
</symbol>
<symbol name="GND">
<wire x1="-1.905" y1="0" x2="1.905" y2="0" width="0.254" layer="94"/>
<text x="-2.54" y="-2.54" size="1.778" layer="96">&gt;VALUE</text>
<pin name="GND" x="0" y="2.54" visible="off" length="short" direction="sup" rot="R270"/>
</symbol>
<symbol name="DIODE">
<wire x1="0" y1="1.27" x2="0" y2="0" width="0.254" layer="94"/>
<wire x1="0" y1="0" x2="0" y2="-1.27" width="0.254" layer="94"/>
<wire x1="0" y1="-1.27" x2="2.54" y2="0" width="0.254" layer="94"/>
<wire x1="2.54" y1="0" x2="0" y2="1.27" width="0.254" layer="94"/>
<wire x1="2.54" y1="1.27" x2="2.54" y2="0" width="0.254" layer="94"/>
<wire x1="2.54" y1="0" x2="2.54" y2="-1.27" width="0.254" layer="94"/>
<wire x1="0" y1="0" x2="2.54" y2="0" width="0.254" layer="94"/>
<pin name="P$1" x="-1.27" y="0" visible="pad" length="point"/>
<pin name="P$2" x="3.81" y="0" visible="pad" length="point"/>
<wire x1="-1.27" y1="0" x2="0" y2="0" width="0.254" layer="94"/>
<wire x1="3.81" y1="0" x2="2.54" y2="0" width="0.254" layer="94"/>
</symbol>
</symbols>
<devicesets>
<deviceset name="CHERRY-MX-RGB">
<description>Cherry MX series keyswitch</description>
<gates>
<gate name="G$1" symbol="CHERRY-MX" x="-2.54" y="-25.4"/>
<gate name="G$2" symbol="SK6812" x="-5.08" y="-38.1"/>
</gates>
<devices>
<device name="" package="CHERRY-MX-RGB">
<connects>
<connect gate="G$1" pin="PIN-1" pad="SW1"/>
<connect gate="G$1" pin="PIN-2" pad="SW2"/>
<connect gate="G$2" pin="DIN" pad="DIN"/>
<connect gate="G$2" pin="DOUT" pad="DOUT"/>
<connect gate="G$2" pin="VDD" pad="VDD"/>
<connect gate="G$2" pin="VSS" pad="VSS"/>
</connects>
<technologies>
<technology name=""/>
</technologies>
</device>
</devices>
</deviceset>
<deviceset name="ESP-WROOM-32" prefix="U">
<description>Module: combo; GPIO, I2C x2, I2S x2, SDIO, SPI x3, UART x3; 19.5dBm</description>
<gates>
<gate name="G$1" symbol="ESP-WROOM-32" x="0" y="0"/>
</gates>
<devices>
<device name="" package="MODULE_ESP-WROOM-32">
<connects>
<connect gate="G$1" pin="3V3" pad="2"/>
<connect gate="G$1" pin="EN" pad="3"/>
<connect gate="G$1" pin="GND" pad="1 1.1 15 38"/>
<connect gate="G$1" pin="IO0" pad="25"/>
<connect gate="G$1" pin="IO12" pad="14"/>
<connect gate="G$1" pin="IO13" pad="16"/>
<connect gate="G$1" pin="IO14" pad="13"/>
<connect gate="G$1" pin="IO15" pad="23"/>
<connect gate="G$1" pin="IO16" pad="27"/>
<connect gate="G$1" pin="IO17" pad="28"/>
<connect gate="G$1" pin="IO18" pad="30"/>
<connect gate="G$1" pin="IO19" pad="31"/>
<connect gate="G$1" pin="IO2" pad="24"/>
<connect gate="G$1" pin="IO21" pad="33"/>
<connect gate="G$1" pin="IO22" pad="36"/>
<connect gate="G$1" pin="IO23" pad="37"/>
<connect gate="G$1" pin="IO25" pad="10"/>
<connect gate="G$1" pin="IO26" pad="11"/>
<connect gate="G$1" pin="IO27" pad="12"/>
<connect gate="G$1" pin="IO32" pad="8"/>
<connect gate="G$1" pin="IO33" pad="9"/>
<connect gate="G$1" pin="IO34" pad="6"/>
<connect gate="G$1" pin="IO35" pad="7"/>
<connect gate="G$1" pin="IO4" pad="26"/>
<connect gate="G$1" pin="IO5" pad="29"/>
<connect gate="G$1" pin="RXD0" pad="34"/>
<connect gate="G$1" pin="SCK/CLK" pad="20"/>
<connect gate="G$1" pin="SCS/CMD" pad="19"/>
<connect gate="G$1" pin="SDI/SD1" pad="22"/>
<connect gate="G$1" pin="SDO/SD0" pad="21"/>
<connect gate="G$1" pin="SENSOR_VN" pad="5"/>
<connect gate="G$1" pin="SENSOR_VP" pad="4"/>
<connect gate="G$1" pin="SHD/SD2" pad="17"/>
<connect gate="G$1" pin="SWP/SD3" pad="18"/>
<connect gate="G$1" pin="TXD0" pad="35"/>
</connects>
<technologies>
<technology name="">
<attribute name="AVAILABILITY" value="Unavailable"/>
<attribute name="DESCRIPTION" value=" Module: combo; GPIO, I2C x2, I2S x2, SDIO, SPI x3, UART x3; 19.5dBm "/>
<attribute name="MF" value="Olimex LTD"/>
<attribute name="MP" value="ESP-WROOM-32"/>
<attribute name="PACKAGE" value="Module Espressif Systems"/>
<attribute name="PRICE" value="None"/>
</technology>
</technologies>
</device>
</devices>
</deviceset>
<deviceset name="+3V3" prefix="+3V3">
<description>&lt;b&gt;SUPPLY SYMBOL&lt;/b&gt;</description>
<gates>
<gate name="G$1" symbol="+3V3" x="0" y="0"/>
</gates>
<devices>
<device name="">
<technologies>
<technology name=""/>
</technologies>
</device>
</devices>
</deviceset>
<deviceset name="+5V" prefix="P+">
<description>&lt;b&gt;SUPPLY SYMBOL&lt;/b&gt;</description>
<gates>
<gate name="1" symbol="+5V" x="0" y="0"/>
</gates>
<devices>
<device name="">
<technologies>
<technology name=""/>
</technologies>
</device>
</devices>
</deviceset>
<deviceset name="GND" prefix="GND">
<description>&lt;b&gt;SUPPLY SYMBOL&lt;/b&gt;</description>
<gates>
<gate name="1" symbol="GND" x="0" y="0"/>
</gates>
<devices>
<device name="">
<technologies>
<technology name=""/>
</technologies>
</device>
</devices>
</deviceset>
<deviceset name="DIODE">
<gates>
<gate name="G$1" symbol="DIODE" x="0" y="0"/>
</gates>
<devices>
<device name="0402" package="D0402">
<connects>
<connect gate="G$1" pin="P$1" pad="1"/>
<connect gate="G$1" pin="P$2" pad="2"/>
</connects>
<technologies>
<technology name=""/>
</technologies>
</device>
<device name="0603" package="D0603">
<connects>
<connect gate="G$1" pin="P$1" pad="1"/>
<connect gate="G$1" pin="P$2" pad="2"/>
</connects>
<technologies>
<technology name=""/>
</technologies>
</device>
<device name="0805" package="D0805">
<connects>
<connect gate="G$1" pin="P$1" pad="1"/>
<connect gate="G$1" pin="P$2" pad="2"/>
</connects>
<technologies>
<technology name=""/>
</technologies>
</device>
<device name="1206" package="D1206">
<connects>
<connect gate="G$1" pin="P$1" pad="1"/>
<connect gate="G$1" pin="P$2" pad="2"/>
</connects>
<technologies>
<technology name=""/>
</technologies>
</device>
</devices>
</deviceset>
</devicesets>
</library>
</drawing>
<compatibility>
<note version="8.3" severity="warning">
Since Version 8.3, EAGLE supports URNs for individual library
assets (packages, symbols, and devices). The URNs of those assets
will not be understood (or retained) with this version.
</note>
</compatibility>
</eagle>
