{
    "$schema": "ski-monitor-server/src/main/resources/schema/owm/forecast_response.json",
    "self": {
        "vendor": "org.openweathermap",
        "name": "weather",
        "version": "1-0-0",
        "format": "jsonschema"
    },
    "type": "object",
    "properties": {
        "list": {
            "type": "array",
            "items": {
                "$ref": "weather_response.json"
            }
        }
    }
}