{
	"AssetInfoVersion": 1,
	"ShaderCodeToAssets": [
		{
			"ShaderMapHash": "3676434BDC62FFC0F194E7846C01EA9919113508",
			"Assets": [
				"../../../Engine/Content/EngineMaterials/PhAT_JointLimitMaterial.uasset"
			]
		},
		{
			"ShaderMapHash": "CE21B809E59889F66B6C39810C16E6D2FD37E319",
			"Assets": [
				"../../../Engine/Content/EngineMaterials/GizmoMaterial.uasset"
			]
		},
		{
			"ShaderMapHash": "925C0CC2C8424631A2DA6FECA250D0FFCC2C0D85",
			"Assets": [
				"../../../Engine/Content/EngineMaterials/M_InvalidLightmapSettings.uasset"
			]
		},
		{
			"ShaderMapHash": "A3AE248A6F05AA5BB9DDF24C32A2BFFC45368F79",
			"Assets": [
				"../../../Engine/Content/EngineMaterials/EmissiveMeshMaterial.uasset"
			]
		},
		{
			"ShaderMapHash": "E2C58873EE5237CF535FE59E114BCAB3435AC135",
			"Assets": [
				"../../../Engine/Content/EngineDebugMaterials/DebugMeshMaterial.uasset"
			]
		},
		{
			"ShaderMapHash": "8B55463DC6EBA46E7658781E872CD1A10795C143",
			"Assets": [
				"../../../Engine/Content/EngineMaterials/RemoveSurfaceMaterial.uasset"
			]
		},
		{
			"ShaderMapHash": "27E36195FF2A8E5C7EFA35B1A3664D37FBA9F873",
			"Assets": [
				"../../Plugins/Runtime/Oculus/OculusVR/Content/Materials/OculusMR_OpaqueColoredMaterial.uasset",
				"../../../Engine/Content/ArtTools/RenderToTexture/Materials/Debug/M_Emissive_Color.uasset"
			]
		},
		{
			"ShaderMapHash": "931F231FB74937674709FE04BDE3FC7716568737",
			"Assets": [
				"../../Plugins/Runtime/Oculus/OculusVR/Content/Materials/OculusMR_ChromaKey.uasset"
			]
		},
		{
			"ShaderMapHash": "8360B2E05E6638EAA2E6836157E4086C378527DA",
			"Assets": [
				"../../Plugins/Editor/SpeedTreeImporter/Content/SpeedTree9/SpeedTreeBillboardMaster.uasset"
			]
		},
		{
			"ShaderMapHash": "2A4BE9B1E447C0CC116AB74C5A912C9B2633BF8A",
			"Assets": [
				"../../Plugins/Editor/SpeedTreeImporter/Content/SpeedTree9/SpeedTreeMaster.uasset"
			]
		},
		{
			"ShaderMapHash": "DF359B4AC9B32187F758CF45B384EAE9D1313955",
			"Assets": [
				"../../../Engine/Content/EngineDebugMaterials/M_VolumeRenderSphereTracePP.uasset"
			]
		},
		{
			"ShaderMapHash": "1882B8A86961777F9222264C52EBE9583D56600D",
			"Assets": [
				"../../../Engine/Content/EngineDebugMaterials/WireframeMaterial.uasset"
			]
		},
		{
			"ShaderMapHash": "4212E1855B4A0C933DE28474B88E21135631201D",
			"Assets": [
				"../../../Engine/Content/EngineDebugMaterials/VertexColorMaterial.uasset"
			]
		},
		{
			"ShaderMapHash": "5EB0E9214B12D20C714F8FAC77380E20870BC318",
			"Assets": [
				"../../../Engine/Content/EngineMaterials/DefaultMaterial.uasset"
			]
		},
		{
			"ShaderMapHash": "4FFAF38520D73293207E565918C6B57F7F8E13C9",
			"Assets": [
				"../../Plugins/2D/Paper2D/Content/OpaqueUnlitSpriteMaterial.uasset"
			]
		},
		{
			"ShaderMapHash": "AA183A99EA3140216EA834319D300E20373F5E93",
			"Assets": [
				"../../Plugins/2D/Paper2D/Content/DefaultSpriteMaterial.uasset"
			]
		},
		{
			"ShaderMapHash": "A3609E644F6C533B8F9A24D27AB2285E2D39571D",
			"Assets": [
				"../../Plugins/Runtime/Oculus/OculusVR/Content/Materials/PokeAHoleMaterial.uasset"
			]
		},
		{
			"ShaderMapHash": "E63575823B1855A5BC7AB84D061AC356FBBDAFC1",
			"Assets": [
				"../../../Engine/Content/EngineDebugMaterials/M_SimpleUnlitTranslucent.uasset"
			]
		},
		{
			"ShaderMapHash": "27D4F827A19CAA0A888D888857CDDC3BC8720D5C",
			"Assets": [
				"../../../Engine/Content/EditorMaterials/Camera/CineMat.uasset"
			]
		},
		{
			"ShaderMapHash": "BAE22A1ABB1CBB248257C342C906E5D3F2723A2D",
			"Assets": [
				"../../../Engine/Content/VREditor/TransformGizmo/TranslucentTransformGizmoMaterial.uasset"
			]
		},
		{
			"ShaderMapHash": "D23C75799DEF0E787A73E61A3035F2635A865E7A",
			"Assets": [
				"../../../Engine/Content/VREditor/TransformGizmo/TransformGizmoMaterial.uasset"
			]
		},
		{
			"ShaderMapHash": "32D281FF7B9F2B531B6A63F9B56F1FAE852490FB",
			"Assets": [
				"../../../Engine/Content/EngineMaterials/Widget3DPassThrough_Masked_OneSided.uasset"
			]
		},
		{
			"ShaderMapHash": "F00F2F9A3CD07DA7457B6B987ED11B739EA06895",
			"Assets": [
				"../../../Engine/Content/EngineMaterials/Widget3DPassThrough_Masked.uasset"
			]
		},
		{
			"ShaderMapHash": "E9F51EE54132DCE7BFFBA8FE653EF3CE494B7150",
			"Assets": [
				"../../../Engine/Content/EngineMaterials/Widget3DPassThrough_Opaque_OneSided.uasset"
			]
		},
		{
			"ShaderMapHash": "AB2C31709D966AFC311EA77E8CF43C110BEBDFC9",
			"Assets": [
				"../../../Engine/Content/EngineMaterials/Widget3DPassThrough_Opaque.uasset"
			]
		},
		{
			"ShaderMapHash": "A62102EDF7922A29CF3165F3274B8B16B91B7432",
			"Assets": [
				"../../../Engine/Content/EngineMaterials/Widget3DPassThrough_Translucent_OneSided.uasset",
				"../../../Engine/Content/EngineMaterials/Widget3DPassThrough.uasset"
			]
		},
		{
			"ShaderMapHash": "EAE9DA31087D494255A0610F70EF6D831D19D10E",
			"Assets": [
				"../../../Engine/Content/EngineMaterials/Widget3DPassThrough_Translucent.uasset"
			]
		},
		{
			"ShaderMapHash": "6CDD0D67BE2F0A1AEAFF29AA516B67EADD0D23CB",
			"Assets": [
				"../../../Engine/Content/VREditor/TransformGizmo/Xray.uasset"
			]
		},
		{
			"ShaderMapHash": "01CEDF17BAA9E625CF968FC6207B8445F31E8B20",
			"Assets": [
				"../../../Engine/Content/VREditor/TransformGizmo/Main.uasset"
			]
		},
		{
			"ShaderMapHash": "7A5E8F202B8EC49330571FE4E974F4C1DC111699",
			"Assets": [
				"../../../Engine/Content/EngineMaterials/BaseFlattenMaterial.uasset"
			]
		},
		{
			"ShaderMapHash": "56B1B26291F2A93036D693A99C17271296B6D747",
			"Assets": [
				"../../../Engine/Content/EngineSky/VolumetricClouds/m_SimpleVolumetricCloud.uasset"
			]
		},
		{
			"ShaderMapHash": "5E54F8731E4DB06305E2C922AD4FA917B06EF3DF",
			"Assets": [
				"../../../Engine/Content/EngineMaterials/DefaultPostProcessMaterial.uasset"
			]
		},
		{
			"ShaderMapHash": "AD3B1EE8E520055A0DFECE9D37E93134BDCCB50E",
			"Assets": [
				"../../../Engine/Content/EngineMaterials/DefaultLightFunctionMaterial.uasset"
			]
		},
		{
			"ShaderMapHash": "0042AAEE9D5EF1F678BC41F998BFA45A32FB002E",
			"Assets": [
				"../../../Engine/Content/EngineMaterials/DefaultDeferredDecalMaterial.uasset"
			]
		},
		{
			"ShaderMapHash": "052826F9417262545AE9470F132F0345CDFAAD45",
			"Assets": [
				"../../../Engine/Content/EngineMaterials/WorldGridMaterial.uasset"
			]
		},
		{
			"ShaderMapHash": "5D5CE78AF765895B0E693106AA943D2E2F24E78A",
			"Assets": [
				"../../../Engine/Content/EngineMaterials/DefaultTextMaterialOpaque.uasset"
			]
		},
		{
			"ShaderMapHash": "84E77B16DB6849A87F7F4730D1BD9FAFFE41D989",
			"Assets": [
				"../../../Engine/Content/EditorMaterials/PreviewShadowIndicatorMaterial.uasset"
			]
		},
		{
			"ShaderMapHash": "040BB8DCB003F495FD9AD7E67786CBEADDF172C5",
			"Assets": [
				"../../../Engine/Content/EngineDebugMaterials/DebugEditorMaterial.uasset"
			]
		},
		{
			"ShaderMapHash": "4FE3282AB0F6C2789225C1FD03EF54E56158CD16",
			"Assets": [
				"../../../Engine/Content/EngineSky/M_Sky_Panning_Clouds2.uasset"
			]
		},
		{
			"ShaderMapHash": "197492B98197F48E0300EE41722D99517F5B94A9",
			"Assets": [
				"../../../../../../Program Files (x86)/Unreal Engen/HomeWork_Arkanoid_01/Content/Data/Environment/Materials/M_Map_L1.uasset"
			]
		},
		{
			"ShaderMapHash": "39057578C882E9DBEFEA034868E522CF87BCFBFA",
			"Assets": [
				"../../../../../../Program Files (x86)/Unreal Engen/HomeWork_Arkanoid_01/Content/Data/Environment/Materials/SkyBlue_03.uasset",
				"../../../../../../Program Files (x86)/Unreal Engen/HomeWork_Arkanoid_01/Content/Data/Environment/Materials/SkyBlue_02.uasset",
				"../../../../../../Program Files (x86)/Unreal Engen/HomeWork_Arkanoid_01/Content/Data/Environment/Materials/SkyBlue_01.uasset"
			]
		},
		{
			"ShaderMapHash": "373FB67999E3E2A15BF69CF186E9F05BB4A94951",
			"Assets": [
				"../../../../../../Program Files (x86)/Unreal Engen/HomeWork_Arkanoid_01/Content/Data/Environment/Materials/Red_03.uasset",
				"../../../../../../Program Files (x86)/Unreal Engen/HomeWork_Arkanoid_01/Content/Data/Environment/Materials/Red_02.uasset",
				"../../../../../../Program Files (x86)/Unreal Engen/HomeWork_Arkanoid_01/Content/Data/Environment/Materials/Red_01.uasset"
			]
		},
		{
			"ShaderMapHash": "AA785F230C2CD7F88E9F67889DECE13B41B96915",
			"Assets": [
				"../../../../../../Program Files (x86)/Unreal Engen/HomeWork_Arkanoid_01/Content/Data/Environment/Materials/Pink_03.uasset",
				"../../../../../../Program Files (x86)/Unreal Engen/HomeWork_Arkanoid_01/Content/Data/Environment/Materials/Pink_02.uasset",
				"../../../../../../Program Files (x86)/Unreal Engen/HomeWork_Arkanoid_01/Content/Data/Environment/Materials/Pink_01.uasset"
			]
		},
		{
			"ShaderMapHash": "65959E893FC1B115C4BE8BFCE64417ECAB8B8BD6",
			"Assets": [
				"../../../../../../Program Files (x86)/Unreal Engen/HomeWork_Arkanoid_01/Content/Data/Environment/Materials/Green_03.uasset",
				"../../../../../../Program Files (x86)/Unreal Engen/HomeWork_Arkanoid_01/Content/Data/Environment/Materials/Green_02.uasset",
				"../../../../../../Program Files (x86)/Unreal Engen/HomeWork_Arkanoid_01/Content/Data/Environment/Materials/Green_01.uasset"
			]
		},
		{
			"ShaderMapHash": "1D407E1E177FA9A2F29004DF8A471C3A6C930B04",
			"Assets": [
				"../../../../../../Program Files (x86)/Unreal Engen/HomeWork_Arkanoid_01/Content/Data/Environment/Materials/Blue_03.uasset",
				"../../../../../../Program Files (x86)/Unreal Engen/HomeWork_Arkanoid_01/Content/Data/Environment/Materials/Blue_02.uasset",
				"../../../../../../Program Files (x86)/Unreal Engen/HomeWork_Arkanoid_01/Content/Data/Environment/Materials/Blue_01.uasset"
			]
		},
		{
			"ShaderMapHash": "14CE13A45B418615F4C91002F447022392497C95",
			"Assets": [
				"../../../Engine/Content/BasicShapes/BasicShapeMaterial.uasset"
			]
		},
		{
			"ShaderMapHash": "4E57F798F32EA940E3E60BCFD1783147EE312A8B",
			"Assets": [
				"../../../../../../Program Files (x86)/Unreal Engen/HomeWork_Arkanoid_01/Content/Data/Environment/Materials/Grey_03.uasset",
				"../../../../../../Program Files (x86)/Unreal Engen/HomeWork_Arkanoid_01/Content/Data/Environment/Materials/Grey_02.uasset",
				"../../../../../../Program Files (x86)/Unreal Engen/HomeWork_Arkanoid_01/Content/Data/Environment/Materials/Grey_01.uasset"
			]
		},
		{
			"ShaderMapHash": "6F3F5D670035771BC933A1BBE0FB568268C3F625",
			"Assets": [
				"../../../../../../Program Files (x86)/Unreal Engen/HomeWork_Arkanoid_01/Content/Data/Environment/Materials/M_Block.uasset"
			]
		},
		{
			"ShaderMapHash": "797A166EF1222A1C9498D867660E5CF3E2D14354",
			"Assets": [
				"../../../../../../Program Files (x86)/Unreal Engen/HomeWork_Arkanoid_01/Content/Data/Environment/Materials/M_FireBall.uasset"
			]
		},
		{
			"ShaderMapHash": "92B0F29C6E3BEE6E4FB571A358956696DD6627F7",
			"Assets": [
				"../../../../../../Program Files (x86)/Unreal Engen/HomeWork_Arkanoid_01/Content/Data/Environment/Materials/M_Ball.uasset"
			]
		},
		{
			"ShaderMapHash": "DA512CF0F49C9C32A10B5EFD10CB0540F028CBF0",
			"Assets": [
				"../../../../../../Program Files (x86)/Unreal Engen/HomeWork_Arkanoid_01/Content/Data/Environment/Materials/M_Map_L2_2.uasset"
			]
		},
		{
			"ShaderMapHash": "75E6C7BDB36EBA9971B63C1E138CB3A64A0949E7",
			"Assets": [
				"../../../../../../Program Files (x86)/Unreal Engen/HomeWork_Arkanoid_01/Content/Data/Environment/Materials/M_Map_L3.uasset"
			]
		},
		{
			"ShaderMapHash": "4F702F272D5C430E864521FB731431811B1A2DA0",
			"Assets": [
				"../../../../../../Program Files (x86)/Unreal Engen/HomeWork_Arkanoid_01/Content/Data/Environment/Materials/M_Map_L2.uasset"
			]
		}
	]
}