"Path","Platform","Compiled","Cooked","Permutations","Compiletime","CompiledDouble","CookedDouble"
"/Engine/EngineMaterials/PhAT_JointLimitMaterial.PhAT_JointLimitMaterial","0","0","16","1","0.000000","0","0"
"/Engine/EngineMaterials/GizmoMaterial.GizmoMaterial","0","0","8","1","0.000000","0","0"
"/Engine/EngineMaterials/M_InvalidLightmapSettings.M_InvalidLightmapSettings","0","0","24","1","0.000000","0","0"
"/Engine/EngineMaterials/EmissiveMeshMaterial.EmissiveMeshMaterial","0","0","10","1","0.000000","0","0"
"/Engine/EngineDebugMaterials/DebugMeshMaterial.DebugMeshMaterial","0","0","10","1","0.000000","0","0"
"/Engine/EngineMaterials/RemoveSurfaceMaterial.RemoveSurfaceMaterial","0","0","2","1","0.000000","0","0"
"/OculusVR/Materials/OculusMR_OpaqueColoredMaterial.OculusMR_OpaqueColoredMaterial","0","0","2","1","0.000000","0","0"
"/OculusVR/Materials/OculusMR_ChromaKey.OculusMR_ChromaKey","0","0","8","1","0.000000","0","0"
"/Engine/EngineDebugMaterials/M_VolumeRenderSphereTracePP.M_VolumeRenderSphereTracePP","0","0","4","1","0.000000","0","0"
"/SpeedTreeImporter/SpeedTree9/SpeedTreeBillboardMaster.SpeedTreeBillboardMaster","0","0","70","1","0.000000","0","0"
"/SpeedTreeImporter/SpeedTree9/SpeedTreeMaster.SpeedTreeMaster","0","0","96","1","0.000000","0","0"
"/Engine/EngineDebugMaterials/WireframeMaterial.WireframeMaterial","0","0","598","1","0.000000","0","0"
"/Engine/EngineDebugMaterials/VertexColorMaterial.VertexColorMaterial","0","0","90","1","0.000000","0","0"
"/Engine/EngineMaterials/DefaultMaterial.DefaultMaterial","0","0","123","1","0.000000","0","0"
"/Engine/ArtTools/RenderToTexture/Materials/Debug/M_Emissive_Color.M_Emissive_Color","0","0","2","1","0.000000","0","0"
"/Paper2D/DefaultSpriteMaterial.DefaultSpriteMaterial","0","0","62","2","0.000000","0","0"
"/OculusVR/Materials/PokeAHoleMaterial.PokeAHoleMaterial","0","0","8","1","0.000000","0","0"
"/Engine/EngineDebugMaterials/M_SimpleUnlitTranslucent.M_SimpleUnlitTranslucent","0","0","8","1","0.000000","0","0"
"/Engine/EditorMaterials/Camera/CineMat.CineMat","0","0","24","1","0.000000","0","0"
"/Engine/VREditor/TransformGizmo/TranslucentTransformGizmoMaterial.TranslucentTransformGizmoMaterial","0","0","8","1","0.000000","0","0"
"/Engine/VREditor/TransformGizmo/TransformGizmoMaterial.TransformGizmoMaterial","0","0","2","1","0.000000","0","0"
"/Engine/EngineMaterials/Widget3DPassThrough.Widget3DPassThrough","0","0","74","6","0.000000","0","0"
"/Engine/VREditor/TransformGizmo/Xray.Xray","0","0","12","1","0.000000","0","0"
"/Engine/VREditor/TransformGizmo/Main.Main","0","0","8","1","0.000000","0","0"
"/Engine/EngineMaterials/BaseFlattenMaterial.BaseFlattenMaterial","0","0","52","1","0.000000","0","0"
"/Engine/EngineSky/VolumetricClouds/m_SimpleVolumetricCloud.m_SimpleVolumetricCloud","0","0","44","1","0.000000","0","0"
"/Engine/EngineMaterials/DefaultPostProcessMaterial.DefaultPostProcessMaterial","0","0","6","1","0.000000","0","0"
"/Engine/EngineMaterials/DefaultLightFunctionMaterial.DefaultLightFunctionMaterial","0","0","17","1","0.000000","0","0"
"/Engine/EngineMaterials/DefaultDeferredDecalMaterial.DefaultDeferredDecalMaterial","0","0","115","1","0.000000","0","0"
"/Engine/EngineMaterials/WorldGridMaterial.WorldGridMaterial","0","0","871","1","0.000000","0","0"
"/Engine/EngineMaterials/DefaultTextMaterialOpaque.DefaultTextMaterialOpaque","0","0","35","1","0.000000","0","0"
"/Engine/EditorMaterials/PreviewShadowIndicatorMaterial.PreviewShadowIndicatorMaterial","0","0","17","1","0.000000","0","0"
"/Engine/EngineDebugMaterials/DebugEditorMaterial.DebugEditorMaterial","0","0","8","1","0.000000","0","0"
"/Engine/EngineSky/M_Sky_Panning_Clouds2.M_Sky_Panning_Clouds2","0","0","2","1","0.000000","0","0"
"/Game/Data/Environment/Materials/M_Map_L1.M_Map_L1","0","0","21","1","0.000000","0","0"
"/Game/Data/Environment/Materials/SkyBlue_03.SkyBlue_03","0","0","12","1","0.000000","0","0"
"/Game/Data/Environment/Materials/Red_03.Red_03","0","0","12","1","0.000000","0","0"
"/Game/Data/Environment/Materials/Pink_03.Pink_03","0","0","12","1","0.000000","0","0"
"/Game/Data/Environment/Materials/Green_03.Green_03","0","0","12","1","0.000000","0","0"
"/Game/Data/Environment/Materials/Blue_03.Blue_03","0","0","12","1","0.000000","0","0"
"/Engine/BasicShapes/BasicShapeMaterial.BasicShapeMaterial","0","0","63","1","0.000000","0","0"
"/Game/Data/Environment/Materials/SkyBlue_02.SkyBlue_02","0","0","12","1","0.000000","0","0"
"/Game/Data/Environment/Materials/SkyBlue_01.SkyBlue_01","0","0","12","1","0.000000","0","0"
"/Game/Data/Environment/Materials/Red_02.Red_02","0","0","12","1","0.000000","0","0"
"/Game/Data/Environment/Materials/Red_01.Red_01","0","0","12","1","0.000000","0","0"
"/Game/Data/Environment/Materials/Pink_02.Pink_02","0","0","12","1","0.000000","0","0"
"/Game/Data/Environment/Materials/Pink_01.Pink_01","0","0","12","1","0.000000","0","0"
"/Game/Data/Environment/Materials/Grey_03.Grey_03","0","0","12","1","0.000000","0","0"
"/Game/Data/Environment/Materials/Grey_02.Grey_02","0","0","12","1","0.000000","0","0"
"/Game/Data/Environment/Materials/Grey_01.Grey_01","0","0","12","1","0.000000","0","0"
"/Game/Data/Environment/Materials/Green_02.Green_02","0","0","12","1","0.000000","0","0"
"/Game/Data/Environment/Materials/Green_01.Green_01","0","0","12","1","0.000000","0","0"
"/Game/Data/Environment/Materials/Blue_02.Blue_02","0","0","12","1","0.000000","0","0"
"/Game/Data/Environment/Materials/Blue_01.Blue_01","0","0","12","1","0.000000","0","0"
"/Game/Data/Environment/Materials/M_Block.M_Block","0","0","12","1","0.000000","0","0"
"/Game/Data/Environment/Materials/M_FireBall.M_FireBall","0","0","12","1","0.000000","0","0"
"/Game/Data/Environment/Materials/M_Ball.M_Ball","0","0","12","1","0.000000","0","0"
"/Game/Data/Environment/Materials/M_Map_L2_2.M_Map_L2_2","0","0","21","1","0.000000","0","0"
"/Game/Data/Environment/Materials/M_Map_L3.M_Map_L3","0","0","21","1","0.000000","0","0"
"/Game/Data/Environment/Materials/M_Map_L2.M_Map_L2","0","0","21","1","0.000000","0","0"
