<svg width="122" height="102" viewBox="0 0 122 102" fill="none" xmlns="http://www.w3.org/2000/svg">
<path d="M61.5 29H109.5M61.5 73H109.5M9 11V7C9 3.68629 11.6863 1 15 1H107C110.314 1 113 3.68629 113 7V11M9 55V47M9 91V95C9 98.3137 11.6863 101 15 101H107C110.314 101 113 98.3137 113 95V91M113 47V55M22 37C19.2386 37 17 34.7614 17 32V26C17 23.2386 19.2386 21 22 21C24.7614 21 27 23.2386 27 26V32C27 34.7614 24.7614 37 22 37ZM22 81C19.2386 81 17 78.7614 17 76V70C17 67.2386 19.2386 65 22 65C24.7614 65 27 67.2386 27 70V76C27 78.7614 24.7614 81 22 81ZM40 37C37.2386 37 35 34.7614 35 32V26C35 23.2386 37.2386 21 40 21C42.7614 21 45 23.2386 45 26V32C45 34.7614 42.7614 37 40 37ZM40 81C37.2386 81 35 78.7614 35 76V70C35 67.2386 37.2386 65 40 65C42.7614 65 45 67.2386 45 70V76C45 78.7614 42.7614 81 40 81ZM7 47H115C118.314 47 121 44.3137 121 41V17C121 13.6863 118.314 11 115 11H7C3.68629 11 1 13.6863 1 17V41C1 44.3137 3.68629 47 7 47ZM7 91H115C118.314 91 121 88.3137 121 85V61C121 57.6863 118.314 55 115 55H7C3.68629 55 1 57.6863 1 61V85C1 88.3137 3.68629 91 7 91Z" stroke="url(#paint0_linear)" stroke-width="2" stroke-linecap="round" stroke-linejoin="round"/>
<defs>
<linearGradient id="paint0_linear" x1="121" y1="1" x2="1.00001" y2="101" gradientUnits="userSpaceOnUse">
<stop stop-color="#12C2E9"/>
<stop offset="0.510417" stop-color="#C471ED"/>
<stop offset="1" stop-color="#F64F59"/>
</linearGradient>
</defs>
</svg>
