<svg width="102" height="102" viewBox="0 0 102 102" fill="none" xmlns="http://www.w3.org/2000/svg">
<path d="M101 96.8549V5.14508C101 2.85581 99.1442 1 96.8549 1H54.886C52.5967 1 50.7409 2.85582 50.7409 5.14508V96.8549C50.7409 99.1442 52.5968 101 54.886 101H96.8549M101 96.8549C101 99.1442 99.1442 101 96.8549 101M101 96.8549V50.7409M96.8549 101H5.14508C2.85582 101 1 99.1442 1 96.8549L1 54.886C1 52.5967 2.85581 50.7409 5.14508 50.7409L50.7409 50.7409M64.9896 96.3368H86.7513M86.2332 1V1.90674C86.2332 3.8383 84.6673 5.40415 82.7358 5.40415H69.0052C67.0736 5.40415 65.5078 3.8383 65.5078 1.90674V1M1 65.5078H1.90674C3.8383 65.5078 5.40415 67.0736 5.40415 69.0052L5.40415 82.7358C5.40415 84.6673 3.8383 86.2332 1.90674 86.2332H1" stroke="url(#paint0_linear)" stroke-width="2" stroke-linecap="round" stroke-linejoin="round"/>
<defs>
<linearGradient id="paint0_linear" x1="101" y1="1" x2="-13.3154" y2="80.3857" gradientUnits="userSpaceOnUse">
<stop stop-color="#12C2E9"/>
<stop offset="0.510417" stop-color="#C471ED"/>
<stop offset="1" stop-color="#F64F59"/>
</linearGradient>
</defs>
</svg>
