# Blender v2.91.0 OBJ File: ''
# www.blender.org
mtllib tune2.mtl
o Cube_Cube.002
v 0.285489 -0.426680 0.277662
v 0.285489 0.350048 0.277662
v 0.827542 -0.449255 0.277662
v -0.128601 -0.368571 0.250810
v -0.128601 0.291938 0.250810
v -0.537416 -0.267585 0.176854
v -0.537416 0.190953 0.176854
v -1.109756 -0.116107 0.071505
v -1.109756 0.062173 0.071505
v -1.471096 -0.067208 0.040846
v -1.471096 0.020841 0.040846
v 1.268008 -0.384213 0.213345
v 1.268008 0.345411 0.213345
v 1.732210 -0.255427 0.132812
v 1.732210 0.235016 0.132812
v 0.285489 -0.038316 0.288441
v -0.128601 -0.038316 0.261590
v -0.537416 -0.038316 0.187634
v -1.109756 -0.026967 0.082284
v -1.471096 -0.023184 0.051625
v -1.835073 -0.023184 0.033247
v 1.268008 -0.019401 0.283911
v 1.930177 -0.063747 0.180445
v 2.196472 0.066481 0.047951
v 2.196472 0.025168 0.047951
v 2.209192 -0.129706 0.043834
v 2.209192 -0.089212 0.043834
v 0.373674 0.148415 0.363155
v 0.827542 0.372622 0.277662
v 0.373674 0.057093 0.365690
v 0.827542 -0.038316 0.288441
v 0.556516 0.361335 0.277662
v 0.556516 -0.038316 0.288441
v 0.613409 -0.843463 0.319066
v 0.285489 -0.426680 -0.277662
v 0.285489 0.350048 -0.277662
v 0.827542 -0.449255 -0.277662
v -0.128601 -0.368571 -0.250810
v -0.128601 0.291938 -0.250810
v -0.537416 -0.267585 -0.176854
v -0.537416 0.190953 -0.176854
v -1.109756 -0.116107 -0.071505
v -1.109756 0.062173 -0.071505
v -1.471096 -0.067208 -0.040846
v -1.471096 0.020841 -0.040846
v 1.268008 -0.384213 -0.213345
v 1.268008 0.345411 -0.213345
v 1.732210 -0.255427 -0.132812
v 1.732210 0.235016 -0.132812
v 0.285490 -0.583720 0.000000
v 0.285490 0.499319 0.000000
v 0.964478 -0.587001 0.000000
v 0.783196 0.528220 0.000000
v -0.204626 -0.476508 0.000000
v -0.128601 0.418293 0.000000
v -0.521865 -0.367240 0.000000
v -0.537416 0.277483 0.000000
v -1.109756 -0.150668 0.000000
v -1.109756 0.097918 0.000000
v -1.471096 -0.082486 0.000000
v -1.471096 0.040286 0.000000
v -2.109639 -0.849480 0.000000
v -2.004086 0.739706 0.000000
v 1.268008 -0.524504 0.000000
v 1.268008 0.492854 0.000000
v 1.732210 -0.344930 0.000000
v 1.732210 0.338923 0.000000
v 0.285489 -0.038316 -0.288441
v -0.128601 -0.038316 -0.261590
v -0.537416 -0.038316 -0.187634
v -1.109756 -0.026967 -0.082284
v -1.471096 -0.023184 -0.051625
v -1.835073 -0.023184 -0.033247
v 1.268008 -0.019401 -0.283911
v 1.930177 -0.063747 -0.180445
v 1.930177 -0.073209 0.000000
v -1.835073 -0.021100 0.000000
v 2.196472 0.066481 -0.047951
v 2.196472 0.071530 0.000000
v 2.196472 0.025168 -0.047951
v 2.196472 0.025518 0.000000
v 2.209192 -0.129706 -0.043834
v 2.209192 -0.138301 0.000000
v 2.209192 -0.089212 -0.043834
v 2.209192 -0.090121 0.000000
v 0.373674 0.148415 -0.363155
v 0.827542 0.372622 -0.277662
v 0.373674 0.057093 -0.365690
v 0.827542 -0.038316 -0.288441
v 0.556516 0.361335 -0.277662
v 0.556516 -0.038316 -0.288441
v 0.229911 0.619449 0.000000
v 0.603924 0.915706 0.000000
v -0.153885 0.472943 0.000000
v 0.416917 0.682062 0.000000
v -0.658111 -0.701368 0.000000
v 0.699481 -0.582614 0.000000
v 0.613409 -0.843463 -0.319066
vt 0.664626 0.486828
vt 0.664626 0.301760
vt 0.751816 0.331052
vt 0.751816 0.495347
vt 0.574782 0.529796
vt 0.610976 0.486828
vt 0.655847 0.741970
vt 0.557326 0.728955
vt 0.557326 0.661730
vt 0.610976 0.666813
vt 0.664626 0.671896
vt 0.557326 0.486828
vt 0.475356 0.635560
vt 0.475356 0.486828
vt 0.557326 0.241203
vt 0.557326 0.311926
vt 0.475356 0.338096
vt 0.460307 0.289486
vt 0.397509 0.338696
vt 0.394431 0.383575
vt 0.281135 0.451795
vt 0.281135 0.436229
vt 0.394431 0.590080
vt 0.394431 0.486828
vt 0.281135 0.532084
vt 0.281135 0.491939
vt 0.209608 0.513469
vt 0.209608 0.493643
vt 0.209608 0.473816
vt 0.209608 0.466936
vt 0.083208 0.121517
vt 0.104102 0.837214
vt 0.137558 0.493643
vt 0.751816 0.659641
vt 0.751816 0.726043
vt 0.843705 0.609924
vt 0.882893 0.475375
vt 0.935606 0.515418
vt 0.935606 0.534024
vt 0.843705 0.656719
vt 0.843705 0.389051
vt 0.691732 0.239725
vt 0.751816 0.267871
vt 0.843705 0.348743
vt 0.137558 0.494581
vt 0.281135 0.548182
vt 0.209608 0.522227
vt 0.394431 0.629049
vt 0.475356 0.692464
vt 0.882893 0.471114
vt 0.938124 0.463907
vt 0.938124 0.463498
vt 0.935606 0.515576
vt 0.935606 0.536297
vt 0.938124 0.441799
vt 0.938124 0.445670
vt 0.574782 0.570923
vt 0.622238 0.124226
vt 0.639275 0.241701
vt 0.664626 0.486828
vt 0.751816 0.495347
vt 0.751816 0.331052
vt 0.664626 0.301760
vt 0.574782 0.529796
vt 0.610976 0.486828
vt 0.664626 0.671896
vt 0.610976 0.666813
vt 0.557326 0.661730
vt 0.557326 0.486828
vt 0.475356 0.486828
vt 0.475356 0.635560
vt 0.475356 0.338096
vt 0.557326 0.311926
vt 0.281135 0.451795
vt 0.394431 0.383575
vt 0.394431 0.486828
vt 0.394431 0.590080
vt 0.281135 0.491939
vt 0.281135 0.532084
vt 0.209608 0.493643
vt 0.209608 0.513469
vt 0.209608 0.473816
vt 0.137558 0.493643
vt 0.751816 0.659641
vt 0.843705 0.609924
vt 0.935606 0.534024
vt 0.935606 0.515418
vt 0.882893 0.475375
vt 0.843705 0.389051
vt 0.938124 0.463907
vt 0.938124 0.445670
vt 0.574782 0.570923
vt 0.546324 0.783056
vt 0.583342 0.811254
vt 0.620360 0.916477
vt 0.470351 0.717076
vt 0.370539 0.188219
vt 0.622238 0.124226
vn 0.0873 -0.1039 0.9907
vn 0.0000 -0.6293 0.7772
vn -0.0433 0.8743 0.4834
vn -0.0668 0.0299 0.9973
vn -0.1728 -0.8703 0.4612
vn -0.3078 -0.8450 0.4374
vn -0.2904 -0.8441 0.4508
vn -0.1824 0.0379 0.9825
vn -0.1872 0.0664 0.9801
vn -0.0917 0.1591 0.9830
vn -0.1631 -0.9019 0.4001
vn 0.7474 -0.6222 0.2327
vn -0.0268 0.0489 0.9984
vn 0.0935 0.8510 0.5168
vn 0.3019 0.3024 0.9041
vn 0.2708 0.7789 0.5656
vn 0.1747 -0.2637 0.9487
vn 0.1877 -0.8313 0.5231
vn 0.3088 -0.7924 0.5260
vn -0.9761 -0.2168 -0.0136
vn -0.1402 0.8887 0.4366
vn 0.7642 0.5824 0.2772
vn -0.2717 0.8634 0.4251
vn -0.1618 0.8750 0.4563
vn -0.2918 0.8563 0.4262
vn -0.9490 0.3146 0.0197
vn 0.1872 0.2261 0.9559
vn 0.0644 0.9969 -0.0461
vn -0.0260 -0.0423 0.9988
vn -0.0950 -0.1591 0.9827
vn -0.1897 -0.0663 0.9796
vn -0.1824 -0.0379 0.9825
vn -0.0668 -0.0299 0.9973
vn -0.0006 -0.0270 0.9996
vn 0.0785 0.1040 0.9915
vn 1.0000 0.0000 0.0000
vn 0.4098 0.7812 0.4709
vn 0.3403 -0.9396 0.0375
vn 0.3099 -0.4374 0.8442
vn 0.3302 -0.8252 0.4583
vn 0.1728 0.0261 0.9846
vn -0.3998 -0.0248 -0.9163
vn -0.0160 0.3844 0.9230
vn -0.0006 0.0273 0.9996
vn 0.7573 -0.3537 0.5490
vn -0.0199 -0.8841 0.4669
vn -0.9144 -0.1555 -0.3738
vn 0.0873 -0.1039 -0.9907
vn 0.0000 -0.6293 -0.7772
vn -0.0433 0.8743 -0.4834
vn -0.0668 0.0299 -0.9973
vn -0.1728 -0.8703 -0.4612
vn -0.3078 -0.8450 -0.4374
vn -0.2904 -0.8441 -0.4508
vn -0.1824 0.0379 -0.9825
vn -0.1872 0.0664 -0.9801
vn -0.0917 0.1591 -0.9830
vn -0.1631 -0.9019 -0.4001
vn 0.7474 -0.6222 -0.2327
vn -0.0268 0.0489 -0.9984
vn 0.0935 0.8510 -0.5168
vn 0.3019 0.3024 -0.9041
vn 0.2708 0.7789 -0.5656
vn 0.1747 -0.2637 -0.9487
vn 0.1877 -0.8313 -0.5231
vn 0.3088 -0.7924 -0.5260
vn -0.9761 -0.2168 0.0136
vn -0.1402 0.8887 -0.4366
vn 0.7642 0.5824 -0.2772
vn -0.2717 0.8634 -0.4251
vn -0.1618 0.8750 -0.4563
vn -0.2918 0.8563 -0.4262
vn -0.9490 0.3146 -0.0197
vn 0.1872 0.2261 -0.9559
vn 0.0644 0.9969 0.0461
vn -0.0260 -0.0423 -0.9988
vn -0.0950 -0.1591 -0.9827
vn -0.1897 -0.0663 -0.9796
vn -0.1824 -0.0379 -0.9825
vn -0.0668 -0.0299 -0.9973
vn -0.0006 -0.0270 -0.9996
vn 0.0785 0.1040 -0.9915
vn 0.4098 0.7812 -0.4709
vn 0.3403 -0.9396 -0.0375
vn 0.3099 -0.4374 -0.8442
vn 0.3302 -0.8252 -0.4583
vn 0.1728 0.0261 -0.9846
vn -0.3998 -0.0248 0.9163
vn -0.0160 0.3844 -0.9230
vn -0.0006 0.0273 -0.9996
vn 0.0000 0.0000 -1.0000
vn 0.7573 -0.3537 -0.5490
vn -0.0199 -0.8841 -0.4669
vn -0.9144 -0.1555 0.3738
usemtl Material.002
s off
f 31/1/1 3/2/1 12/3/1 22/4/1
f 30/5/2 33/6/2 31/1/2
f 53/7/3 51/8/3 2/9/3 32/10/3 29/11/3
f 16/12/4 2/9/4 5/13/4 17/14/4
f 50/15/5 1/16/5 4/17/5 54/18/5
f 56/19/6 6/20/6 8/21/6 58/22/6
f 54/18/7 4/17/7 6/20/7 56/19/7
f 17/14/8 5/13/8 7/23/8 18/24/8
f 18/24/9 7/23/9 9/25/9 19/26/9
f 19/26/10 9/25/10 11/27/10 20/28/10
f 58/22/11 8/21/11 10/29/11 60/30/11
f 60/30/12 10/29/12 62/31/12
f 20/28/13 11/27/13 63/32/13 21/33/13
f 53/7/14 29/11/14 13/34/14 65/35/14
f 15/36/15 23/37/15 25/38/15 24/39/15
f 65/35/16 13/34/16 15/36/16 67/40/16
f 22/4/17 12/3/17 14/41/17 23/37/17
f 3/2/18 52/42/18 64/43/18 12/3/18
f 12/3/19 64/43/19 66/44/19 14/41/19
f 21/33/20 63/32/20 77/45/20
f 9/25/21 59/46/21 61/47/21 11/27/21
f 11/27/22 61/47/22 63/32/22
f 7/23/23 57/48/23 59/46/23 9/25/23
f 2/9/24 51/8/24 55/49/24 5/13/24
f 5/13/25 55/49/25 57/48/25 7/23/25
f 62/31/26 21/33/26 77/45/26
f 13/34/27 22/4/27 23/37/27 15/36/27
f 76/50/28 23/37/28 27/51/28 85/52/28
f 10/29/29 20/28/29 21/33/29 62/31/29
f 8/21/30 19/26/30 20/28/30 10/29/30
f 6/20/31 18/24/31 19/26/31 8/21/31
f 4/17/32 17/14/32 18/24/32 6/20/32
f 1/16/33 16/12/33 17/14/33 4/17/33
f 3/2/34 31/1/34 33/6/34 16/12/34 1/16/34
f 29/11/35 31/1/35 22/4/35 13/34/35
f 81/53/36 79/54/36 24/39/36 25/38/36
f 67/40/37 15/36/37 24/39/37 79/54/37
f 23/37/38 76/50/38 81/53/38 25/38/38
f 83/55/36 85/52/36 27/51/36 26/56/36
f 23/37/39 14/41/39 26/56/39 27/51/39
f 14/41/40 66/44/40 83/55/40 26/56/40
f 31/1/41 29/11/41 28/57/41 30/5/41
f 28/57/42 32/10/42 33/6/42 30/5/42
f 28/57/43 29/11/43 32/10/43
f 2/9/44 16/12/44 33/6/44 32/10/44
f 34/58/45 52/42/45 3/2/45
f 1/16/46 50/15/46 97/59/46 3/2/46
f 3/2/47 97/59/47 52/42/47 34/58/47
f 89/60/48 74/61/48 46/62/48 37/63/48
f 88/64/49 89/60/49 91/65/49
f 53/7/50 87/66/50 90/67/50 36/68/50 51/8/50
f 68/69/51 69/70/51 39/71/51 36/68/51
f 50/15/52 54/18/52 38/72/52 35/73/52
f 56/19/53 58/22/53 42/74/53 40/75/53
f 54/18/54 56/19/54 40/75/54 38/72/54
f 69/70/55 70/76/55 41/77/55 39/71/55
f 70/76/56 71/78/56 43/79/56 41/77/56
f 71/78/57 72/80/57 45/81/57 43/79/57
f 58/22/58 60/30/58 44/82/58 42/74/58
f 60/30/59 62/31/59 44/82/59
f 72/80/60 73/83/60 63/32/60 45/81/60
f 53/7/61 65/35/61 47/84/61 87/66/61
f 49/85/62 78/86/62 80/87/62 75/88/62
f 65/35/63 67/40/63 49/85/63 47/84/63
f 74/61/64 75/88/64 48/89/64 46/62/64
f 37/63/65 46/62/65 64/43/65 52/42/65
f 46/62/66 48/89/66 66/44/66 64/43/66
f 73/83/67 77/45/67 63/32/67
f 43/79/68 45/81/68 61/47/68 59/46/68
f 45/81/69 63/32/69 61/47/69
f 41/77/70 43/79/70 59/46/70 57/48/70
f 36/68/71 39/71/71 55/49/71 51/8/71
f 39/71/72 41/77/72 57/48/72 55/49/72
f 62/31/73 77/45/73 73/83/73
f 47/84/74 49/85/74 75/88/74 74/61/74
f 76/50/75 85/52/75 84/90/75 75/88/75
f 44/82/76 62/31/76 73/83/76 72/80/76
f 42/74/77 44/82/77 72/80/77 71/78/77
f 40/75/78 42/74/78 71/78/78 70/76/78
f 38/72/79 40/75/79 70/76/79 69/70/79
f 35/73/80 38/72/80 69/70/80 68/69/80
f 37/63/81 35/73/81 68/69/81 91/65/81 89/60/81
f 87/66/82 47/84/82 74/61/82 89/60/82
f 81/53/36 80/87/36 78/86/36 79/54/36
f 67/40/83 79/54/83 78/86/83 49/85/83
f 75/88/84 80/87/84 81/53/84 76/50/84
f 83/55/36 82/91/36 84/90/36 85/52/36
f 75/88/85 84/90/85 82/91/85 48/89/85
f 48/89/86 82/91/86 83/55/86 66/44/86
f 89/60/87 88/64/87 86/92/87 87/66/87
f 86/92/88 88/64/88 91/65/88 90/67/88
f 86/92/89 90/67/89 87/66/89
f 36/68/90 90/67/90 91/65/90 68/69/90
f 51/8/91 92/93/91 95/94/91 93/95/91 53/7/91
f 55/49/91 94/96/91 92/93/91 51/8/91
f 55/49/91 57/48/91 94/96/91
f 54/18/91 96/97/91 56/19/91
f 98/98/92 37/63/92 52/42/92
f 35/73/93 37/63/93 97/59/93 50/15/93
f 37/63/94 98/98/94 52/42/94 97/59/94
