Horisontal in:
 4 3 5 6 7
 4 3 5 6 7
 4 3 5 6 7
 4 3 5 6 7
 4 3 5 6 7

Horisontal out:
 3 3 3 3 3
 4 4 4 4 4
 5 5 5 5 5
 6 6 6 6 6
 7 7 7 7 7
--------------------
Vertical in:
 1 1 1 1 1
 2 2 2 2 2
 3 3 3 3 3
 4 4 4 4 4
 5 5 5 5 5

Vertical out:
 1 2 3 4 5
 1 2 3 4 5
 1 2 3 4 5
 1 2 3 4 5
 1 2 3 4 5
--------------------
Snake in:
  1  2  3  4  5
  6  7  8  9 10
 11 12 13 14 15
 16 17 18 19 20
 21 22 23 24 25

Snake out:
  1  2  3  4  5
 10  9  8  7  6
 11 12 13 14 15
 20 19 18 17 16
 21 22 23 24 25
--------------------
Diagonal in:
 1 1 1 1 1
 2 2 2 2 2
 3 3 3 3 3
 4 4 4 4 4
 5 5 5 5 5

Diagonal out:
 1 1 2 2 3
 1 1 2 3 4
 1 2 3 4 5
 2 3 4 5 5
 3 4 4 5 5
--------------------
Horisontal-Vertical in:
 1 1 1 1 1
 2 2 2 2 2
 3 3 3 3 3
 4 4 4 4 4
 5 5 5 5 5

Horisontal-Vertical out:
 1 1 1 1 1
 4 2 2 2 5
 4 5 2 5 5
 4 2 3 3 5
 3 3 3 4 4
--------------------
Snail in:
 1 1 1 1 1
 2 2 2 2 2
 3 3 3 3 3
 4 4 4 4 4
 5 5 5 5 5

Snail out:
 1 1 1 1 1
 4 4 4 4 2
 3 5 5 4 2
 3 5 5 5 2
 3 3 3 2 2
--------------------
