-10000,10000
-10000,10000
-10000,10000
85
6
250
-8549.99448424,4265.3377881,-9702.83835418
-5013.001405,-6069.26199577,-4896.51073408
-1907.69519045,-9895.64231121,-1647.73621549
2284.73262469,3729.15784382,758.214175441
5251.62485061,-3253.2104771,3645.17446731
9923.03580886,3895.24313536,9239.63096914
-8088.85976894,-8054.05732008,-9432.38517841
-6651.7326605,7101.36087055,-4702.18252508
-2727.42390955,-6404.29548476,-924.027558193
980.319234358,-1266.00674095,1354.7653361
6184.26449678,-7887.6587646,3385.10124393
8021.75658382,-129.311478649,9266.86552967
-8855.45536611,6430.97009672,-7916.20675586
-6028.47554668,4621.81057736,-4409.73348132
-2266.47489605,-7134.35558613,-1926.79446877
867.836296347,-3465.08479065,1211.31729737
6234.33859711,3500.35851734,5401.15034443
7749.53801732,4334.76678517,7995.24974174
-8505.09689251,5215.97547911,-8698.34141032
-3574.77203324,4338.58895101,-4388.43481663
-3209.12561751,-3478.01697986,-281.939681499
2397.57621884,-1909.60124986,1639.44165043
6314.23748998,1778.23848039,4563.39810417
8261.23348166,3809.08330898,9665.24548743
-9933.31185266,8108.59030513,-8944.92225976
-5610.097779,5234.58659888,-6606.3855188
-1276.30959176,-3881.98050228,-1085.5993133
2873.84365079,-5938.27379724,3182.58115738
6636.88269202,-9276.44600544,5219.96179511
8561.72261782,6401.59037255,9963.04919026
-8640.73359106,-6974.42998359,-7811.7700625
-3592.8061371,-267.598613196,-5561.87111226
-2120.82875746,-4442.32098102,-2155.62728867
1481.48055243,-161.835697368,859.382883266
4828.69064036,-2597.9952354,4340.48844791
8661.72946482,6227.96958783,9945.54816416
-9163.25691117,-6400.17714576,-7736.95676123
-4545.17264606,-5113.26262736,-5861.4309756
-2840.61374939,-9219.21750293,-960.86474415
1221.58960546,-6252.52152137,348.711214632
5040.46804675,1363.63642151,4438.84921309
8286.56451107,9653.08281099,9632.90500336
-8042.68851795,1290.84019581,-9916.00946743
-4571.79449193,7538.16156275,-4363.79781833
-2326.90849047,-4396.60294883,-991.922091038
1152.99998861,7859.91040548,1883.1015204
4212.94501419,-7428.74163679,5104.09420679
6934.82040253,-9894.08391425,8700.29180965
-6826.20729564,-1348.53714599,-8405.65525501
-4507.08335205,-3901.21364108,-6159.59018225
-646.963164494,-4367.3012592,-558.483452391
694.063608109,-8807.25615542,3093.56718143
4032.15534564,3146.24610721,4366.81449369
8061.7241457,1607.90892201,8790.73951851
-8588.0127438,4743.93827304,-6828.69592665
-4397.28922224,4820.13724827,-5832.31809913
-2195.56933946,2762.04918126,-1070.99368572
357.577064046,9446.01801864,2818.15576372
6219.19790455,-2081.5006935,6046.05901427
9670.29281405,4376.62588809,9051.57154561
-7348.87839447,8310.93782675,-6742.6680363
-4813.22608762,-1664.31262028,-5333.82558726
-688.714661597,7071.63541976,-443.538759647
1108.45273219,3157.84135099,1600.11682121
5277.18896501,-5809.34696407,4935.13409493
8104.70544544,-8032.72850284,7184.12674308
-9103.7431541,1587.15270766,-7513.39899004
-4052.35497247,8143.74379668,-5750.20025943
-1968.20437426,3690.72535679,-1512.13938813
3037.3897261,-1752.27381147,1726.07112702
6083.42668053,9597.56340264,4782.74386058
7788.87077207,-4832.24419514,7127.14367302
-9877.44626691,-2695.74070665,-7472.28587406
-3603.05464645,8467.43536743,-3615.99443526
-467.239628807,7479.55748649,-111.109552521
2668.03880955,4133.45808321,2830.62561693
3512.98254192,-4420.96853818,5879.96670188
8727.99882608,-3102.47582624,8142.7407136
-8402.40717973,3602.23144011,-9563.14159779
-4097.14705098,-562.643205001,-5690.49918848
-1660.92297524,-4421.2701366,-1211.88507547
1761.19418053,1183.76949938,2412.90887271
5575.8249392,-6268.40104884,5175.02979052
9792.7222289,-8565.11378077,8516.41014777
-7143.85688231,4683.74241291,-6897.82272263
-5385.59718639,4589.87528304,-4382.37080993
-2395.54604507,957.733041701,-1753.12223712
3021.21956211,-2425.70169239,2892.43171098
4183.13981239,1522.25707561,4080.80759882
9438.40143663,6637.71432643,8979.02886711
-7889.526761,-3503.57755461,-7240.20151177
-6663.22841736,1497.69903945,-6049.94755185
-3143.44684459,-8756.89545509,-1925.66820147
2039.28632202,-5187.12325933,147.217956188
3615.52071396,719.37621104,5883.32725561
7613.42162488,7514.0980962,7902.81791327
-9537.00375705,-8612.65877339,-9029.36930966
-4278.13040611,-7131.81509594,-4691.97280878
-3324.61398232,8549.44402546,-2701.28038801
1570.84158974,-8193.66286435,2569.39008911
3698.67379616,3538.88879768,4263.6676153
6932.10462646,-1145.09752949,8398.72533259
-7490.65506115,6224.58742031,-8152.8595347
-6633.59731511,-8482.15096407,-6266.41365744
-2208.93552755,-6140.93746725,-1635.65067118
577.076133427,-8986.25943915,729.253896893
6195.40793468,-1156.31860973,3867.69109908
8989.32953778,-7976.65665677,8027.88794717
-6801.27359328,5738.69616369,-9579.51580358
-4464.31613738,-4991.01988497,-4119.48211553
-1656.40128109,-2712.18967126,-531.420582686
862.226558517,-6973.3597447,1158.12962775
5883.43680081,-9992.38787927,5792.87774222
7567.5751326,-1174.37237958,8428.01974707
-9525.31174056,5057.41960251,-8681.28766063
-3934.80983614,-5479.10107967,-4595.00274198
-2275.77792857,-6091.58279278,-422.60031807
760.633267535,-6969.59659362,2289.27132143
6562.78091519,8005.90563183,6114.95800862
8437.43581326,-9067.89810704,7401.42748745
-7567.00592915,3925.45730394,-9065.63396291
-4728.11799133,4731.50406489,-5753.60496707
-2233.58426109,5434.00557859,-2305.9491258
1534.35915981,-7201.10014659,2674.90551542
3500.23379231,2275.43906056,4475.80173385
8356.77266989,-3776.90849162,8905.53809498
-7691.30148004,3858.77260755,-9250.32425631
-5164.99354118,437.225379876,-3488.6710271
-2121.07198579,-4137.01433396,-3008.63409626
1601.89453808,-9672.09098455,834.650424442
4913.02454591,-1285.98490064,4933.65163075
7824.86843165,4218.01240747,7446.45658593
-9393.66465871,8653.97105918,-8716.12335773
-3413.65818044,-2965.65412717,-4767.82886738
-3100.62573629,8990.58368159,-2476.63232857
2727.93879235,1985.42855785,694.533393622
5533.77769395,4137.04681882,4432.82176769
8445.03455706,1403.19614821,7812.21813246
-9192.28208895,7813.86424446,-9499.95513647
-3655.2040222,525.117818724,-5517.01032739
-2156.58754155,-9030.64667057,-185.416802123
2496.7638935,9985.17960475,50.3756116361
3617.80645434,9575.11536712,4745.93563864
7173.74076079,-5817.64287742,8869.49023698
-7010.2415446,2049.63399627,-8572.46154956
-3654.12138777,-3195.65088637,-4952.01801678
-1150.45579167,-5976.82605346,-2905.86173711
1018.53174858,-2351.67052633,1082.45796545
3880.98487715,-2806.39304196,3509.6006364
9501.70097936,2168.00570429,7472.87183306
-8765.13687025,-9447.18372568,-7206.4992769
-4250.32575451,-7388.18487476,-5120.33729943
-858.895248188,-5432.33199002,-2866.63453237
3076.6466313,-308.853296855,2938.18983112
4846.49215901,6862.97968996,6566.96827129
6999.78414142,570.957748298,8809.71076295
-9521.71806275,-7513.32994283,-8637.46624332
-3550.24707199,632.077613414,-5379.63912459
-146.813488539,8742.03407097,-1232.04285434
2925.4798726,-5937.27662895,2748.76770724
4765.67254769,-6816.42324858,3798.37417757
7744.96536559,-6078.84470253,8005.88472804
-6996.77024815,8948.7578522,-8916.49890269
-4786.27981511,-6712.29662398,-6636.76632031
-2302.09260311,-1127.16337352,-2296.66956739
2322.95293173,5308.72785181,2269.03022478
5505.42136898,8284.0445978,6517.45682351
7539.99292588,7376.51488863,8899.74196997
-9592.40287144,4828.59793549,-9598.60797811
-4156.12346783,8094.31807988,-6258.00031534
-1862.09910146,-2832.86556441,-643.27660154
257.47749176,7634.58817894,1234.8226251
6539.64666287,6142.98065969,5708.73859223
7361.87052832,-6887.17554388,6973.52703182
-9080.21207663,-9395.58642941,-7024.9777979
-4050.57850376,-248.684057549,-4843.49048425
-887.776239062,1569.23748163,-1760.12990576
1645.48184074,-1840.88778742,765.870435021
6573.53366781,58.9882389253,4906.3362346
7607.93309273,-1922.6218469,7502.46444528
-9479.42106078,-7892.72991592,-8429.66004122
-5159.11638,-9878.86077008,-3445.14663808
-3245.90498462,8526.45749246,-682.673400086
1567.02968557,5891.92482475,3053.07144898
5204.18002246,7291.02015127,6111.27350718
7555.61750482,5453.36405321,7724.58632474
-9129.97937887,-5333.89470811,-7388.47580702
-4579.41758087,839.976461534,-5105.88294285
-783.778803395,5613.62663541,-2645.1688044
1745.26917496,7568.89557979,98.8910179153
4806.69768594,-8661.5078647,3960.88505332
9654.73373744,9041.54280593,8489.22760092
-9994.22520569,2424.79387413,-9874.31852063
-4309.62057154,-6255.5191484,-4877.64254527
-2684.74426219,-4318.30086272,-2258.29112263
1365.78590365,2272.23441613,1781.04340244
5739.20413668,-9661.36380251,5295.31997329
8782.18375435,-1330.51965748,7459.3699974
-8133.75643995,3308.2256189,-6763.26447171
-6476.68441241,-5661.79499422,-4872.24190225
-3061.98122866,9307.66470545,-2896.17578241
618.819042396,1282.95357691,1996.64045933
4611.68337471,-9705.1358282,4720.11894985
8108.11781956,2544.52438372,8734.56923192
-9747.88557421,-3611.42147174,-7476.90397192
-5467.89743905,1515.72200389,-6516.36332499
-1297.12895611,-5007.94128212,-1149.60021793
2080.94576796,4288.72933878,1103.22787342
5981.12293728,-2338.37183225,3432.25419408
7645.76661465,-5870.14642565,7206.81342712
-8479.00236837,3316.58521225,-7108.86085076
-4745.36077076,4819.85419271,-3814.27916945
-1911.92614262,3595.26363379,-1678.01302785
2861.00308346,4630.19262575,1332.88653874
3479.00471282,-8349.92377298,5743.58134811
8402.93028768,2584.61892345,8122.10939138
-8715.06332334,-9944.73534182,-8232.80156531
-4487.25176394,2020.64243208,-6257.61050328
-2089.23568089,-8881.19764543,-247.964340005
1744.2002178,-6725.84132174,2827.74153045
5491.67580002,6005.38080474,5439.66243634
7465.57151091,46.4219593655,7633.29536327
-9750.28284806,-481.003923198,-8098.43161969
-4501.84671403,5699.95329622,-5357.24546984
-725.554409884,2003.19068321,-2818.53312221
3287.63959681,-5004.14459335,1227.47381435
4492.53351181,6028.60349717,4759.86916237
8104.05824231,4130.49872445,9449.71388406
-8594.4564609,2913.28016777,-9670.07234994
-4083.48346637,-4407.36398376,-6002.02576272
-2310.87819547,3888.11642393,-2944.31011616
222.929011993,9383.75491486,677.002931045
5630.80877689,-4266.36163207,4218.94436518
7528.29049028,-4217.17853679,8288.26915534
-6853.97514479,-3468.94277599,-6705.80335926
-5371.50483189,2203.42164566,-6074.24918185
-379.147926356,-6035.31404683,-2282.16830484
500.864576452,-267.57798063,709.052234866
5277.7540077,7649.18224097,3353.7993558
9822.10951277,6933.33531014,8945.02238233
-8874.40940303,-2192.9586419,-8478.47086738
-4111.32653224,3894.71849922,-5895.90990788
-69.6652168376,-404.094665529,-3115.9780334
976.670490499,-1602.11351073,2060.98150928
4548.61180272,-2491.55854557,3454.44413445
9353.64342511,6436.8836371,9604.76544048
-7975.50670573,-2700.74276437,-6955.00673186
-4033.90601545,-8228.79384264,-3588.17702137
-3190.92045296,-8495.63703467,-2565.06066512
1379.84290658,-6397.5109894,2138.90033406
