   6338.7382279359290     
   0.0000000000000000        3.5789473684210522E-004   7.1578947368421044E-004   1.0736842105263157E-003   1.4315789473684209E-003   1.7894736842105261E-003   2.1473684210526313E-003   2.5052631578947365E-003   2.8631578947368418E-003   3.2210526315789474E-003   3.5789473684210522E-003   3.9368421052631579E-003   4.2947368421052626E-003   4.6526315789473683E-003   5.0105263157894731E-003   5.3684210526315787E-003   5.7263157894736835E-003   6.0842105263157892E-003   6.4421052631578948E-003   6.7999999999999996E-003
   0.0000000000000000        3.8947368421052633E-004   7.7894736842105267E-004   1.1684210526315790E-003   1.5578947368421053E-003   1.9473684210526319E-003   2.3368421052631580E-003   2.7263157894736843E-003   3.1157894736842107E-003   3.5052631578947370E-003   3.8947368421052638E-003   4.2842105263157897E-003   4.6736842105263160E-003   5.0631578947368423E-003   5.4526315789473687E-003   5.8421052631578950E-003   6.2315789473684213E-003   6.6210526315789468E-003   7.0105263157894740E-003   7.4000000000000003E-003
   0.0000000000000000        4.4210526315789471E-004   8.8421052631578942E-004   1.3263157894736841E-003   1.7684210526315788E-003   2.2105263157894735E-003   2.6526315789473683E-003   3.0947368421052630E-003   3.5368421052631577E-003   3.9789473684210524E-003   4.4210526315789471E-003   4.8631578947368418E-003   5.3052631578947365E-003   5.7473684210526312E-003   6.1894736842105259E-003   6.6315789473684215E-003   7.0736842105263154E-003   7.5157894736842092E-003   7.9578947368421048E-003   8.3999999999999995E-003
   226132.61222839355        232293.44361590169        238953.75656312835        246089.31923473615        253789.29138468264        262152.90003657457        271228.77066049958        281199.68249161937        292139.32725537638        304338.70789861353        318007.01693239639        333499.86457612331        351334.57240234595        372171.16457280901        397165.82890287985        428280.72078194749        469374.25912680989        511841.99701822258        585493.63857815159        791572.95041081763     
   205412.64533996582        211008.97512332039        216958.60453144371        223385.73131377427        230269.01762318902        237747.93604773679        245922.32388547581        254787.37458387835        264578.23968886497        275437.84043636365        287595.16903298977        301315.56357957772        317034.81293303252        335346.85718109249        357110.40211859596        380626.25675830460        413162.40644486534        454968.13123591460        518866.18192157673        650011.48530032649     
   385896.21543884277        396478.56468002032        407822.80541888112        419976.82352676208        433142.60326200584        447442.55365429935        462959.86539200938        480006.73493009596        498766.32507898443        519623.86551224010        543022.77482236514        569478.06879213685        600000.03027262050        635637.75647026603        678383.30535765353        724568.37406010518        789586.63272025040        874576.86577700300        1010855.2680877948        1582251.6714382826     
