 ID,Date,Level(m),SYM
09CD001,2011-01-01,9.9940004,
09CD001,2011-01-02,9.9809999,
09CD001,2011-01-03,9.967,
09CD001,2011-01-04,9.9610004,
09CD001,2011-01-05,9.9650002,
09CD001,2011-01-06,9.9530001,
09CD001,2011-01-07,9.9490004,
09CD001,2011-01-08,9.9399996,
09CD001,2011-01-09,9.941,
09CD001,2011-01-10,9.9259996,
09CD001,2011-01-11,9.9090004,
09CD001,2011-01-12,9.8879995,
09CD001,2011-01-13,9.8669996,
09CD001,2011-01-14,9.8629999,
09CD001,2011-01-15,9.8629999,
09CD001,2011-01-25,9.6400003,A
09CD001,2011-01-26,9.6300001,
09CD001,2011-01-27,9.618,
09CD001,2011-01-28,9.6160002,
09CD001,2011-01-29,9.618,
09CD001,2011-01-30,9.6090002,
09CD001,2011-01-31,9.5959997,
09CD001,2011-02-01,9.5860004,
09CD001,2011-02-02,9.5629997,
09CD001,2011-02-03,9.5389996,
09CD001,2011-02-04,9.5249996,
09CD001,2011-02-05,9.5109997,
09CD001,2011-02-06,9.4890003,
09CD001,2011-02-07,9.4689999,
09CD001,2011-02-08,9.4580002,
09CD001,2011-02-09,9.4460001,
09CD001,2011-02-10,9.4200001,
09CD001,2011-02-11,9.3999996,
09CD001,2011-02-12,9.3839998,
09CD001,2011-02-13,9.3719997,
09CD001,2011-02-14,9.3470001,
09CD001,2011-02-15,9.3280001,
09CD001,2011-02-16,9.309,
09CD001,2011-02-17,9.2919998,
09CD001,2011-02-18,9.2700005,
09CD001,2011-02-19,9.2370005,
09CD001,2011-02-20,9.1859999,
09CD001,2011-02-21,9.1499996,
09CD001,2011-02-22,9.1359997,
09CD001,2011-02-23,9.1280003,
09CD001,2011-02-24,9.1289997,
09CD001,2011-02-25,9.1280003,
09CD001,2011-02-26,9.1149998,
09CD001,2011-02-27,9.1059999,
09CD001,2011-02-28,9.1029997,
09CD001,2011-03-01,9.0970001,
09CD001,2011-03-02,9.0819998,
09CD001,2011-03-03,9.0439997,
09CD001,2011-03-04,9.0380001,
09CD001,2011-03-05,9.0270004,
09CD001,2011-03-06,9.0190001,
09CD001,2011-03-07,9.0150003,
09CD001,2011-03-08,9.0100002,
09CD001,2011-03-09,8.9949999,
09CD001,2011-03-10,8.9890003,
09CD001,2011-03-11,8.9799995,
09CD001,2011-03-12,8.9720001,
09CD001,2011-03-13,8.9639997,
09CD001,2011-03-14,8.9530001,
09CD001,2011-03-15,8.9390001,
09CD001,2011-03-16,8.9250002,
09CD001,2011-03-17,8.9180002,
09CD001,2011-03-18,8.9110003,
09CD001,2011-03-19,8.9060001,
09CD001,2011-03-20,8.901,
09CD001,2011-03-21,8.8999996,
09CD001,2011-03-22,8.8990002,
09CD001,2011-03-23,8.8970003,
09CD001,2011-03-24,8.8979998,
09CD001,2011-03-25,8.8990002,
09CD001,2011-03-26,8.8970003,
09CD001,2011-03-27,8.8959999,
09CD001,2011-03-28,8.8940001,
09CD001,2011-03-29,8.8929996,
09CD001,2011-03-30,8.8909998,
09CD001,2011-03-31,8.8909998,
09CD001,2011-04-01,8.8940001,
09CD001,2011-04-02,8.8979998,
09CD001,2011-04-03,8.901,
09CD001,2011-04-04,8.9069996,
09CD001,2011-04-05,8.908,
09CD001,2011-04-06,8.9169998,
09CD001,2011-04-07,8.927,
09CD001,2011-04-08,8.9280005,
09CD001,2011-04-09,8.9379997,
09CD001,2011-04-10,8.9469995,
09CD001,2011-04-11,8.9540005,
09CD001,2011-04-12,8.9580002,
09CD001,2011-04-13,8.9519997,
09CD001,2011-04-14,8.9589996,
09CD001,2011-04-15,8.9630003,
09CD001,2011-04-16,8.9729996,
09CD001,2011-04-17,8.9860001,
09CD001,2011-04-18,8.9989996,
09CD001,2011-04-19,9.007,
09CD001,2011-04-20,9.0120001,
09CD001,2011-04-21,9.0150003,
09CD001,2011-04-22,9.0150003,
09CD001,2011-04-23,9.0139999,
09CD001,2011-04-24,9.0489998,
09CD001,2011-04-25,9.0699997,
09CD001,2011-04-26,9.1040001,
09CD001,2011-04-27,9.1300001,
09CD001,2011-04-28,9.1549997,
09CD001,2011-04-29,9.1709995,
09CD001,2011-04-30,9.1750002,
09CD001,2011-05-01,9.1809998,
09CD001,2011-05-02,9.2139997,
09CD001,2011-05-03,9.2849998,
09CD001,2011-05-04,9.3120003,
09CD001,2011-05-05,9.3920002,
09CD001,2011-05-06,9.4840002,
09CD001,2011-05-07,9.5799999,
09CD001,2011-05-08,9.7270002,
09CD001,2011-05-09,9.9189997,
09CD001,2011-05-10,9.9239998,
09CD001,2011-05-11,9.7340002,
09CD001,2011-05-12,9.6549997,
09CD001,2011-05-13,9.507,
09CD001,2011-05-14,9.1789999,
09CD001,2011-05-15,8.4580002,
09CD001,2011-05-16,8.4639997,
09CD001,2011-05-17,8.4940004,
09CD001,2011-05-18,8.5749998,
09CD001,2011-05-19,8.7299995,
09CD001,2011-05-20,8.9569998,
09CD001,2011-05-21,9.1739998,
09CD001,2011-05-22,9.3450003,
09CD001,2011-05-23,9.4790001,
09CD001,2011-05-24,9.5760002,
09CD001,2011-05-25,9.6619997,
09CD001,2011-05-26,9.7180004,
09CD001,2011-05-27,9.8129997,
09CD001,2011-05-28,9.8620005,
09CD001,2011-05-29,9.9049997,
09CD001,2011-05-30,9.9250002,
09CD001,2011-05-31,9.908,
09CD001,2011-06-01,9.8959999,
09CD001,2011-06-02,9.9110003,
09CD001,2011-06-03,9.927,
09CD001,2011-06-04,9.9200001,
09CD001,2011-06-05,9.948,
09CD001,2011-06-06,9.9720001,
09CD001,2011-06-07,9.927,
09CD001,2011-06-08,9.8269997,
09CD001,2011-06-09,9.7519999,
09CD001,2011-06-10,9.7180004,
09CD001,2011-06-11,9.6990004,
09CD001,2011-06-12,9.7010002,
09CD001,2011-06-13,9.7110004,
09CD001,2011-06-14,9.7449999,
09CD001,2011-06-15,9.7390003,
09CD001,2011-06-16,9.6920004,
09CD001,2011-06-17,9.6499996,
09CD001,2011-06-18,9.5880003,
09CD001,2011-06-19,9.5270004,
09CD001,2011-06-20,9.493,
09CD001,2011-06-21,9.493,
09CD001,2011-06-22,9.5419998,
09CD001,2011-06-23,9.6490002,
09CD001,2011-06-24,9.6920004,
09CD001,2011-06-25,9.7119999,
09CD001,2011-06-26,9.7069998,
09CD001,2011-06-27,9.7250004,
09CD001,2011-06-28,9.7349997,
09CD001,2011-06-29,9.724,
09CD001,2011-06-30,9.7460003,
09CD001,2011-07-01,9.8050003,
09CD001,2011-07-02,9.8079996,
09CD001,2011-07-03,9.7620001,
09CD001,2011-07-04,9.7559996,
09CD001,2011-07-05,9.7729998,
09CD001,2011-07-06,9.757,
09CD001,2011-07-07,9.7229996,
09CD001,2011-07-08,9.7119999,
09CD001,2011-07-09,9.6890001,
09CD001,2011-07-10,9.6379995,
09CD001,2011-07-11,9.5810003,
09CD001,2011-07-12,9.5279999,
09CD001,2011-07-13,9.4870005,
09CD001,2011-07-14,9.4569998,
09CD001,2011-07-15,9.4399996,
09CD001,2011-07-16,9.4700003,
09CD001,2011-07-17,9.4359999,
09CD001,2011-07-18,9.415,
09CD001,2011-07-19,9.427,
09CD001,2011-07-20,9.4799995,
09CD001,2011-07-21,9.533,
09CD001,2011-07-23,9.5469999,
09CD001,2011-07-24,9.5249996,
09CD001,2011-07-25,9.4980001,
09CD001,2011-07-26,9.4650002,
09CD001,2011-07-27,9.4309998,
09CD001,2011-07-28,9.4160004,
09CD001,2011-07-29,9.4189997,
09CD001,2011-07-30,9.4060001,
09CD001,2011-07-31,9.3999996,
09CD001,2011-08-01,9.4309998,
09CD001,2011-08-02,9.4729996,
09CD001,2011-08-03,9.4560003,
09CD001,2011-08-04,9.4090004,
09CD001,2011-08-05,9.3690004,
09CD001,2011-08-06,9.3839998,
09CD001,2011-08-07,9.3920002,
09CD001,2011-08-08,9.3439999,
09CD001,2011-08-09,9.3190002,
09CD001,2011-08-10,9.2849998,
09CD001,2011-08-11,9.2460003,
09CD001,2011-08-12,9.2130003,
09CD001,2011-08-13,9.1879997,
09CD001,2011-08-14,9.1929998,
09CD001,2011-08-15,9.2379999,
09CD001,2011-08-16,9.2729998,
09CD001,2011-08-17,9.2910004,
09CD001,2011-08-18,9.2980003,
09CD001,2011-08-19,9.3000002,
09CD001,2011-08-20,9.3059998,
09CD001,2011-08-21,9.3140001,
09CD001,2011-08-22,9.335,
09CD001,2011-08-23,9.3610001,
09CD001,2011-08-24,9.3699999,
09CD001,2011-08-25,9.3870001,
09CD001,2011-08-26,9.4049997,
09CD001,2011-08-27,9.4180002,
09CD001,2011-08-28,9.4099998,
09CD001,2011-08-29,9.3909998,
09CD001,2011-08-30,9.3669996,
09CD001,2011-08-31,9.3439999,
09CD001,2011-09-01,9.3219995,
09CD001,2011-09-02,9.3070002,
09CD001,2011-09-03,9.2939997,
09CD001,2011-09-04,9.2749996,
09CD001,2011-09-05,9.2609997,
09CD001,2011-09-06,9.2489996,
09CD001,2011-09-07,9.2379999,
09CD001,2011-09-08,9.2270002,
09CD001,2011-09-09,9.2250004,
09CD001,2011-09-10,9.2250004,
09CD001,2011-09-11,9.2279997,
09CD001,2011-09-12,9.2550001,
09CD001,2011-09-13,9.2609997,
09CD001,2011-09-14,9.2550001,
09CD001,2011-09-15,9.2580004,
09CD001,2011-09-16,9.2559996,
09CD001,2011-09-17,9.2449999,
09CD001,2011-09-18,9.2290001,
09CD001,2011-09-19,9.2130003,
09CD001,2011-09-20,9.2019997,
09CD001,2011-09-21,9.1879997,
09CD001,2011-09-22,9.1800003,
09CD001,2011-09-23,9.1700001,
09CD001,2011-09-24,9.165,
09CD001,2011-09-25,9.1639996,
09CD001,2011-09-26,9.1549997,
09CD001,2011-09-27,9.1599998,
09CD001,2011-09-28,9.158,
09CD001,2011-09-29,9.1529999,
09CD001,2011-09-30,9.1459999,
09CD001,2011-10-01,9.1379995,
09CD001,2011-10-02,9.1219997,
09CD001,2011-10-03,9.1009998,
09CD001,2011-10-04,9.0819998,
09CD001,2011-10-05,9.0600004,
09CD001,2011-10-06,9.0349998,
09CD001,2011-10-07,9.0129995,
09CD001,2011-10-08,8.9949999,
09CD001,2011-10-09,8.9720001,
09CD001,2011-10-10,8.9499998,
09CD001,2011-10-11,8.9239998,
09CD001,2011-10-12,8.8999996,
09CD001,2011-10-13,8.8789997,
09CD001,2011-10-14,8.8549995,
09CD001,2011-10-15,8.8319998,
09CD001,2011-10-16,8.8100004,
09CD001,2011-10-17,8.7910004,
09CD001,2011-10-18,8.776,
09CD001,2011-10-19,8.7639999,
09CD001,2011-10-20,8.7410002,
09CD001,2011-10-21,8.7180004,
09CD001,2011-10-22,8.6820002,
09CD001,2011-10-23,8.665,
09CD001,2011-10-24,8.6370001,
09CD001,2011-10-25,8.625,
09CD001,2011-10-26,8.6210003,
09CD001,2011-10-27,8.618,
09CD001,2011-10-28,8.592,
09CD001,2011-10-29,8.5749998,
09CD001,2011-10-30,8.5570002,
09CD001,2011-10-31,8.5459995,
09CD001,2011-11-01,8.5380001,
09CD001,2011-11-02,8.5699997,
09CD001,2011-11-03,8.5900002,
09CD001,2011-11-04,8.4519997,
09CD001,2011-11-05,8.4250002,
09CD001,2011-11-06,8.3979998,
09CD001,2011-11-07,8.3319998,
09CD001,2011-11-08,8.3640003,
09CD001,2011-11-09,8.3850002,
09CD001,2011-11-10,8.3509998,
09CD001,2011-11-11,8.302,
09CD001,2011-11-12,8.2770004,
09CD001,2011-11-13,8.3470001,
09CD001,2011-11-14,9.5249996,
09CD001,2011-11-15,10.071,
09CD001,2011-11-16,10.051,
09CD001,2011-11-17,10.039,
09CD001,2011-11-18,9.8950005,
09CD001,2011-11-19,9.8959999,
09CD001,2011-11-20,9.9420004,
09CD001,2011-11-21,9.9650002,
09CD001,2011-11-22,9.8640003,
09CD001,2011-11-23,9.8079996,
09CD001,2011-11-24,9.7950001,
09CD001,2011-11-25,9.8830004,
09CD001,2011-11-26,10.082,
09CD001,2011-11-27,10.172,
09CD001,2011-11-28,10.22,
09CD001,2011-11-29,10.192,
09CD001,2011-11-30,10.171,
09CD001,2011-12-01,10.191,
09CD001,2011-12-02,10.188,
09CD001,2011-12-03,10.209,
09CD001,2011-12-04,10.225,
09CD001,2011-12-05,10.251,
09CD001,2011-12-06,10.229,
09CD001,2011-12-07,10.219,
09CD001,2011-12-08,10.204,
09CD001,2011-12-09,10.211,
09CD001,2011-12-10,10.17,
09CD001,2011-12-11,10.126,
09CD001,2011-12-12,10.078,
09CD001,2011-12-13,9.9989996,
09CD001,2011-12-14,9.8669996,
09CD001,2011-12-15,9.8319998,
09CD001,2011-12-16,9.8660002,
09CD001,2011-12-17,9.9829998,
09CD001,2011-12-18,10.014,
09CD001,2011-12-19,10.015,
09CD001,2011-12-20,10.022,
09CD001,2011-12-21,9.9829998,
09CD001,2011-12-22,9.9390001,
09CD001,2011-12-23,9.9379997,
09CD001,2011-12-24,9.8859997,
09CD001,2011-12-25,9.8640003,
09CD001,2011-12-26,9.8549995,
09CD001,2011-12-27,9.8520002,
09CD001,2011-12-28,9.816,
09CD001,2011-12-29,9.7810001,
09CD001,2011-12-30,9.7379999,
09CD001,2011-12-31,9.7139997,
09CD001,2012-01-01,9.6879997,
09CD001,2012-01-02,9.6669998,
09CD001,2012-01-03,9.6219997,
09CD001,2012-01-04,9.6040001,
09CD001,2012-01-05,9.5819998,
09CD001,2012-01-06,9.585,
09CD001,2012-01-07,9.5620003,
09CD001,2012-01-08,9.5620003,
09CD001,2012-01-09,9.5640001,
09CD001,2012-01-10,9.5380001,
09CD001,2012-01-11,9.5279999,
09CD001,2012-01-12,9.5129995,
09CD001,2012-01-13,9.5,
09CD001,2012-01-14,9.4619999,
09CD001,2012-01-15,9.4320002,
09CD001,2012-01-16,9.4119997,
09CD001,2012-01-17,9.3859997,
09CD001,2012-01-18,9.3570004,
09CD001,2012-01-19,9.3219995,
09CD001,2012-01-20,9.2779999,
09CD001,2012-01-21,9.2370005,
09CD001,2012-01-22,9.2139997,
09CD001,2012-01-23,9.2089996,
09CD001,2012-01-24,9.1999998,
09CD001,2012-01-25,9.1929998,
09CD001,2012-01-26,9.1780005,
09CD001,2012-01-27,9.165,
09CD001,2012-01-28,9.1590004,
09CD001,2012-01-29,9.1599998,
09CD001,2012-01-30,9.1599998,
09CD001,2012-01-31,9.1560001,
09CD001,2012-02-01,9.1470003,
09CD001,2012-02-02,9.1470003,
09CD001,2012-02-03,9.1470003,
09CD001,2012-02-04,9.1440001,
09CD001,2012-02-05,9.1359997,
09CD001,2012-02-06,9.1370001,
09CD001,2012-02-07,9.1389999,
09CD001,2012-02-08,9.1389999,
09CD001,2012-02-09,9.1400003,
09CD001,2012-02-10,9.1389999,
09CD001,2012-02-11,9.1359997,
09CD001,2012-02-12,9.132,
09CD001,2012-02-13,9.1300001,
09CD001,2012-02-14,9.1330004,
09CD001,2012-02-15,9.1339998,
09CD001,2012-02-16,9.1309996,
09CD001,2012-02-17,9.1289997,
09CD001,2012-02-18,9.1260004,
09CD001,2012-02-19,9.1190004,
09CD001,2012-02-20,9.118,
09CD001,2012-02-21,9.1190004,
09CD001,2012-02-22,9.1140003,
09CD001,2012-02-23,9.1049995,
09CD001,2012-02-24,9.0950003,
09CD001,2012-02-25,9.0930004,
09CD001,2012-02-26,9.0900002,
09CD001,2012-02-27,9.0869999,
09CD001,2012-02-28,9.0749998,
09CD001,2012-02-29,9.073,
09CD001,2012-03-01,9.0679998,
09CD001,2012-03-02,9.0640001,
09CD001,2012-03-03,9.0570002,
09CD001,2012-03-04,9.0559998,
09CD001,2012-03-05,9.0550003,
09CD001,2012-03-06,9.0600004,
09CD001,2012-03-07,9.0579996,
09CD001,2012-03-08,9.0550003,
09CD001,2012-03-09,9.0570002,
09CD001,2012-03-10,9.052,
09CD001,2012-03-11,9.0489998,
09CD001,2012-03-12,9.0469999,
09CD001,2012-03-13,9.0469999,
09CD001,2012-03-14,9.0450001,
09CD001,2012-03-15,9.0450001,
09CD001,2012-03-16,9.0450001,
09CD001,2012-03-17,9.04,
09CD001,2012-03-18,9.0369997,
09CD001,2012-03-19,9.0349998,
09CD001,2012-03-20,9.0369997,
09CD001,2012-03-21,9.0360003,
09CD001,2012-03-22,9.0369997,
09CD001,2012-03-23,9.0349998,
09CD001,2012-03-24,9.0299997,
09CD001,2012-03-25,9.0240002,
09CD001,2012-03-26,9.026,
09CD001,2012-03-27,9.0209999,
09CD001,2012-03-28,9.0229998,
09CD001,2012-03-29,9.0220003,
09CD001,2012-03-30,9.0209999,
09CD001,2012-03-31,9.0200005,
09CD001,2012-04-01,9.0190001,
09CD001,2012-04-02,9.0200005,
09CD001,2012-04-03,9.0170002,
09CD001,2012-04-04,9.0179996,
09CD001,2012-04-05,9.0209999,
09CD001,2012-04-06,9.0200005,
09CD001,2012-04-07,9.0179996,
09CD001,2012-04-08,9.0190001,
09CD001,2012-04-09,9.0249996,
09CD001,2012-04-10,9.0360003,
09CD001,2012-04-11,9.0430002,
09CD001,2012-04-12,9.0439997,
09CD001,2012-04-13,9.0620003,
09CD001,2012-04-14,9.0790005,
09CD001,2012-04-15,9.0979996,
09CD001,2012-04-16,9.125,
09CD001,2012-04-17,9.1599998,
09CD001,2012-04-18,9.1899996,
09CD001,2012-04-19,9.2250004,
09CD001,2012-04-20,9.257,
09CD001,2012-04-21,9.2770004,
09CD001,2012-04-22,9.2700005,
09CD001,2012-04-23,9.2910004,
09CD001,2012-04-24,9.3249998,
09CD001,2012-04-25,9.3610001,
09CD001,2012-04-26,9.4069996,
09CD001,2012-04-27,9.4230003,
09CD001,2012-04-28,9.4209995,
09CD001,2012-04-29,9.4130001,
09CD001,2012-04-30,9.4949999,
09CD001,2012-05-01,9.5749998,
09CD001,2012-05-02,9.6660004,
09CD001,2012-05-03,9.8009996,
09CD001,2012-05-04,9.9280005,
09CD001,2012-05-05,9.882,E
09CD001,2012-05-06,9.8640003,E
09CD001,2012-05-07,9.8629999,E
09CD001,2012-05-08,10.13,E
09CD001,2012-05-09,10.159,E
09CD001,2012-05-10,8.6210003,A
09CD001,2012-05-11,8.6300001,
09CD001,2012-05-12,8.4829998,
09CD001,2012-05-13,8.4300003,
09CD001,2012-05-14,8.4379997,
09CD001,2012-05-15,8.4320002,
09CD001,2012-05-16,8.434,
09CD001,2012-05-17,8.4449997,
09CD001,2012-05-18,8.4619999,
09CD001,2012-05-19,8.4759998,E
09CD001,2012-05-20,8.4919996,
09CD001,2012-05-21,8.5019999,
09CD001,2012-05-22,8.5229998,
09CD001,2012-05-23,8.5670004,
09CD001,2012-05-24,8.6470003,
09CD001,2012-05-25,8.7740002,
09CD001,2012-05-26,8.9580002,
09CD001,2012-05-27,9.0950003,
09CD001,2012-05-28,9.1999998,
09CD001,2012-05-29,9.2860003,
09CD001,2012-05-30,9.3599997,
09CD001,2012-05-31,9.4209995,
09CD001,2012-06-01,9.4799995,
09CD001,2012-06-02,9.5200005,
09CD001,2012-06-03,9.5480003,
09CD001,2012-06-04,9.5679998,
09CD001,2012-06-05,9.5860004,
09CD001,2012-06-06,9.6079998,
09CD001,2012-06-07,9.6569996,
09CD001,2012-06-08,9.743,
09CD001,2012-06-09,9.8719997,
09CD001,2012-06-10,10.037,
09CD001,2012-06-11,10.184,
09CD001,2012-06-12,10.272,
09CD001,2012-06-13,10.36,
09CD001,2012-06-14,10.451,
09CD001,2012-06-15,10.519,
09CD001,2012-06-16,10.541,E
09CD001,2012-06-17,10.529,
09CD001,2012-06-18,10.516,
09CD001,2012-06-19,10.498,
09CD001,2012-06-20,10.438,
09CD001,2012-06-21,10.377,
09CD001,2012-06-22,10.335,
09CD001,2012-06-23,10.318,E
09CD001,2012-06-24,10.303,
09CD001,2012-06-25,10.297,
09CD001,2012-06-26,10.285,
09CD001,2012-06-27,10.273,
09CD001,2012-06-28,10.242,
09CD001,2012-06-29,10.199,
09CD001,2012-06-30,10.159,
09CD001,2012-07-01,10.14,
09CD001,2012-07-02,10.119,
09CD001,2012-07-03,10.101,
09CD001,2012-07-04,10.119,
09CD001,2012-07-05,10.191,
09CD001,2012-07-06,10.257,
09CD001,2012-07-07,10.26,
09CD001,2012-07-08,10.212,
09CD001,2012-07-09,10.148,
09CD001,2012-07-10,10.077,
09CD001,2012-07-11,10.047,
09CD001,2012-07-12,10.047,
09CD001,2012-07-13,10.081,
09CD001,2012-07-14,10.126,
09CD001,2012-07-15,10.138,
09CD001,2012-07-16,10.145,
09CD001,2012-07-17,10.131,
09CD001,2012-07-18,10.089,
09CD001,2012-07-19,10.052,
09CD001,2012-07-20,10.02,
09CD001,2012-07-21,9.9919996,
09CD001,2012-07-22,9.9779997,
09CD001,2012-07-23,9.9370003,
09CD001,2012-07-24,9.8780003,
09CD001,2012-07-25,9.8219995,
09CD001,2012-07-26,9.776,
09CD001,2012-07-27,9.7290001,
09CD001,2012-07-28,9.6820002,
09CD001,2012-07-29,9.6429996,
09CD001,2012-07-30,9.6129999,
09CD001,2012-07-31,9.5839996,
09CD001,2012-08-01,9.5559998,
09CD001,2012-08-02,9.5220003,
09CD001,2012-08-03,9.4890003,
09CD001,2012-08-04,9.4619999,
09CD001,2012-08-05,9.4320002,
09CD001,2012-08-06,9.4060001,
09CD001,2012-08-07,9.3769999,
09CD001,2012-08-08,9.3540001,
09CD001,2012-08-09,9.335,
09CD001,2012-08-10,9.3319998,
09CD001,2012-08-11,9.3540001,
09CD001,2012-08-12,9.3909998,
09CD001,2012-08-13,9.3970003,
09CD001,2012-08-14,9.4200001,
09CD001,2012-08-15,9.4549999,
09CD001,2012-08-16,9.4510002,
09CD001,2012-08-17,9.4250002,
09CD001,2012-08-18,9.3950005,
09CD001,2012-08-19,9.3699999,
09CD001,2012-08-20,9.3450003,
09CD001,2012-08-21,9.3249998,
09CD001,2012-08-22,9.2969999,
09CD001,2012-08-23,9.2709999,
09CD001,2012-08-24,9.2460003,
09CD001,2012-08-25,9.2299995,
09CD001,2012-08-26,9.217,
09CD001,2012-08-27,9.2089996,
09CD001,2012-08-28,9.2229996,
09CD001,2012-08-29,9.2329998,
09CD001,2012-08-30,9.2480001,
09CD001,2012-08-31,9.2530003,
09CD001,2012-09-01,9.2250004,
09CD001,2012-09-02,9.2069998,
09CD001,2012-09-03,9.1899996,
09CD001,2012-09-04,9.1750002,
09CD001,2012-09-05,9.1639996,
09CD001,2012-09-06,9.1499996,
09CD001,2012-09-07,9.1429996,
09CD001,2012-09-08,9.1210003,
09CD001,2012-09-09,9.1129999,
09CD001,2012-09-10,9.125,
09CD001,2012-09-11,9.1370001,
09CD001,2012-09-12,9.1560001,
09CD001,2012-09-13,9.151,
09CD001,2012-09-14,9.1529999,
09CD001,2012-09-15,9.1750002,
09CD001,2012-09-16,9.1949997,
09CD001,2012-09-17,9.2040005,
09CD001,2012-09-18,9.2139997,
09CD001,2012-09-19,9.2119999,
09CD001,2012-09-20,9.1990004,
09CD001,2012-09-21,9.191,
09CD001,2012-09-22,9.184,
09CD001,2012-09-23,9.1719999,
09CD001,2012-09-24,9.1549997,
09CD001,2012-09-25,9.1440001,
09CD001,2012-09-26,9.132,
09CD001,2012-09-27,9.1169996,
09CD001,2012-09-28,9.1099997,
09CD001,2012-09-29,9.1020002,
09CD001,2012-09-30,9.1020002,
09CD001,2012-10-01,9.0819998,
09CD001,2012-10-02,9.0629997,
09CD001,2012-10-03,9.0430002,
09CD001,2012-10-04,9.0249996,
09CD001,2012-10-05,9.0100002,
09CD001,2012-10-06,8.9949999,
09CD001,2012-10-07,8.9790001,
09CD001,2012-10-08,8.9639997,
09CD001,2012-10-09,8.9549999,
09CD001,2012-10-10,8.9379997,
09CD001,2012-10-11,8.9160004,
09CD001,2012-10-12,8.8920002,
09CD001,2012-10-13,8.8719997,
09CD001,2012-10-14,8.8479996,
09CD001,2012-10-15,8.8339996,
09CD001,2012-10-16,8.823,
09CD001,2012-10-17,8.8079996,
09CD001,2012-10-18,8.7919998,
09CD001,2012-10-19,8.7810001,
09CD001,2012-10-20,8.757,
09CD001,2012-10-21,8.7200003,
09CD001,2012-10-22,8.7980003,A
09CD001,2012-11-24,10.157,A
09CD001,2013-02-02,9.2019997,A
09CD001,2013-04-11,9.0430002,A
09CD001,2013-04-12,9.0380001,
09CD001,2013-04-13,9.033,
09CD001,2013-04-14,9.0209999,
09CD001,2013-04-15,9.0190001,
09CD001,2013-04-16,9.0249996,
09CD001,2013-04-17,9.0270004,
09CD001,2013-04-18,9.0279999,
09CD001,2013-04-19,9.0249996,
09CD001,2013-04-20,9.0240002,
09CD001,2013-04-21,9.026,
09CD001,2013-04-22,9.0290003,
09CD001,2013-04-23,9.0319996,
09CD001,2013-04-24,9.0360003,
09CD001,2013-04-25,9.0389996,
09CD001,2013-04-26,9.04,
09CD001,2013-04-27,9.0480003,
09CD001,2013-04-28,9.0539999,
09CD001,2013-04-29,9.0539999,
09CD001,2013-04-30,9.0550003,
09CD001,2013-05-01,9.0570002,
09CD001,2013-05-02,9.052,
09CD001,2013-05-03,9.059,
09CD001,2013-05-04,9.0900002,
09CD001,2013-05-05,9.1409998,
09CD001,2013-05-06,9.1990004,
09CD001,2013-05-07,9.2469997,
09CD001,2013-05-08,9.2690001,
09CD001,2013-05-09,9.3109999,
09CD001,2013-05-10,9.3669996,
09CD001,2013-05-11,9.4300003,
09CD001,2013-05-12,9.5950003,
09CD001,2013-05-13,9.901,
09CD001,2013-05-14,10.207,
09CD001,2013-05-15,10.398,
09CD001,2013-05-16,10.635,
09CD001,2013-05-17,11.028,E
09CD001,2013-05-22,9.8269997,A
09CD001,2013-05-23,9.7659998,
09CD001,2013-05-24,9.618,
09CD001,2013-05-25,9.5240002,
09CD001,2013-05-26,9.5290003,
09CD001,2013-05-27,9.6370001,
09CD001,2013-05-28,9.8369999,
09CD001,2013-05-29,10.071,
09CD001,2013-05-30,10.271,
09CD001,2013-05-31,10.437,
09CD001,2013-06-01,10.576,
09CD001,2013-06-02,10.74,
09CD001,2013-06-03,10.875,
09CD001,2013-06-04,10.964,
09CD001,2013-06-05,10.982,
09CD001,2013-06-06,10.956,
09CD001,2013-06-07,10.837,
09CD001,2013-06-08,10.724,
09CD001,2013-06-09,10.594,
09CD001,2013-06-10,10.442,
09CD001,2013-06-11,10.346,
09CD001,2013-06-12,10.293,
09CD001,2013-06-13,10.271,
09CD001,2013-06-14,10.315,
09CD001,2013-06-15,10.288,
09CD001,2013-06-16,10.255,
09CD001,2013-06-17,10.232,
09CD001,2013-06-18,10.22,
09CD001,2013-06-19,10.212,
09CD001,2013-06-20,10.167,
09CD001,2013-06-21,10.117,
09CD001,2013-06-22,10.085,
09CD001,2013-06-23,10.053,
09CD001,2013-06-24,10.02,
09CD001,2013-06-25,9.9770002,
09CD001,2013-06-26,9.9399996,
09CD001,2013-06-27,9.9119997,
09CD001,2013-06-28,9.901,
09CD001,2013-06-29,9.9049997,
09CD001,2013-06-30,9.9049997,
09CD001,2013-07-01,9.8710003,
09CD001,2013-07-02,9.8360004,
09CD001,2013-07-03,9.8140001,
09CD001,2013-07-04,9.8190002,
09CD001,2013-07-05,9.783,
09CD001,2013-07-06,9.7349997,
09CD001,2013-07-07,9.6920004,
09CD001,2013-07-08,9.651,
09CD001,2013-07-09,9.6289997,
09CD001,2013-07-10,9.6260004,
09CD001,2013-07-11,9.592,
09CD001,2013-07-12,9.5349998,
09CD001,2013-07-13,9.4879999,
09CD001,2013-07-14,9.4530001,
09CD001,2013-07-15,9.4320002,
09CD001,2013-07-16,9.4090004,
09CD001,2013-07-17,9.382,
09CD001,2013-07-18,9.3529997,
09CD001,2013-07-19,9.3249998,
09CD001,2013-07-20,9.309,
09CD001,2013-07-21,9.3170004,
09CD001,2013-07-22,9.3620005,
09CD001,2013-07-23,9.4189997,
09CD001,2013-07-24,9.4519997,
09CD001,2013-07-25,9.4589996,
09CD001,2013-07-26,9.5270004,
09CD001,2013-07-27,9.5640001,
09CD001,2013-07-28,9.5050001,
09CD001,2013-07-29,9.4499998,
09CD001,2013-07-30,9.408,
09CD001,2013-07-31,9.3699999,
09CD001,2013-08-01,9.3479996,
09CD001,2013-08-02,9.3219995,
09CD001,2013-08-03,9.302,
09CD001,2013-08-04,9.2849998,
09CD001,2013-08-05,9.2639999,
09CD001,2013-08-06,9.2410002,
09CD001,2013-08-07,9.2189999,
09CD001,2013-08-08,9.1969995,
09CD001,2013-08-09,9.177,
09CD001,2013-08-10,9.1560001,
09CD001,2013-08-11,9.1400003,
09CD001,2013-08-12,9.1280003,
09CD001,2013-08-13,9.1099997,
09CD001,2013-08-14,9.0939999,
09CD001,2013-08-15,9.0799999,
09CD001,2013-08-16,9.0649996,
09CD001,2013-08-17,9.0559998,
09CD001,2013-08-18,9.0430002,
09CD001,2013-08-19,9.0369997,
09CD001,2013-08-20,9.0419998,
09CD001,2013-08-21,9.0340004,
09CD001,2013-08-22,9.0310001,
09CD001,2013-08-23,9.0389996,
09CD001,2013-08-24,9.0889997,
09CD001,2013-08-25,9.1470003,
09CD001,2013-08-26,9.1660004,
09CD001,2013-08-27,9.1949997,
09CD001,2013-08-28,9.2030001,
09CD001,2013-08-29,9.2270002,
09CD001,2013-08-30,9.2460003,
09CD001,2013-08-31,9.2810001,
09CD001,2013-09-01,9.3129997,
09CD001,2013-09-02,9.3079996,
09CD001,2013-09-03,9.3030005,
09CD001,2013-09-04,9.3260002,
09CD001,2013-09-05,9.3149996,
09CD001,2013-09-06,9.3030005,
09CD001,2013-09-07,9.283,
09CD001,2013-09-08,9.257,
09CD001,2013-09-09,9.2370005,
09CD001,2013-09-10,9.2189999,
09CD001,2013-09-11,9.2060003,
09CD001,2013-09-12,9.1829996,
09CD001,2013-09-13,9.1669998,
09CD001,2013-09-14,9.1660004,
09CD001,2013-09-15,9.1560001,
09CD001,2013-09-16,9.1409998,
09CD001,2013-09-17,9.1409998,
09CD001,2013-09-18,9.1350002,
09CD001,2013-09-19,9.1409998,
09CD001,2013-09-20,9.1610003,
09CD001,2013-09-21,9.1700001,
09CD001,2013-09-22,9.184,
09CD001,2013-09-23,9.2279997,
09CD001,2013-09-24,9.2729998,
09CD001,2013-09-25,9.2860003,
09CD001,2013-09-26,9.2959995,
09CD001,2013-09-27,9.3039999,
09CD001,2013-09-28,9.3059998,
09CD001,2013-09-29,9.2860003,
09CD001,2013-09-30,9.2600002,
09CD001,2013-10-01,9.2320004,
09CD001,2013-10-02,9.2060003,
09CD001,2013-10-03,9.1820002,
09CD001,2013-10-04,9.1619997,
09CD001,2013-10-05,9.1429996,
09CD001,2013-10-06,9.1260004,
09CD001,2013-10-07,9.1110001,
09CD001,2013-10-08,9.0930004,
09CD001,2013-10-09,9.0760002,
09CD001,2013-10-10,9.0640001,
09CD001,2013-10-11,9.0550003,
09CD001,2013-10-12,9.0419998,
09CD001,2013-10-13,9.0179996,
09CD001,2013-10-14,8.9980001,
09CD001,2013-10-15,8.9809999,
09CD001,2013-10-16,8.967,
09CD001,2013-10-17,8.9490004,
09CD001,2013-10-18,8.9280005,
09CD001,2013-10-19,8.9090004,
09CD001,2013-10-20,8.8909998,
09CD001,2013-10-21,8.8719997,
09CD001,2013-10-22,8.849,
09CD001,2013-10-23,8.823,
09CD001,2013-10-24,8.7939997,
09CD001,2013-10-25,8.7620001,
09CD001,2013-10-26,8.7449999,
09CD001,2013-10-27,8.7290001,
09CD001,2013-10-28,8.7139997,
09CD001,2013-10-29,8.7110004,
09CD001,2013-10-30,8.6920004,
09CD001,2013-10-31,8.6820002,
09CD001,2013-11-01,8.6929998,
09CD001,2013-11-02,8.6750002,
09CD001,2013-11-03,8.6599998,
09CD001,2013-11-04,8.6099997,
09CD001,2013-11-05,8.5570002,
09CD001,2013-11-06,8.5319996,
09CD001,2013-11-07,8.4910002,
09CD001,2013-11-08,8.4069996,
09CD001,2013-11-09,8.1660004,
09CD001,2013-11-10,8.0310001,
09CD001,2013-11-11,7.9629998,
09CD001,2013-11-12,7.9029999,
09CD001,2013-11-13,7.9200001,
09CD001,2013-11-14,7.9299998,
09CD001,2013-11-15,7.9190001,
09CD001,2013-11-16,7.8709998,
09CD001,2013-11-17,7.9000001,
09CD001,2013-11-18,8.007,
09CD001,2013-11-19,8.0509996,A
09CD001,2013-11-27,9.8590002,A
09CD001,2014-01-20,9.3739996,A
09CD001,2014-01-22,9.3620005,A
09CD001,2014-01-23,9.3579998,
09CD001,2014-01-24,9.3629999,
09CD001,2014-01-25,9.3660002,
09CD001,2014-01-26,9.3620005,
09CD001,2014-01-27,9.3450003,
09CD001,2014-01-28,9.3369999,
09CD001,2014-01-29,9.323,
09CD001,2014-01-30,9.3050003,
09CD001,2014-01-31,9.2959995,
09CD001,2014-02-01,9.283,
09CD001,2014-02-02,9.2740002,A
09CD001,2014-02-03,9.2869997,
09CD001,2014-02-04,9.2799997,A
09CD001,2014-02-07,9.2250004,A
09CD001,2014-02-08,9.2089996,A
09CD001,2014-02-16,9.1020002,
09CD001,2014-02-17,9.0900002,A
09CD001,2014-02-18,9.0930004,A
09CD001,2014-02-19,9.0959997,A
09CD001,2014-02-20,9.0959997,A
09CD001,2014-02-21,9.0970001,A
09CD001,2014-02-22,9.0950003,A
09CD001,2014-02-23,9.085,A
09CD001,2014-02-24,9.0819998,A
09CD001,2014-02-25,9.0860004,A
09CD001,2014-02-26,9.0570002,A
09CD001,2014-02-27,9.0439997,A
09CD001,2014-02-28,9.0319996,A
09CD001,2014-03-01,9.0240002,A
09CD001,2014-03-02,9.0159998,A
09CD001,2014-03-03,9.0059996,A
09CD001,2014-03-04,9,A
09CD001,2014-03-05,8.9960003,A
09CD001,2014-03-06,8.9840002,A
09CD001,2014-03-07,8.9770002,A
09CD001,2014-03-08,8.9610004,A
09CD001,2014-03-09,8.9519997,A
09CD001,2014-03-10,8.9399996,A
09CD001,2014-03-11,8.9370003,A
09CD001,2014-03-12,8.9399996,A
09CD001,2014-03-13,8.9379997,A
09CD001,2014-03-14,8.9420004,A
09CD001,2014-03-15,8.9519997,A
09CD001,2014-03-16,8.9510002,
09CD001,2014-03-17,8.9510002,A
09CD001,2014-03-18,8.9490004,A
09CD001,2014-03-19,8.9530001,A
09CD001,2014-03-20,8.9510002,
09CD001,2014-03-21,8.9460001,
09CD001,2014-03-22,8.9429998,A
09CD001,2014-03-23,8.9429998,A
09CD001,2014-03-24,8.9420004,A
09CD001,2014-03-25,8.934,A
09CD001,2014-03-26,8.9359999,A
09CD001,2014-03-27,8.9359999,A
09CD001,2014-03-28,8.9280005,A
09CD001,2014-03-29,8.9209995,A
09CD001,2014-03-30,8.9169998,
09CD001,2014-03-31,8.9110003,
09CD001,2014-04-01,8.9029999,
09CD001,2014-04-02,8.8959999,
09CD001,2014-04-03,8.8900003,
09CD001,2014-04-04,8.8859997,A
09CD001,2014-04-05,8.8789997,
09CD001,2014-04-06,8.8780003,
09CD001,2014-04-07,8.8710003,
09CD001,2014-04-08,8.8699999,
09CD001,2014-04-09,8.875,
09CD001,2014-04-10,8.882,
09CD001,2014-04-11,8.8760004,
09CD001,2014-04-12,8.8850002,
09CD001,2014-04-13,8.8950005,A
09CD001,2014-04-16,8.8959999,A
09CD001,2014-04-17,8.9029999,
09CD001,2014-04-18,8.9189997,
09CD001,2014-04-19,8.9449997,
09CD001,2014-04-20,8.9840002,
09CD001,2014-04-21,9.0129995,
09CD001,2014-04-22,9.0430002,
09CD001,2014-04-23,9.0749998,
09CD001,2014-04-24,9.1040001,A
09CD001,2014-04-25,9.1199999,
09CD001,2014-04-26,9.1339998,
09CD001,2014-04-27,9.1490002,
09CD001,2014-04-28,9.1660004,
09CD001,2014-04-29,9.1949997,
09CD001,2014-04-30,9.2080002,
09CD001,2014-05-01,9.2379999,
09CD001,2014-05-02,9.3050003,
09CD001,2014-05-03,9.2779999,
09CD001,2014-05-04,9.632,
09CD001,2014-05-05,9.8219995,
09CD001,2014-05-06,9.9499998,A
09CD001,2014-05-08,9.0749998,A
09CD001,2014-05-09,9.2030001,A
09CD001,2014-05-10,9.1490002,
09CD001,2014-05-11,9.1940002,
09CD001,2014-05-12,9.217,
09CD001,2014-05-13,9.2609997,
09CD001,2014-05-14,9.3330002,
09CD001,2014-05-15,9.4060001,
09CD001,2014-05-16,9.4720001,
09CD001,2014-05-17,9.507,
09CD001,2014-05-18,9.5220003,
09CD001,2014-05-19,9.526,
09CD001,2014-05-20,9.5480003,
09CD001,2014-05-21,9.6339998,
09CD001,2014-05-22,9.7469997,
09CD001,2014-05-23,9.8470001,
09CD001,2014-05-24,9.901,
09CD001,2014-05-25,9.934,
09CD001,2014-05-26,9.8999996,
09CD001,2014-05-27,9.835,
09CD001,2014-05-28,9.7559996,
09CD001,2014-05-29,9.6879997,
09CD001,2014-05-30,9.6569996,
09CD001,2014-05-31,9.6389999,
09CD001,2014-06-01,9.6400003,
09CD001,2014-06-02,9.665,
09CD001,2014-06-03,9.6630001,
09CD001,2014-06-04,9.6400003,
09CD001,2014-06-05,9.6199999,
09CD001,2014-06-06,9.5900002,
09CD001,2014-06-07,9.5670004,
09CD001,2014-06-08,9.5500002,
09CD001,2014-06-09,9.54,
09CD001,2014-06-10,9.5380001,
09CD001,2014-06-11,9.5410004,
09CD001,2014-06-12,9.5430002,
09CD001,2014-06-13,9.5469999,
09CD001,2014-06-14,9.5749998,
09CD001,2014-06-15,9.6199999,
09CD001,2014-06-16,9.6400003,
09CD001,2014-06-17,9.6339998,
09CD001,2014-06-18,9.6219997,
09CD001,2014-06-19,9.6280003,
09CD001,2014-06-20,9.6239996,
09CD001,2014-06-21,9.5889997,
09CD001,2014-06-22,9.5509996,
09CD001,2014-06-23,9.5389996,
09CD001,2014-06-24,9.5310001,
09CD001,2014-06-25,9.5349998,
09CD001,2014-06-26,9.5769997,
09CD001,2014-06-27,9.6070004,
09CD001,2014-06-28,9.5889997,
09CD001,2014-06-29,9.5900002,
09CD001,2014-06-30,9.599,
09CD001,2014-07-01,9.5810003,
09CD001,2014-07-02,9.5649996,
09CD001,2014-07-03,9.5459995,
09CD001,2014-07-04,9.5120001,
09CD001,2014-07-05,9.4940004,
09CD001,2014-07-06,9.5,
09CD001,2014-07-07,9.5389996,
09CD001,2014-07-08,9.5670004,
09CD001,2014-07-09,9.566,
09CD001,2014-07-10,9.5459995,
09CD001,2014-07-11,9.5310001,
09CD001,2014-07-12,9.5120001,
09CD001,2014-07-13,9.5010004,
09CD001,2014-07-14,9.4899998,
09CD001,2014-07-15,9.4750004,
09CD001,2014-07-16,9.4580002,
09CD001,2014-07-17,9.4379997,
09CD001,2014-07-18,9.4130001,
09CD001,2014-07-19,9.3879995,
09CD001,2014-07-20,9.3800001,
09CD001,2014-07-21,9.3970003,
09CD001,2014-07-22,9.3999996,
09CD001,2014-07-23,9.3599997,
09CD001,2014-07-24,9.3190002,
09CD001,2014-07-25,9.2939997,
09CD001,2014-07-26,9.2790003,
09CD001,2014-07-27,9.2550001,
09CD001,2014-07-28,9.2480001,
09CD001,2014-07-29,9.2419996,
09CD001,2014-07-30,9.2659998,
09CD001,2014-07-31,9.2539997,
09CD001,2014-08-01,9.2489996,
09CD001,2014-08-02,9.276,
09CD001,2014-08-03,9.2600002,
09CD001,2014-08-04,9.2539997,
09CD001,2014-08-05,9.2390003,
09CD001,2014-08-06,9.217,
09CD001,2014-08-07,9.1899996,
09CD001,2014-08-08,9.1639996,
09CD001,2014-08-09,9.1359997,
09CD001,2014-08-10,9.1079998,
09CD001,2014-08-11,9.0889997,
09CD001,2014-08-12,9.0839996,
09CD001,2014-08-13,9.0889997,
09CD001,2014-08-14,9.0780001,
09CD001,2014-08-15,9.066,
09CD001,2014-08-16,9.0509996,
09CD001,2014-08-17,9.0450001,
09CD001,2014-08-18,9.0469999,
09CD001,2014-08-19,9.0469999,
09CD001,2014-08-20,9.052,
09CD001,2014-08-21,9.0679998,
09CD001,2014-08-22,9.0959997,
09CD001,2014-08-23,9.092,
09CD001,2014-08-24,9.0869999,
09CD001,2014-08-25,9.0880003,
09CD001,2014-08-26,9.0869999,
09CD001,2014-08-27,9.0970001,
09CD001,2014-08-28,9.118,
09CD001,2014-08-29,9.1890001,
09CD001,2014-08-30,9.2209997,
09CD001,2014-08-31,9.2139997,
09CD001,2014-09-01,9.2069998,
09CD001,2014-09-02,9.2080002,
09CD001,2014-09-03,9.2080002,
09CD001,2014-09-04,9.1960001,
09CD001,2014-09-05,9.1890001,
09CD001,2014-09-06,9.191,
09CD001,2014-09-07,9.2049999,
09CD001,2014-09-08,9.3009996,
09CD001,2014-09-09,9.3950005,
09CD001,2014-09-10,9.3879995,
09CD001,2014-09-11,9.3699999,
09CD001,2014-09-12,9.3549995,
09CD001,2014-09-13,9.3389997,
09CD001,2014-09-14,9.323,
09CD001,2014-09-15,9.3100004,
09CD001,2014-09-16,9.2980003,
09CD001,2014-09-17,9.2819996,
09CD001,2014-09-18,9.2650003,
09CD001,2014-09-19,9.2489996,
09CD001,2014-09-20,9.2329998,
09CD001,2014-09-21,9.2189999,
09CD001,2014-09-22,9.217,
09CD001,2014-09-23,9.2130003,
09CD001,2014-09-24,9.224,
09CD001,2014-09-25,9.2320004,
09CD001,2014-09-26,9.2220001,
09CD001,2014-09-27,9.21,
09CD001,2014-09-28,9.2220001,
09CD001,2014-09-29,9.2410002,
09CD001,2014-09-30,9.2519999,
09CD001,2014-10-01,9.2790003,
09CD001,2014-10-02,9.2790003,
09CD001,2014-10-03,9.2629995,
09CD001,2014-10-04,9.257,
09CD001,2014-10-05,9.2679996,
09CD001,2014-10-06,9.2749996,
09CD001,2014-10-07,9.2819996,
09CD001,2014-10-08,9.2840004,
09CD001,2014-10-09,9.2670002,
09CD001,2014-10-10,9.257,
09CD001,2014-10-11,9.257,
09CD001,2014-10-12,9.2559996,
09CD001,2014-10-13,9.2550001,
09CD001,2014-10-14,9.2530003,
09CD001,2014-10-15,9.2510004,
09CD001,2014-10-16,9.2539997,
09CD001,2014-10-17,9.2530003,
09CD001,2014-10-18,9.2489996,
09CD001,2014-10-19,9.2379999,
09CD001,2014-10-20,9.2270002,
09CD001,2014-10-21,9.2180004,
09CD001,2014-10-22,9.2040005,
09CD001,2014-10-23,9.1899996,
09CD001,2014-10-24,9.1759996,
09CD001,2014-10-25,9.1599998,
09CD001,2014-10-26,9.1400003,
09CD001,2014-10-27,9.1169996,
09CD001,2014-10-28,9.0900002,
09CD001,2014-10-29,9.0439997,
09CD001,2014-10-30,8.9879999,
09CD001,2014-10-31,8.9580002,
09CD001,2014-11-01,8.9650002,
09CD001,2014-11-02,8.9460001,
09CD001,2014-11-03,8.9219999,
09CD001,2014-11-04,8.8909998,
09CD001,2014-11-05,8.8599997,
09CD001,2014-11-06,8.8310003,
09CD001,2014-11-07,8.9110003,
09CD001,2014-11-08,8.9309998,
09CD001,2014-11-09,8.8240004,
09CD001,2014-11-10,8.6780005,
09CD001,2014-11-11,8.6459999,
09CD001,2014-11-12,8.6070004,
09CD001,2014-11-13,8.7030001,
09CD001,2014-11-14,8.7279997,
09CD001,2014-11-15,8.7200003,
09CD001,2014-11-16,8.6490002,
09CD001,2014-11-17,8.6040001,
09CD001,2014-11-18,8.5869999,
09CD001,2014-11-19,8.6020002,
09CD001,2014-11-20,8.6359997,
09CD001,2014-11-21,8.7130003,
09CD001,2014-11-22,8.7320004,
09CD001,2014-11-23,8.7220001,
09CD001,2014-11-24,9.0109997,
09CD001,2014-11-25,10.906,
09CD001,2014-11-26,11.666,A
09CD001,2015-02-16,9.6630001,A
09CD001,2015-02-17,9.6630001,A
09CD001,2015-02-18,9.6660004,
09CD001,2015-02-19,9.6610003,
09CD001,2015-02-20,9.6540003,
09CD001,2015-02-21,9.6490002,
09CD001,2015-02-22,9.6389999,
09CD001,2015-02-23,9.6269999,
09CD001,2015-02-24,9.6090002,
09CD001,2015-02-25,9.5909996,A
09CD001,2015-02-26,9.5780001,A
09CD001,2015-02-27,9.5679998,A
09CD001,2015-02-28,9.5570002,A
09CD001,2015-03-01,9.5550003,
09CD001,2015-03-02,9.5389996,A
09CD001,2015-04-07,9.4540005,A
09CD001,2015-04-08,9.448,A
09CD001,2015-04-09,9.4610004,
09CD001,2015-04-10,9.4849997,
09CD001,2015-04-11,9.507,
09CD001,2015-04-12,9.5010004,A
09CD001,2015-04-13,9.5129995,
09CD001,2015-04-14,9.5109997,
09CD001,2015-04-15,9.5109997,
09CD001,2015-04-16,9.5,
09CD001,2015-04-17,9.4960003,
09CD001,2015-04-18,9.4960003,
09CD001,2015-04-19,9.5170002,
09CD001,2015-04-20,9.5249996,
09CD001,2015-04-21,9.5340004,
09CD001,2015-04-22,9.5760002,
09CD001,2015-04-23,9.5869999,
09CD001,2015-04-24,9.6230001,
09CD001,2015-04-25,9.658,
09CD001,2015-04-26,9.6569996,
09CD001,2015-04-27,9.6750002,
09CD001,2015-04-28,9.6669998,
09CD001,2015-04-29,9.7049999,
09CD001,2015-04-30,9.7200003,
09CD001,2015-05-01,9.79,
09CD001,2015-05-02,9.8430004,
09CD001,2015-05-03,9.7559996,
09CD001,2015-05-04,9.8190002,
09CD001,2015-05-05,9.9119997,
09CD001,2015-05-06,9.8280001,
09CD001,2015-05-07,9.9029999,
09CD001,2015-05-08,9.8100004,
09CD001,2015-05-09,9.5970001,
09CD001,2015-05-10,8.3889999,
09CD001,2015-05-11,8.2620001,
09CD001,2015-05-12,8.3280001,
09CD001,2015-05-13,8.4020004,
09CD001,2015-05-14,8.5179996,
09CD001,2015-05-15,8.6800003,
09CD001,2015-05-16,8.8850002,
09CD001,2015-05-17,9.092,
09CD001,2015-05-18,9.2629995,
09CD001,2015-05-19,9.408,
09CD001,2015-05-20,9.5249996,
09CD001,2015-05-21,9.6300001,
09CD001,2015-05-22,9.7089996,
09CD001,2015-05-23,9.7620001,
09CD001,2015-05-24,9.8179998,
09CD001,2015-05-25,9.8540001,
09CD001,2015-05-26,9.8800001,
09CD001,2015-05-27,9.9130001,
09CD001,2015-05-28,9.9840002,
09CD001,2015-05-29,9.9949999,
09CD001,2015-05-30,10.012,
09CD001,2015-05-31,9.9750004,
09CD001,2015-06-01,9.9320002,
09CD001,2015-06-02,9.8859997,
09CD001,2015-06-03,9.8409996,
09CD001,2015-06-04,9.8170004,
09CD001,2015-06-05,9.783,
09CD001,2015-06-06,9.7379999,
09CD001,2015-06-07,9.7010002,
09CD001,2015-06-08,9.6739998,
09CD001,2015-06-09,9.6409998,
09CD001,2015-06-10,9.6120005,
09CD001,2015-06-11,9.5900002,
09CD001,2015-06-12,9.552,
09CD001,2015-06-13,9.5179996,
09CD001,2015-06-14,9.4860001,
09CD001,2015-06-15,9.4519997,
09CD001,2015-06-16,9.4239998,
09CD001,2015-06-17,9.4119997,
09CD001,2015-06-18,9.4300003,
09CD001,2015-06-19,9.4320002,
09CD001,2015-06-20,9.4110003,
09CD001,2015-06-21,9.382,
09CD001,2015-06-22,9.3549995,
09CD001,2015-06-23,9.3319998,
09CD001,2015-06-24,9.3129997,
09CD001,2015-06-25,9.3000002,
09CD001,2015-06-26,9.3000002,
09CD001,2015-06-27,9.3369999,
09CD001,2015-06-28,9.3210001,
09CD001,2015-06-29,9.3009996,
09CD001,2015-06-30,9.2690001,
09CD001,2015-07-01,9.2849998,
09CD001,2015-07-02,9.2889996,
09CD001,2015-07-03,9.2819996,
09CD001,2015-07-04,9.2860003,
09CD001,2015-07-05,9.2889996,
09CD001,2015-07-06,9.3669996,
09CD001,2015-07-07,9.3389997,
09CD001,2015-07-08,9.309,
09CD001,2015-07-09,9.2869997,
09CD001,2015-07-10,9.2720003,
09CD001,2015-07-11,9.2729998,
09CD001,2015-07-12,9.3079996,
09CD001,2015-07-13,9.3479996,
09CD001,2015-07-14,9.3470001,
09CD001,2015-07-15,9.3120003,
09CD001,2015-07-16,9.2749996,
09CD001,2015-07-17,9.2440004,
09CD001,2015-07-18,9.2119999,
09CD001,2015-07-19,9.1809998,
09CD001,2015-07-20,9.151,
09CD001,2015-07-21,9.1230001,
09CD001,2015-07-22,9.1029997,
09CD001,2015-07-23,9.0909996,
09CD001,2015-07-24,9.0860004,
09CD001,2015-07-25,9.0760002,
09CD001,2015-07-26,9.0690002,
09CD001,2015-07-27,9.066,
09CD001,2015-07-28,9.0629997,
09CD001,2015-07-29,9.0749998,
09CD001,2015-07-30,9.0860004,
09CD001,2015-07-31,9.0950003,
09CD001,2015-08-01,9.092,
09CD001,2015-08-02,9.0790005,
09CD001,2015-08-03,9.0790005,
09CD001,2015-08-04,9.0930004,
09CD001,2015-08-05,9.0889997,
09CD001,2015-08-06,9.0670004,
09CD001,2015-08-07,9.0570002,
09CD001,2015-08-08,9.04,
09CD001,2015-08-09,9.0209999,
09CD001,2015-08-10,9.0019999,
09CD001,2015-08-11,8.9949999,
09CD001,2015-08-12,8.9829998,
09CD001,2015-08-13,8.9910002,
09CD001,2015-08-14,8.9940004,
09CD001,2015-08-15,8.9890003,
09CD001,2015-08-16,8.9700003,
09CD001,2015-08-17,8.9589996,
09CD001,2015-08-18,8.9540005,
09CD001,2015-08-19,8.9659996,
09CD001,2015-08-20,9.0509996,
09CD001,2015-08-21,9.1210003,
09CD001,2015-08-22,9.191,
09CD001,2015-08-23,9.224,
09CD001,2015-08-24,9.2259998,
09CD001,2015-08-25,9.2309999,
09CD001,2015-08-26,9.2159996,
09CD001,2015-08-27,9.2110004,
09CD001,2015-08-28,9.2770004,
09CD001,2015-08-29,9.3439999,
09CD001,2015-08-30,9.3699999,
09CD001,2015-08-31,9.3610001,
09CD001,2015-09-01,9.3699999,
09CD001,2015-09-02,9.4259996,
09CD001,2015-09-03,9.5030003,
09CD001,2015-09-04,9.5389996,
09CD001,2015-09-05,9.5550003,
09CD001,2015-09-06,9.5600004,
09CD001,2015-09-07,9.5530005,
09CD001,2015-09-08,9.5480003,
09CD001,2015-09-09,9.5380001,
09CD001,2015-09-10,9.5319996,
09CD001,2015-09-11,9.5240002,
09CD001,2015-09-12,9.5159998,
09CD001,2015-09-13,9.5129995,
09CD001,2015-09-14,9.507,
09CD001,2015-09-15,9.4940004,
09CD001,2015-09-16,9.4890003,
09CD001,2015-09-17,9.4849997,
09CD001,2015-09-18,9.4790001,
09CD001,2015-09-19,9.4750004,
09CD001,2015-09-20,9.4659996,
09CD001,2015-09-21,9.448,
09CD001,2015-09-22,9.4300003,
09CD001,2015-09-23,9.4219999,
09CD001,2015-09-24,9.4289999,
09CD001,2015-09-25,9.4219999,
09CD001,2015-09-26,9.4049997,
09CD001,2015-09-27,9.3850002,
09CD001,2015-09-28,9.3660002,
09CD001,2015-09-29,9.3450003,
09CD001,2015-09-30,9.3299999,
09CD001,2015-10-01,9.3149996,
09CD001,2015-10-02,9.3050003,
09CD001,2015-10-03,9.2869997,
09CD001,2015-10-04,9.2650003,
09CD001,2015-10-05,9.2650003,
09CD001,2015-10-06,9.2650003,
09CD001,2015-10-07,9.2480001,
09CD001,2015-10-08,9.2309999,
09CD001,2015-10-09,9.2159996,
09CD001,2015-10-10,9.2069998,
09CD001,2015-10-11,9.1949997,
09CD001,2015-10-12,9.1879997,
09CD001,2015-10-13,9.1870003,
09CD001,2015-10-14,9.1820002,
09CD001,2015-10-15,9.1829996,
09CD001,2015-10-16,9.1759996,
09CD001,2015-10-17,9.165,
09CD001,2015-10-18,9.1520004,
09CD001,2015-10-19,9.1440001,
09CD001,2015-10-20,9.1350002,
09CD001,2015-10-21,9.1230001,
09CD001,2015-10-22,9.118,
09CD001,2015-10-23,9.1129999,
09CD001,2015-10-24,9.1129999,
09CD001,2015-10-25,9.1079998,
09CD001,2015-10-26,9.0939999,
09CD001,2015-10-27,9.0760002,
09CD001,2015-10-28,9.0509996,
09CD001,2015-10-29,9.0249996,
09CD001,2015-10-30,9.0050001,
09CD001,2015-10-31,8.9829998,
09CD001,2015-11-01,8.9569998,
09CD001,2015-11-02,8.9359999,A
09CD001,2015-12-03,10.164,A
09CD001,2016-01-20,9.2399998,A
09CD001,2016-04-06,8.9790001,A
09CD001,2016-04-07,8.993,
09CD001,2016-04-08,8.9849997,
09CD001,2016-04-09,9.0279999,
09CD001,2016-04-10,9.0459995,
09CD001,2016-04-11,9.0570002,
09CD001,2016-04-12,9.0909996,
09CD001,2016-04-13,9.1149998,
09CD001,2016-04-14,9.1540003,
09CD001,2016-04-15,9.184,
09CD001,2016-04-16,9.184,
09CD001,2016-04-17,9.1409998,
09CD001,2016-04-18,9.1029997,
09CD001,2016-04-19,9.1490002,
09CD001,2016-04-20,9.1420002,
09CD001,2016-04-21,9.1639996,
09CD001,2016-04-22,9.1029997,
09CD001,2016-04-23,9.1149998,A
09CD001,2016-04-26,9.8360004,A
09CD001,2016-05-12,8.8400002,A
09CD001,2016-05-13,8.8789997,
09CD001,2016-05-14,8.9139996,
09CD001,2016-05-15,8.9429998,
09CD001,2016-05-16,8.9860001,
09CD001,2016-05-17,9.0939999,
09CD001,2016-05-18,9.2110004,
09CD001,2016-05-19,9.2889996,
09CD001,2016-05-20,9.3269997,
09CD001,2016-05-21,9.3640003,
09CD001,2016-05-22,9.4169998,
09CD001,2016-05-23,9.4779997,
09CD001,2016-05-24,9.526,
09CD001,2016-05-25,9.5830002,
09CD001,2016-05-26,9.6610003,
09CD001,2016-05-27,9.7489996,
09CD001,2016-05-28,9.8360004,
09CD001,2016-05-29,9.8240004,
09CD001,2016-05-30,9.7880001,
09CD001,2016-05-31,9.75,
09CD001,2016-06-01,9.6940002,
09CD001,2016-06-02,9.6330004,
09CD001,2016-06-03,9.585,
09CD001,2016-06-04,9.5609999,
09CD001,2016-06-05,9.5419998,
09CD001,2016-06-06,9.5360003,
09CD001,2016-06-07,9.5690002,
09CD001,2016-06-08,9.5410004,
09CD001,2016-06-09,9.5480003,
09CD001,2016-06-10,9.5620003,
09CD001,2016-06-11,9.5620003,
09CD001,2016-06-12,9.5690002,
09CD001,2016-06-13,9.5609999,
09CD001,2016-06-14,9.552,
09CD001,2016-06-15,9.5489998,
09CD001,2016-06-16,9.566,
09CD001,2016-06-17,9.6000004,
09CD001,2016-06-18,9.6099997,
09CD001,2016-06-19,9.5889997,
09CD001,2016-06-20,9.5629997,
09CD001,2016-06-21,9.5299997,
09CD001,2016-06-22,9.4919996,
09CD001,2016-06-23,9.4530001,
09CD001,2016-06-24,9.4189997,
09CD001,2016-06-25,9.3900003,
09CD001,2016-06-26,9.375,
09CD001,2016-06-27,9.3559999,
09CD001,2016-06-28,9.3290005,
09CD001,2016-06-29,9.3009996,
09CD001,2016-06-30,9.2790003,
09CD001,2016-07-01,9.2690001,
09CD001,2016-07-02,9.2469997,
09CD001,2016-07-03,9.2390003,
09CD001,2016-07-04,9.2259998,
09CD001,2016-07-05,9.2150002,
09CD001,2016-07-06,9.21,
09CD001,2016-07-07,9.2019997,
09CD001,2016-07-08,9.1940002,
09CD001,2016-07-09,9.1680002,
09CD001,2016-07-10,9.1400003,
09CD001,2016-07-11,9.1300001,
09CD001,2016-07-12,9.151,
09CD001,2016-07-13,9.1859999,
09CD001,2016-07-14,9.1700001,
09CD001,2016-07-15,9.1520004,
09CD001,2016-07-16,9.1639996,
09CD001,2016-07-17,9.1619997,
09CD001,2016-07-18,9.1540003,
09CD001,2016-07-19,9.1359997,
09CD001,2016-07-20,9.1110001,
09CD001,2016-07-21,9.0909996,
09CD001,2016-07-22,9.0769997,
09CD001,2016-07-23,9.0810003,
09CD001,2016-07-24,9.1280003,
09CD001,2016-07-25,9.2290001,
09CD001,2016-07-26,9.2969999,
09CD001,2016-07-27,9.3389997,
09CD001,2016-07-28,9.3660002,
09CD001,2016-07-29,9.4180002,
09CD001,2016-07-30,9.4540005,
09CD001,2016-07-31,9.448,
09CD001,2016-08-01,9.4300003,
09CD001,2016-08-02,9.4320002,
09CD001,2016-08-03,9.4460001,
09CD001,2016-08-04,9.427,
09CD001,2016-08-05,9.3789997,
09CD001,2016-08-06,9.3439999,
09CD001,2016-08-07,9.309,
09CD001,2016-08-08,9.2790003,
09CD001,2016-08-09,9.2550001,
09CD001,2016-08-10,9.2449999,
09CD001,2016-08-11,9.2340002,
09CD001,2016-08-12,9.2299995,
09CD001,2016-08-13,9.2390003,
09CD001,2016-08-14,9.2390003,
09CD001,2016-08-15,9.2309999,
09CD001,2016-08-16,9.21,
09CD001,2016-08-17,9.1829996,
09CD001,2016-08-18,9.1529999,
09CD001,2016-08-19,9.1300001,
09CD001,2016-08-20,9.1120005,
09CD001,2016-08-21,9.1059999,
09CD001,2016-08-22,9.1049995,
09CD001,2016-08-23,9.0909996,
09CD001,2016-08-24,9.0740004,
09CD001,2016-08-25,9.0679998,
09CD001,2016-08-26,9.059,
09CD001,2016-08-27,9.052,
09CD001,2016-08-28,9.0579996,
09CD001,2016-08-29,9.0710001,
09CD001,2016-08-30,9.0830002,
09CD001,2016-08-31,9.1059999,
09CD001,2016-09-01,9.1160002,
09CD001,2016-09-02,9.1129999,
09CD001,2016-09-03,9.1169996,
09CD001,2016-09-04,9.1169996,
09CD001,2016-09-05,9.1140003,
09CD001,2016-09-06,9.1099997,
09CD001,2016-09-07,9.1099997,
09CD001,2016-09-08,9.1020002,
09CD001,2016-09-09,9.0869999,
09CD001,2016-09-10,9.0780001,
09CD001,2016-09-11,9.0649996,
09CD001,2016-09-12,9.0579996,
09CD001,2016-09-13,9.0539999,
09CD001,2016-09-14,9.0620003,
09CD001,2016-09-15,9.0609999,
09CD001,2016-09-16,9.0670004,
09CD001,2016-09-17,9.0740004,
09CD001,2016-09-18,9.0830002,
09CD001,2016-09-19,9.0959997,
09CD001,2016-09-20,9.1040001,
09CD001,2016-09-21,9.1079998,
09CD001,2016-09-22,9.1149998,
09CD001,2016-09-23,9.1160002,
09CD001,2016-09-24,9.1140003,
09CD001,2016-09-25,9.1070004,
09CD001,2016-09-26,9.0939999,
09CD001,2016-09-27,9.0860004,
09CD001,2016-09-28,9.0719995,
09CD001,2016-09-29,9.0570002,
09CD001,2016-09-30,9.0430002,
09CD001,2016-10-01,9.033,
09CD001,2016-10-02,9.0179996,
09CD001,2016-10-03,8.9989996,
09CD001,2016-10-04,8.9890003,
09CD001,2016-10-05,8.9720001,
09CD001,2016-10-06,8.9510002,
09CD001,2016-10-07,8.9250002,
09CD001,2016-10-08,8.9040003,
09CD001,2016-10-09,8.8809996,
09CD001,2016-10-10,8.8549995,
09CD001,2016-10-11,8.823,
09CD001,2016-10-12,8.79,
09CD001,2016-10-13,8.7740002,
09CD001,2016-10-14,8.7550001,
09CD001,2016-10-15,8.7320004,
09CD001,2016-10-16,8.7139997,
09CD001,2016-10-17,8.6829996,
09CD001,2016-10-18,8.6590004,
09CD001,2016-10-19,8.6359997,
09CD001,2016-10-20,8.6280003,
09CD001,2016-10-21,8.6269999,
09CD001,2016-10-22,8.6160002,
09CD001,2016-10-23,8.6059999,
09CD001,2016-10-24,8.6490002,
09CD001,2016-10-25,8.7259998,
09CD001,2016-10-26,8.6739998,
09CD001,2016-10-27,8.5959997,
09CD001,2016-10-28,8.6199999,
09CD001,2016-10-29,8.6540003,
09CD001,2016-10-30,8.7320004,
09CD001,2016-10-31,8.6309996,
09CD001,2016-11-01,8.3599997,
09CD001,2016-11-02,8.3380003,
09CD001,2016-11-03,8.323,
09CD001,2016-11-04,8.309,
09CD001,2016-11-05,8.3129997,
09CD001,2016-11-06,8.3839998,
09CD001,2016-11-07,8.4799995,
09CD001,2016-11-08,8.4499998,
09CD001,2016-11-09,8.4329996,
09CD001,2016-11-10,8.4659996,
09CD001,2016-11-11,8.6070004,
09CD001,2016-11-12,8.7030001,
09CD001,2016-11-13,8.5539999,
09CD001,2016-11-14,8.5819998,
09CD001,2016-11-15,8.5439997,
09CD001,2016-11-16,8.4449997,
09CD001,2016-11-17,8.3789997,
09CD001,2016-11-18,8.2709999,
09CD001,2016-11-19,8.1680002,A
09CD001,2016-11-28,9.5100002,A
09CD001,2017-01-26,8.9420004,A
09CD001,2017-03-13,8.7510004,A
09CD001,2017-05-09,8.5439997,A
09CD001,2017-05-10,8.3610001,
09CD001,2017-05-11,8.3369999,
09CD001,2017-05-12,8.3509998,
09CD001,2017-05-13,8.3889999,
09CD001,2017-05-14,8.4860001,
09CD001,2017-05-15,8.5769997,
09CD001,2017-05-16,8.677,
09CD001,2017-05-17,8.7510004,
09CD001,2017-05-18,8.7799997,
09CD001,2017-05-19,8.7659998,
09CD001,2017-05-20,8.7620001,
09CD001,2017-05-21,8.7629995,
09CD001,2017-05-22,8.7040005,
09CD001,2017-05-23,8.6899996,
09CD001,2017-05-24,8.7869997,
09CD001,2017-05-25,8.8570004,
09CD001,2017-05-26,8.882,
09CD001,2017-05-27,8.9049997,
09CD001,2017-05-28,8.9090004,
09CD001,2017-05-29,8.8920002,
09CD001,2017-05-30,8.875,
09CD001,2017-05-31,8.8570004,
09CD001,2017-06-01,8.8629999,
09CD001,2017-06-02,8.875,
09CD001,2017-06-03,8.9049997,
09CD001,2017-06-04,9.0279999,
09CD001,2017-06-05,9.1870003,
09CD001,2017-06-06,9.2690001,
09CD001,2017-06-07,9.29,
09CD001,2017-06-08,9.3000002,
09CD001,2017-06-09,9.3120003,
09CD001,2017-06-10,9.3030005,
09CD001,2017-06-11,9.3190002,
09CD001,2017-06-12,9.415,
09CD001,2017-06-13,9.4540005,
09CD001,2017-06-14,9.5559998,
09CD001,2017-06-15,9.6120005,
09CD001,2017-06-16,9.5600004,
09CD001,2017-06-17,9.526,
09CD001,2017-06-18,9.5349998,
09CD001,2017-06-19,9.5509996,
09CD001,2017-06-20,9.5349998,
09CD001,2017-06-21,9.5310001,
09CD001,2017-06-22,9.5459995,
09CD001,2017-06-23,9.5539999,
09CD001,2017-06-24,9.5430002,
09CD001,2017-06-25,9.5249996,
09CD001,2017-06-26,9.5240002,
09CD001,2017-06-27,9.5170002,
09CD001,2017-06-28,9.4829998,
09CD001,2017-06-29,9.4460001,
09CD001,2017-06-30,9.4130001,
09CD001,2017-07-01,9.3800001,
09CD001,2017-07-02,9.3529997,
09CD001,2017-07-03,9.3319998,
09CD001,2017-07-04,9.3280001,
09CD001,2017-07-05,9.3269997,
09CD001,2017-07-06,9.3559999,
09CD001,2017-07-07,9.4090004,
09CD001,2017-07-08,9.5209999,
09CD001,2017-07-09,9.5620003,
09CD001,2017-07-10,9.5450001,
09CD001,2017-07-11,9.533,
09CD001,2017-07-12,9.5150003,
09CD001,2017-07-13,9.5229998,
09CD001,2017-07-14,9.5629997,
09CD001,2017-07-15,9.6040001,
09CD001,2017-07-16,9.6309996,
09CD001,2017-07-17,9.6059999,
09CD001,2017-07-18,9.5909996,
09CD001,2017-07-19,9.6029997,
09CD001,2017-07-20,9.625,
09CD001,2017-07-21,9.6309996,
09CD001,2017-07-22,9.6219997,
09CD001,2017-07-23,9.6090002,
09CD001,2017-07-24,9.5900002,
09CD001,2017-07-25,9.5600004,
09CD001,2017-07-26,9.526,
09CD001,2017-07-27,9.4980001,
09CD001,2017-07-28,9.4879999,
09CD001,2017-07-29,9.4680004,
09CD001,2017-07-30,9.5089998,
09CD001,2017-07-31,9.5970001,
09CD001,2017-08-01,9.6890001,
09CD001,2017-08-02,9.6940002,
09CD001,2017-08-03,9.6759996,
09CD001,2017-08-04,9.6499996,
09CD001,2017-08-05,9.6059999,
09CD001,2017-08-06,9.5500002,
09CD001,2017-08-07,9.4949999,
09CD001,2017-08-08,9.4440002,
09CD001,2017-08-09,9.401,
09CD001,2017-08-10,9.3579998,
09CD001,2017-08-11,9.3199997,
09CD001,2017-08-12,9.283,
09CD001,2017-08-13,9.2460003,
09CD001,2017-08-14,9.2110004,
09CD001,2017-08-15,9.1820002,
09CD001,2017-08-16,9.1610003,
09CD001,2017-08-17,9.1359997,
09CD001,2017-08-18,9.1110001,
09CD001,2017-08-19,9.0950003,
09CD001,2017-08-20,9.0769997,
09CD001,2017-08-21,9.059,
09CD001,2017-08-22,9.0489998,
09CD001,2017-08-23,9.0419998,
09CD001,2017-08-24,9.0340004,
09CD001,2017-08-25,9.0410004,
09CD001,2017-08-26,9.1420002,
09CD001,2017-08-27,9.2440004,
09CD001,2017-08-28,9.2790003,
09CD001,2017-08-29,9.2749996,
09CD001,2017-08-30,9.243,
09CD001,2017-08-31,9.2030001,
09CD001,2017-09-01,9.1700001,
09CD001,2017-09-02,9.1479998,
09CD001,2017-09-03,9.125,
09CD001,2017-09-04,9.0979996,
09CD001,2017-09-05,9.0719995,
09CD001,2017-09-06,9.052,
09CD001,2017-09-07,9.0369997,
09CD001,2017-09-08,9.0319996,
09CD001,2017-09-09,9.0159998,
09CD001,2017-09-10,9.0229998,
09CD001,2017-09-11,9.0150003,
09CD001,2017-09-12,9.0100002,
09CD001,2017-09-13,9.0089998,
09CD001,2017-09-14,9.0019999,
09CD001,2017-09-15,8.9899998,
09CD001,2017-09-16,8.9779997,
09CD001,2017-09-17,8.9659996,
09CD001,2017-09-18,8.9530001,
09CD001,2017-09-19,8.941,
09CD001,2017-09-20,8.9259996,
09CD001,2017-09-21,8.9139996,
09CD001,2017-09-22,8.8990002,
09CD001,2017-09-23,8.8870001,
09CD001,2017-09-24,8.8760004,
09CD001,2017-09-25,8.8660002,
09CD001,2017-09-26,8.8540001,
09CD001,2017-09-27,8.8459997,
09CD001,2017-09-28,8.8400002,
09CD001,2017-09-29,8.8330002,
09CD001,2017-09-30,8.8369999,
09CD001,2017-10-01,8.8330002,
09CD001,2017-10-02,8.8280001,
09CD001,2017-10-03,8.823,
09CD001,2017-10-04,8.8269997,
09CD001,2017-10-05,8.8369999,
09CD001,2017-10-06,8.8330002,
09CD001,2017-10-07,8.8280001,
09CD001,2017-10-08,8.816,
09CD001,2017-10-09,8.8070002,
09CD001,2017-10-10,8.7959995,
09CD001,2017-10-11,8.7880001,
09CD001,2017-10-12,8.7799997,
09CD001,2017-10-13,8.7639999,
09CD001,2017-10-14,8.7539997,
09CD001,2017-10-15,8.7360001,
09CD001,2017-10-16,8.7189999,
09CD001,2017-10-17,8.7040005,
09CD001,2017-10-18,8.6870003,
09CD001,2017-10-19,8.6730003,
09CD001,2017-10-20,8.6599998,
09CD001,2017-10-21,8.6420002,
09CD001,2017-10-22,8.6199999,
09CD001,2017-10-23,8.5830002,
09CD001,2017-10-24,8.5539999,
09CD001,2017-10-25,8.559,
09CD001,2017-10-26,8.5839996,
09CD001,2017-10-27,8.5050001,
09CD001,2017-10-28,8.4569998,
09CD001,2017-10-29,8.4919996,
09CD001,2017-10-30,8.4659996,
09CD001,2017-10-31,8.4490004,
09CD001,2017-11-01,8.4399996,
09CD001,2017-11-02,8.4280005,
09CD001,2017-11-03,8.4099998,
09CD001,2017-11-04,8.5200005,
09CD001,2017-11-05,8.6140003,
09CD001,2017-11-06,8.5050001,
09CD001,2017-11-07,8.2399998,
09CD001,2017-11-08,8.1730003,
09CD001,2017-11-09,8.099,
09CD001,2017-11-10,8.1009998,
09CD001,2017-11-11,8.4870005,A
09CD001,2017-11-28,9.8179998,A
09CD001,2018-01-21,8.9820004,A
09CD001,2018-04-09,8.9090004,A
09CD001,2018-05-10,9.2729998,A
09CD001,2018-05-23,9.2989998,A
09CD001,2018-05-24,9.3459997,
09CD001,2018-05-25,9.3839998,
09CD001,2018-05-26,9.3719997,
09CD001,2018-05-27,9.3529997,
09CD001,2018-05-28,9.3319998,
09CD001,2018-05-29,9.3330002,
09CD001,2018-05-30,9.2919998,
09CD001,2018-05-31,9.2270002,
09CD001,2018-06-01,9.1859999,
09CD001,2018-06-02,9.1599998,
09CD001,2018-06-03,9.1540003,
09CD001,2018-06-04,9.1520004,
09CD001,2018-06-05,9.1630001,
09CD001,2018-06-06,9.2010002,
09CD001,2018-06-07,9.2209997,
09CD001,2018-06-08,9.2349997,
09CD001,2018-06-09,9.2390003,
09CD001,2018-06-10,9.2489996,
09CD001,2018-06-11,9.257,
09CD001,2018-06-12,9.2519999,
09CD001,2018-06-13,9.2749996,
09CD001,2018-06-14,9.3039999,
09CD001,2018-06-15,9.2860003,
09CD001,2018-06-16,9.2770004,
09CD001,2018-06-17,9.2869997,
09CD001,2018-06-18,9.2989998,
09CD001,2018-06-19,9.3109999,
09CD001,2018-06-20,9.3199997,
09CD001,2018-06-21,9.3299999,
09CD001,2018-06-22,9.3290005,
09CD001,2018-06-23,9.3129997,
09CD001,2018-06-24,9.3000002,
09CD001,2018-06-25,9.3210001,
09CD001,2018-06-26,9.3380003,
09CD001,2018-06-27,9.3140001,
09CD001,2018-06-28,9.2919998,
09CD001,2018-06-29,9.3699999,
09CD001,2018-06-30,9.5719995,
09CD001,2018-07-01,9.6599998,
09CD001,2018-07-02,9.6929998,
09CD001,2018-07-03,9.6789999,
09CD001,2018-07-04,9.6599998,
09CD001,2018-07-05,9.6219997,
09CD001,2018-07-06,9.5830002,
09CD001,2018-07-07,9.5290003,
09CD001,2018-07-08,9.4610004,
09CD001,2018-07-09,9.3979998,
09CD001,2018-07-10,9.3409996,
09CD001,2018-07-11,9.2930002,
09CD001,2018-07-12,9.2460003,
09CD001,2018-07-13,9.2040005,
09CD001,2018-07-14,9.1700001,
09CD001,2018-07-15,9.1450005,
09CD001,2018-07-16,9.1300001,
09CD001,2018-07-17,9.132,
09CD001,2018-07-18,9.1300001,
09CD001,2018-07-19,9.1049995,
09CD001,2018-07-20,9.0869999,
09CD001,2018-07-21,9.0740004,
09CD001,2018-07-22,9.0670004,
09CD001,2018-07-23,9.059,
09CD001,2018-07-24,9.04,
09CD001,2018-07-25,9.0179996,
09CD001,2018-07-26,8.993,
09CD001,2018-07-27,8.9709997,
09CD001,2018-07-28,8.9469995,
09CD001,2018-07-29,8.9200001,
09CD001,2018-07-30,8.8990002,
09CD001,2018-07-31,8.8730001,
09CD001,2018-08-01,8.8509998,
09CD001,2018-08-02,8.8319998,
09CD001,2018-08-03,8.8219995,
09CD001,2018-08-04,8.802,
09CD001,2018-08-05,8.7869997,
09CD001,2018-08-06,8.783,
09CD001,2018-08-07,8.8459997,
09CD001,2018-08-08,8.9350004,
09CD001,2018-08-09,8.908,
09CD001,2018-08-10,8.9189997,
09CD001,2018-08-11,8.9799995,
09CD001,2018-08-12,9.0579996,
09CD001,2018-08-13,9.1190004,
09CD001,2018-08-14,9.1719999,
09CD001,2018-08-15,9.2089996,
09CD001,2018-08-16,9.2390003,
09CD001,2018-08-17,9.2550001,
09CD001,2018-08-18,9.2740002,
09CD001,2018-08-19,9.2980003,
09CD001,2018-08-20,9.3009996,
09CD001,2018-08-21,9.2779999,
09CD001,2018-08-22,9.323,
09CD001,2018-08-23,9.342,
09CD001,2018-08-24,9.2849998,
09CD001,2018-08-25,9.2639999,
09CD001,2018-08-26,9.2360001,
09CD001,2018-08-27,9.2159996,
09CD001,2018-08-28,9.2200003,
09CD001,2018-08-29,9.2089996,
09CD001,2018-08-30,9.1940002,
09CD001,2018-08-31,9.1780005,
09CD001,2018-09-01,9.1520004,
09CD001,2018-09-02,9.1520004,
09CD001,2018-09-03,9.1739998,
09CD001,2018-09-04,9.1560001,
09CD001,2018-09-05,9.1440001,
09CD001,2018-09-06,9.1280003,
09CD001,2018-09-07,9.1110001,
09CD001,2018-09-08,9.0909996,
09CD001,2018-09-09,9.0710001,
09CD001,2018-09-10,9.0509996,
09CD001,2018-09-11,9.0319996,
09CD001,2018-09-12,9.0170002,
09CD001,2018-09-13,9.0039997,
09CD001,2018-09-14,9.0080004,
09CD001,2018-09-15,9.0059996,
09CD001,2018-09-16,8.9899998,
09CD001,2018-09-17,8.96,
09CD001,2018-09-18,8.9309998,
09CD001,2018-09-19,8.9060001,
09CD001,2018-09-20,8.8800001,
09CD001,2018-09-21,8.8520002,
09CD001,2018-09-22,8.8260002,
09CD001,2018-09-23,8.802,
09CD001,2018-09-24,8.783,
09CD001,2018-09-25,8.7609997,
09CD001,2018-09-26,8.7449999,
09CD001,2018-09-27,8.7299995,
09CD001,2018-09-28,8.7089996,
09CD001,2018-09-29,8.6870003,
09CD001,2018-09-30,8.6669998,
09CD001,2018-10-01,8.6470003,
09CD001,2018-10-02,8.6230001,
09CD001,2018-10-03,8.5970001,
09CD001,2018-10-04,8.5690002,
09CD001,2018-10-05,8.5380001,
09CD001,2018-10-06,8.5120001,
09CD001,2018-10-07,8.4980001,
09CD001,2018-10-08,8.4790001,
09CD001,2018-10-09,8.4569998,
09CD001,2018-10-10,8.4139996,
09CD001,2018-10-11,8.4060001,
09CD001,2018-10-12,8.3760004,
09CD001,2018-10-13,8.3629999,
09CD001,2018-10-14,8.3629999,
09CD001,2018-10-15,8.3549995,
09CD001,2018-10-16,8.3660002,
09CD001,2018-10-17,8.3970003,
09CD001,2018-10-18,8.4099998,
09CD001,2018-10-19,8.4160004,
09CD001,2018-10-20,8.415,
09CD001,2018-10-21,8.408,
09CD001,2018-10-22,8.408,
09CD001,2018-10-23,8.4040003,
09CD001,2018-10-24,8.3929996,
09CD001,2018-10-25,8.3889999,
09CD001,2018-10-26,8.382,
09CD001,2018-10-27,8.3710003,
09CD001,2018-10-28,8.3450003,
09CD001,2018-10-29,8.3120003,
09CD001,2018-10-30,8.2840004,
09CD001,2018-10-31,8.2620001,A
09CD001,2018-12-03,9.2639999,A