Division,WeightClassKg,Place,Name,Team,BodyweightKg,Best3SquatKg,Best3BenchKg,Best3DeadliftKg,TotalKg,Equipment,Event,Sex
Girls,44.23,1,Indiyah Aldridge,Texarkana Liberty-Eylau,42.18,88.45,47.63,99.79,235.87,Single-ply,SBD,F
Girls,44.23,2,Alexa Morones,Wills Point,43.82,95.25,36.29,97.52,229.06,Single-ply,SBD,F
Girls,44.23,3,Crystal Padron,Quinlan Ford,42.73,86.18,40.82,72.57,199.58,Single-ply,SBD,F
Girls,44.23,4,Mara Leonard,Paris North Lamar,39.92,72.57,38.56,77.11,188.24,Single-ply,SBD,F
Girls,44.23,5,Diana Alvarez,Paris,39.83,61.23,40.82,79.38,181.44,Single-ply,SBD,F
Girls,44.23,6,Katie Miller,Caddo Mills,43.27,72.57,29.48,74.84,176.9,Single-ply,SBD,F
Girls,47.85,1,Victoria Ivy,Rusk,47.08,99.79,52.16,111.13,263.08,Single-ply,SBD,F
Girls,47.85,2,Angel Anderson,Mabank,47.36,106.59,45.36,104.33,256.28,Single-ply,SBD,F
Girls,47.85,3,Krista Rash,Gilmer,47.26,92.99,45.36,104.33,242.67,Single-ply,SBD,F
Girls,47.85,4,Kimberlie Lumsden,Wills Point,47.45,86.18,34.02,104.33,224.53,Single-ply,SBD,F
Girls,47.85,5,Kimberly Cordero,Athens,47.63,83.91,31.75,104.33,219.99,Single-ply,SBD,F
Girls,47.85,6,Paige Allen,Fairfield,47.26,68.04,52.16,92.99,213.19,Single-ply,SBD,F
Girls,47.85,7,Nancy Diaz,Ferris,47.26,74.84,29.48,95.25,199.58,Single-ply,SBD,F
Girls,47.85,8,Samantha Godwin,Canton,46.45,79.38,29.48,79.38,188.24,Single-ply,SBD,F
Girls,47.85,DQ,Tiffany Pace,Ferris,47.63,,,,,Single-ply,SBD,F
Girls,47.85,DQ,Ruby Rodriguez,Athens,47.81,88.45,38.56,,,Single-ply,SBD,F
Girls,47.85,DQ,Jessica Taylor #3,Gilmer,46.63,,,,,Single-ply,SBD,F
Girls,51.94,1,Jamiesha Fields,Fairfield,51.26,124.74,45.36,142.88,312.98,Single-ply,SBD,F
Girls,51.94,2,Carla Perez,Canton,51.26,127.01,54.43,115.67,297.1,Single-ply,SBD,F
Girls,51.94,3,Ansley Downs,Paris,51.17,120.2,58.97,106.59,285.76,Single-ply,SBD,F
Girls,51.94,4,Sydnee Parker,Gilmer,51.53,104.33,56.7,122.47,283.5,Single-ply,SBD,F
Girls,51.94,5,Mikesha Shorters,Paris,51.8,108.86,45.36,106.59,260.82,Single-ply,SBD,F
Girls,51.94,6,Zoe Fields,Rusk,50.53,104.33,43.09,108.86,256.28,Single-ply,SBD,F
Girls,51.94,7,Makayla McHenry,Gilmer,51.62,95.25,45.36,115.67,256.28,Single-ply,SBD,F
Girls,51.94,8,ShKylie Jones,Gilmer,51.62,95.25,47.63,111.13,254.01,Single-ply,SBD,F
Girls,51.94,9,Stephanie Thomas,Midlothian Heritage,51.71,95.25,47.63,111.13,254.01,Single-ply,SBD,F
Girls,51.94,10,Rileigh White,Fairfield,50.8,95.25,56.7,97.52,249.48,Single-ply,SBD,F
Girls,51.94,11,Ivie Allmon,Paris North Lamar,51.8,86.18,56.7,92.99,235.87,Single-ply,SBD,F
Girls,51.94,12,Ashlyn Garcia,Fairfield,50.62,86.18,45.36,95.25,226.8,Single-ply,SBD,F
Girls,51.94,DQ,Matti Hagen,Fairfield,51.8,,,,,Single-ply,SBD,F
Girls,51.94,DQ,Caison Nachtigall,Crandall,51.71,,,,,Single-ply,SBD,F
Girls,51.94,DQ,Denasia Yates,Paris,51.71,,,,,Single-ply,SBD,F
Girls,56.02,1,Desiree Fendley,Paris North Lamar,55.07,122.47,63.5,131.54,317.51,Single-ply,SBD,F
Girls,56.02,2,Sydney Bell,Gilmer,54.34,127.01,54.43,131.54,312.98,Single-ply,SBD,F
Girls,56.02,3,Kamry Oliver,Paris North Lamar,54.61,129.27,63.5,117.93,310.71,Single-ply,SBD,F
Girls,56.02,4,Maddie Davidson,Gilmer,55.88,97.52,70.31,120.2,288.03,Single-ply,SBD,F
Girls,56.02,5,Abby Coleman,Fairfield,54.88,113.4,61.23,108.86,283.5,Single-ply,SBD,F
Girls,56.02,6,Zoie Hurst,Paris North Lamar,55.52,113.4,58.97,108.86,281.23,Single-ply,SBD,F
Girls,56.02,7,Kaylee King,Wills Point,54.52,104.33,54.43,111.13,269.89,Single-ply,SBD,F
Girls,56.02,8,Sarah Stokke,Brownsboro,53.71,97.52,49.9,106.59,254.01,Single-ply,SBD,F
Girls,56.02,9,Alahondra Guerrero,Longview Spring Hill,55.34,97.52,45.36,97.52,240.4,Single-ply,SBD,F
Girls,56.02,10,Jacquelin Paredes,Longview Spring Hill,54.79,79.38,31.75,79.38,190.51,Single-ply,SBD,F
Girls,56.02,DQ,Kaley Hudson,Paris North Lamar,55.79,,,,,Single-ply,SBD,F
Girls,56.02,DQ,Dalana Peoples,Huntington,55.79,,,,,Single-ply,SBD,F
Girls,56.02,DQ,Olivia Sullivan,Mabank,55.79,,,,,Single-ply,SBD,F
Girls,56.02,DQ,Pel Htoo,Center,52.8,117.93,61.23,,,Single-ply,SBD,F
Girls,60.1,1,Madi Isaacs,Fairfield,58.88,161.03,63.5,154.22,378.75,Single-ply,SBD,F
Girls,60.1,2,Bree'Kayla Thompson,Athens,57.7,136.08,58.97,142.88,337.93,Single-ply,SBD,F
Girls,60.1,3,Kensy Isaacs,Fairfield,58.51,127.01,65.77,129.27,322.05,Single-ply,SBD,F
Girls,60.1,4,Edith Cockerell,Fairfield,59.51,138.35,54.43,127.01,319.78,Single-ply,SBD,F
Girls,60.1,5,Valerie Ivy,Rusk,59.15,127.01,58.97,124.74,310.71,Single-ply,SBD,F
Girls,60.1,6,Enchantra Roberson,Paris,57.7,120.2,65.77,122.47,308.44,Single-ply,SBD,F
Girls,60.1,7,Maddy McKeehan,Gilmer,59.69,117.93,65.77,120.2,303.91,Single-ply,SBD,F
Girls,60.1,8,Kailey Griffith,Gilmer,59.69,108.86,79.38,106.59,294.84,Single-ply,SBD,F
Girls,60.1,9,Lauren Baker,Mabank,58.97,111.13,49.9,127.01,288.03,Single-ply,SBD,F
Girls,60.1,10,Trichelle Meador,Quinlan Ford,59.6,117.93,49.9,113.4,281.23,Single-ply,SBD,F
Girls,60.1,11,Samantha Pineda,Bullard,59.6,106.59,43.09,127.01,276.69,Single-ply,SBD,F
Girls,60.1,DQ,Isabel Gonzalez,Athens,59.87,,,,,Single-ply,SBD,F
Girls,60.1,DQ,Rozlind Caffey,Gilmer,59.87,,,,,Single-ply,SBD,F
Girls,60.1,DQ,Jahila Pave,Texarkana Liberty-Eylau,59.87,,,,,Single-ply,SBD,F
Girls,60.1,DQ,Tynanna Crabtree,Texarkana Liberty-Eylau,59.87,,,,,Single-ply,SBD,F
Girls,67.36,1,Cierra Anderson,Gilmer,65.23,161.03,79.38,147.42,387.82,Single-ply,SBD,F
Girls,67.36,2,Olivia McMath,Wills Point,66.5,151.95,77.11,140.61,369.68,Single-ply,SBD,F
Girls,67.36,3,Rylie Reed,Crandall,66.13,151.95,68.04,142.88,362.87,Single-ply,SBD,F
Girls,67.36,4,Aariyana Webb,Gilmer,66.77,142.88,77.11,142.88,362.87,Single-ply,SBD,F
Girls,67.36,5,Daeja Harris,Fairfield,64.32,154.22,70.31,136.08,360.61,Single-ply,SBD,F
Girls,67.36,6,Atajdren Gill,Paris,62.6,136.08,56.7,136.08,328.85,Single-ply,SBD,F
Girls,67.36,7,Chelsea Kirkland,Mabank,65.23,127.01,63.5,129.27,319.78,Single-ply,SBD,F
Girls,67.36,8,Hannah Titlow,Paris North Lamar,67.22,122.47,63.5,129.27,315.25,Single-ply,SBD,F
Girls,67.36,9,Haley Lee,Brownsboro,62.32,117.93,68.04,127.01,312.98,Single-ply,SBD,F
Girls,67.36,10,Lexi Smith,Paris North Lamar,64.86,120.2,68.04,124.74,312.98,Single-ply,SBD,F
Girls,67.36,11,Amie Nguyen,Tyler Chapel Hill,65.32,136.08,47.63,120.2,303.91,Single-ply,SBD,F
Girls,67.36,12,Harley Gomez,Fairfield,65.95,122.47,63.5,115.67,301.64,Single-ply,SBD,F
Girls,67.36,DQ,Lauren Hall,Fairfield,67.13,,,,,Single-ply,SBD,F
Girls,67.36,DQ,Miriam Almaguer,Center,66.77,,,,,Single-ply,SBD,F
Girls,67.36,DQ,Kimberlyn Scott,Paris North Lamar,65.41,,,,,Single-ply,SBD,F
Girls,75.07,1,Charity Campbell,Bullard,71.67,183.7,83.91,142.88,410.5,Single-ply,SBD,F
Girls,75.07,2,Bryunna Dowell,Fairfield,73.03,154.22,58.97,165.56,378.75,Single-ply,SBD,F
Girls,75.07,3,Mi'Nea Williams,Paris,71.3,149.69,63.5,156.49,369.68,Single-ply,SBD,F
Girls,75.07,4,Amy Nava,Caddo Mills,69.94,158.76,65.77,142.88,367.41,Single-ply,SBD,F
Girls,75.07,5,Jaidah Franklin,Paris,69.67,129.27,61.23,147.42,337.93,Single-ply,SBD,F
Girls,75.07,6,Koya Aubrey,Texarkana Liberty-Eylau,74.66,136.08,56.7,142.88,335.66,Single-ply,SBD,F
Girls,75.07,7,Meyah Roberts,Athens,71.03,129.27,56.7,136.08,322.05,Single-ply,SBD,F
Girls,75.07,8,Ryan Barnett,Crandall,70.03,117.93,54.43,131.54,303.91,Single-ply,SBD,F
Girls,75.07,9,Kaylea Truett,Huntington,70.67,113.4,49.9,136.08,299.37,Single-ply,SBD,F
Girls,75.07,10,Taylor Brewer,Longview Spring Hill,67.59,120.2,43.09,131.54,294.84,Single-ply,SBD,F
Girls,75.07,11,Annie Wilson,Fairfield,70.03,120.2,61.23,113.4,294.84,Single-ply,SBD,F
Girls,75.07,DQ,Mary Arigbabu,Palestine,74.84,,,,,Single-ply,SBD,F
Girls,75.07,DQ,Elena Fults,Tyler Chapel Hill,74.84,,,,,Single-ply,SBD,F
Girls,75.07,DQ,Harley O'Dell,Rusk,74.84,,,,,Single-ply,SBD,F
Girls,75.07,DQ,Rayn Hayden,Paris,72.3,131.54,70.31,,,Single-ply,SBD,F
Girls,82.33,1,Maria Vences,Bullard,76.75,158.76,104.33,136.08,399.16,Single-ply,SBD,F
Girls,82.33,2,Tylie Bruce,Fairfield,79.56,158.76,90.72,149.69,399.16,Single-ply,SBD,F
Girls,82.33,3,Hannah Lindsey,Caddo Mills,81.28,167.83,74.84,145.15,387.82,Single-ply,SBD,F
Girls,82.33,4,Zoe Tucker,Texarkana Liberty-Eylau,79.02,156.49,86.18,142.88,385.55,Single-ply,SBD,F
Girls,82.33,5,Bailey Jones #3,Fairfield,76.75,145.15,77.11,145.15,367.41,Single-ply,SBD,F
Girls,82.33,6,Mayra Cortes,Van,76.38,151.95,49.9,136.08,337.93,Single-ply,SBD,F
Girls,82.33,7,Kelsey White,Rusk,78.56,138.35,61.23,124.74,324.32,Single-ply,SBD,F
Girls,82.33,8,Yuritza Hernandez,Quinlan Ford,76.29,136.08,61.23,120.2,317.51,Single-ply,SBD,F
Girls,82.33,9,Brooke Smith,Mabank,80.74,117.93,68.04,122.47,308.44,Single-ply,SBD,F
Girls,82.33,10,Aurorah Dove,Canton,75.75,136.08,43.09,120.2,299.37,Single-ply,SBD,F
Girls,82.33,11,Maddi Griffith,Mabank,78.11,120.2,61.23,106.59,288.03,Single-ply,SBD,F
Girls,82.33,12,Jakievia Johnson,Center,78.2,111.13,47.63,108.86,267.62,Single-ply,SBD,F
Girls,82.33,DQ,Brylie Stanley,Crandall,82.1,,,,,Single-ply,SBD,F
Girls,82.33,DQ,Katelyn Byron,Texarkana Liberty-Eylau,82.1,,,,,Single-ply,SBD,F
Girls,82.33,DQ,Katelynn Garcia,Tyler Chapel Hill,82.1,,,,,Single-ply,SBD,F
Girls,90.04,1,Marshae Davis,Gilmer,89.09,179.17,99.79,185.97,464.93,Single-ply,SBD,F
Girls,90.04,2,Kailan Randle,Center,86.36,167.83,90.72,149.69,408.23,Single-ply,SBD,F
Girls,90.04,3,David-Lee Martinez,Rusk,84.28,170.1,68.04,151.95,390.09,Single-ply,SBD,F
Girls,90.04,4,Raelynn Johnson,Paris,87.63,142.88,83.91,136.08,362.87,Single-ply,SBD,F
Girls,90.04,5,Maddison Yruegas,Caddo Mills,89.63,142.88,68.04,147.42,358.34,Single-ply,SBD,F
Girls,90.04,6,Brianna Gray,Fairfield,88.18,136.08,61.23,138.35,335.66,Single-ply,SBD,F
Girls,90.04,7,Ke'Shona Berry,Tyler Chapel Hill,85.91,147.42,49.9,136.08,333.39,Single-ply,SBD,F
Girls,90.04,8,Kennedy Dickerson,Henderson,87.72,147.42,70.31,113.4,331.12,Single-ply,SBD,F
Girls,90.04,9,Braliegh Green,Brownsboro,86.18,142.88,61.23,124.74,328.85,Single-ply,SBD,F
Girls,90.04,10,Saikhya King,Paris,89.99,136.08,61.23,122.47,319.78,Single-ply,SBD,F
Girls,90.04,11,Alyssa Gallegos,Longview Spring Hill,88.63,113.4,58.97,124.74,297.1,Single-ply,SBD,F
Girls,90.04,DQ,Madison Andrews,Athens,89.81,,,,,Single-ply,SBD,F
Girls,90.04,DQ,Alexis Helton,Mabank,86.64,,,,,Single-ply,SBD,F
Girls,90.04,DQ,Brandy Rangel,Wills Point,89.81,,,,,Single-ply,SBD,F
Girls,90.04,DQ,Sydney Nard,Texarkana Liberty-Eylau,85.28,161.03,,,,Single-ply,SBD,F
Girls,100.02,1,Tabitha Barksdale,Waxahachie Life,94.35,161.03,86.18,165.56,412.77,Single-ply,SBD,F
Girls,100.02,2,Emma Doyal,Paris North Lamar,98.16,188.24,88.45,136.08,412.77,Single-ply,SBD,F
Girls,100.02,3,Kala Oliver,Henderson,94.62,161.03,74.84,172.37,408.23,Single-ply,SBD,F
Girls,100.02,4,Talya Davis,Center,99.16,158.76,79.38,161.03,399.16,Single-ply,SBD,F
Girls,100.02,5,Baylee Brown,Athens,96.71,163.29,65.77,147.42,376.48,Single-ply,SBD,F
Girls,100.02,6,Charity Starr,Fairfield,93.62,142.88,74.84,149.69,367.41,Single-ply,SBD,F
Girls,100.02,7,Haleigh Rollings,Tyler Chapel Hill,99.79,156.49,72.57,129.27,358.34,Single-ply,SBD,F
Girls,100.02,8,Celina Cervantes,Paris North Lamar,91.99,136.08,65.77,149.69,351.53,Single-ply,SBD,F
Girls,100.02,9,Angela Hernandez,Quinlan Ford,93.71,147.42,61.23,127.01,335.66,Single-ply,SBD,F
Girls,100.02,10,Skylar McCool,Van,99.06,120.2,47.63,136.08,303.91,Single-ply,SBD,F
Girls,100.02,11,Jewell Capps,Huntington,92.17,120.2,61.23,120.2,301.64,Single-ply,SBD,F
Girls,100.02,12,Faith Besherse,Canton,92.99,120.2,52.16,124.74,297.1,Single-ply,SBD,F
Girls,100.02,DQ,Savanah Albritton,Athens,99.79,,,,,Single-ply,SBD,F
Girls,100.02,DQ,Chloe Coffey,Mabank,97.79,,,,,Single-ply,SBD,F
Girls,117.71,1,Shannie Jones,Gilmer,114.58,195.04,90.72,163.29,449.06,Single-ply,SBD,F
Girls,117.71,2,Cayla Beall,Henderson,109.13,195.04,81.65,151.95,428.64,Single-ply,SBD,F
Girls,117.71,3,Ashley Irving,Texarkana Liberty-Eylau,114.4,179.17,99.79,149.69,428.64,Single-ply,SBD,F
Girls,117.71,4,Heather Coe,Bullard,104.42,165.56,92.99,151.95,410.5,Single-ply,SBD,F
Girls,117.71,5,McKenzye Williamson,Texarkana Liberty-Eylau,105.14,165.56,72.57,170.1,408.23,Single-ply,SBD,F
Girls,117.71,6,Rachel Petree,Longview Spring Hill,116.75,172.37,90.72,138.35,401.43,Single-ply,SBD,F
Girls,117.71,7,Grace Moses,Gilmer,117.57,174.63,70.31,136.08,381.02,Single-ply,SBD,F
Girls,117.71,8,Javin Crawford,Crandall,116.12,142.88,74.84,149.69,367.41,Single-ply,SBD,F
Girls,117.71,9,Kylie Reese,Mabank,107.59,138.35,61.23,122.47,322.05,Single-ply,SBD,F
Girls,117.71,10,Kayden Arnett,Crandall,109.41,117.93,68.04,136.08,322.05,Single-ply,SBD,F
Girls,117.71,DQ,Abrianna Larry,Crandall,117.48,,,,,Single-ply,SBD,F
Girls,117.71,DQ,Kaylie Turner,Paris,117.48,,,,,Single-ply,SBD,F
Girls,117.71,DQ,Mahogany Clark,Palestine,117.48,,,,,Single-ply,SBD,F
Girls,117.71,DQ,Kaylee Turner,Paris,117.48,,,,,Single-ply,SBD,F
Girls,117.71,DQ,Kalyn Williams,Waxahachie Life,117.48,,,,,Single-ply,SBD,F
Girls,117.71+,1,Leighann Langston,Bullard,141.88,183.7,136.08,156.49,476.27,Single-ply,SBD,F
Girls,117.71+,2,Bonnie Clifton,Gilmer,121.11,183.7,102.06,165.56,451.32,Single-ply,SBD,F
Girls,117.71+,3,Angela Daniels,Tyler Chapel Hill,124.74,167.83,72.57,140.61,381.02,Single-ply,SBD,F
Girls,117.71+,DQ,Latasha Frazier,Pittsburg,117.93,,,,,Single-ply,SBD,F
Girls,117.71+,DQ,Samantha Cepeda,Pittsburg,117.93,,,,,Single-ply,SBD,F
Girls,117.71+,DQ,Zeara Alexander,Paris,140.16,140.61,,,,Single-ply,SBD,F
Girls,117.71+,DQ,Makailah McConnell,Gilmer,132.63,,,,,Single-ply,SBD,F
