module test3

go 1.20

require (
	github.com/99designs/gqlgen v0.17.24
	github.com/go-chi/chi v1.5.4
	github.com/golang-jwt/jwt/v4 v4.4.3
	github.com/mattn/go-sqlite3 v1.14.16
	github.com/vektah/gqlparser/v2 v2.5.1
)

require (
	github.com/agnivade/levenshtein v1.1.1 // indirect
	github.com/cpuguy83/go-md2man/v2 v2.0.1 // indirect
	github.com/gorilla/websocket v1.5.0 // indirect
	github.com/hashicorp/golang-lru v0.5.4 // indirect
	github.com/mitchellh/mapstructure v1.5.0 // indirect
	github.com/rs/cors v1.8.3 // indirect
	github.com/russross/blackfriday/v2 v2.1.0 // indirect
	github.com/urfave/cli/v2 v2.8.1 // indirect
	github.com/xrash/smetrics v0.0.0-20201216005158-039620a65673 // indirect
	golang.org/x/mod v0.6.0-dev.0.20220419223038-86c51ed26bb4 // indirect
	golang.org/x/sys v0.0.0-20220811171246-fbc7d0a398ab // indirect
	golang.org/x/text v0.3.8 // indirect
	golang.org/x/tools v0.1.12 // indirect
	gopkg.in/yaml.v3 v3.0.1 // indirect
)
