<?xml version="1.0" encoding="utf-8"?>
<!-- Generator: Adobe Illustrator 20.0.0, SVG Export Plug-In . SVG Version: 6.00 Build 0)  -->
<!DOCTYPE svg PUBLIC "-//W3C//DTD SVG 1.1//EN" "http://www.w3.org/Graphics/SVG/1.1/DTD/svg11.dtd">
<svg version="1.1" id="Laag_1" xmlns="http://www.w3.org/2000/svg" xmlns:xlink="http://www.w3.org/1999/xlink" x="0px" y="0px"
	 viewBox="0 0 185 42" style="enable-background:new 0 0 185 42;" xml:space="preserve">
<style type="text/css">
	.st0{fill:#FFFFFF;}
	.st1{font-family:'SourceSansPro-Regular';}
	.st2{font-size:22px;}
	.st3{font-family:'SourceSansPro-Semibold';}
</style>
<text transform="matrix(1 0 0 1 10.2145 28.0618)"><tspan x="0" y="0" class="st0 st1 st2">Gemeente </tspan><tspan x="99.3" y="0" class="st0 st3 st2">Waalre</tspan></text>
</svg>
