<?xml version="1.0" encoding="utf-8"?>
<!-- Generator: Adobe Illustrator 26.2.1, SVG Export Plug-In . SVG Version: 6.00 Build 0)  -->
<svg version="1.1" id="Laag_1" xmlns="http://www.w3.org/2000/svg" xmlns:xlink="http://www.w3.org/1999/xlink" x="0px" y="0px"
	 viewBox="0 0 265.9 120.5" style="enable-background:new 0 0 265.9 120.5;" xml:space="preserve">
<style type="text/css">
	.st0{fill:#CF023F;}
	.st1{fill:#684F40;}
</style>
<g id="Ib1CSY_00000152233571887843783300000001744004438982826401_">
	<g>
		<path class="st0" d="M265.9,76.6c-0.6-0.1-0.8,0.1-1,0.7c-0.5,2.3-2,3.9-3.8,5.2c-3.3,2.5-7,3.8-11,4.7c-2,0.4-4,0.7-6,0.9
			c-2.4,0.2-4.9,0.2-7.3,0.2c-1.4,0-2.8-0.1-4.2-0.3c-1.7-0.1-3.3-0.5-4.9-0.8c-2.2-0.5-4.3-1.2-6.4-2.1c-1.3-0.5-2.4-1.2-3.5-2.1
			c-1.7-1.3-3.1-2.8-4-4.8c-0.3-0.7-0.3-1.3-0.5-2c-0.1-0.3,0-0.7,0.5-0.6c0.1,0,0.1,0,0.2,0c0.6,0,1.2-0.2,1.8,0
			c0.5,0.2,0.3,1,0.5,1.5c0.7,1.6,1.9,2.8,3.4,3.8c2.6,1.8,5.6,2.8,8.7,3.5c2.2,0.5,4.4,0.8,6.6,0.9c2.2,0.2,4.4,0.2,6.6,0.1
			c4.8-0.2,9.5-1,14-3c1.9-0.9,3.8-1.9,5.3-3.5c0.6-0.7,1.2-1.4,1.5-2.3c0-0.1,0.2-0.3,0-0.3c-0.7,0-0.4-0.5-0.5-0.9
			c0-0.8,0-1.7,0-2.5c0-0.4-0.1-0.5-0.5-0.5c-0.7,0-1.4,0-2.1,0c-0.4,0-0.5,0.1-0.5,0.5c0,0.7,0,1.4,0,2.2c0,0.3-0.1,0.4-0.4,0.4
			c-3.4,0-6.9,0-10.3,0c-0.4,0-0.4-0.1-0.4-0.5c0-0.7,0-1.4,0-2.2c0-0.3-0.1-0.4-0.4-0.4c-0.7,0-1.4,0-2.2,0c-0.3,0-0.4,0.1-0.4,0.4
			c0,0.7,0,1.4,0,2.2c0,0.3-0.1,0.4-0.4,0.4c-3.4,0-6.9,0-10.3,0c-0.3,0-0.4-0.1-0.4-0.4c0-0.7,0-1.4,0-2.2c0-0.3-0.1-0.4-0.4-0.4
			c-0.7,0-1.5,0-2.2,0c-0.3,0-0.4,0.1-0.4,0.4c0,0.7,0,1.5,0,2.2c0,0.3-0.1,0.4-0.4,0.4c-3.4,0-6.9,0-10.3,0c-0.4,0-0.5-0.1-0.5-0.5
			c0-0.7,0-1.4,0-2.1c0-0.4-0.1-0.5-0.5-0.5c-2,0-4,0-6,0c-0.5,0-0.6-0.1-0.6-0.6c0-3.6,0-7.2,0-10.8c0-0.5,0.1-0.6,0.6-0.6
			c3.3,0,6.7,0,10,0c0.5,0,0.6,0.2,0.6,0.6c0,0.7,0,1.3,0,2c0,0.3,0.1,0.5,0.4,0.4c0.7,0,1.4,0,2.2,0c0.3,0,0.4-0.1,0.4-0.4
			c0-0.7,0-1.4,0-2.1c0-0.3,0.1-0.5,0.4-0.5c3.4,0,6.9,0,10.3,0c0.4,0,0.5,0.1,0.5,0.5c0,0.7,0,1.4,0,2c0,0.4,0.1,0.5,0.5,0.5
			c0.7,0,1.4,0,2,0c0.4,0,0.5-0.1,0.5-0.5c0-0.7,0-1.4,0-2c0-0.4,0.1-0.5,0.5-0.5c3.4,0,6.8,0,10.2,0c0.4,0,0.5,0.1,0.5,0.5
			c0,0.7,0,1.4,0,2c0,0.3,0.1,0.5,0.5,0.5c0.7,0,1.4,0,2.2,0c0.3,0,0.4-0.1,0.4-0.4c0-0.7,0-1.4,0-2.1c0-0.4,0.1-0.5,0.5-0.5
			c2,0,3.9,0,5.9,0c0.5,0,0.6-0.1,0.6-0.6c0-3.1,0-6.1,0-9.2c0-0.5-0.1-0.6-0.6-0.6c-0.6,0-1.2,0-1.8,0c-0.5,0-0.6,0.2-0.6,0.6
			c0,0.6,0,1.3,0,1.9c0,0.3-0.1,0.5-0.4,0.5c-3.4,0-6.9,0-10.3,0c-0.4,0-0.5-0.1-0.5-0.5c0-0.7,0-1.4,0-2.1c0-0.3-0.1-0.4-0.4-0.4
			c-0.7,0-1.4,0-2.2,0c-0.3,0-0.4,0.1-0.4,0.5c0,0.7,0,1.4,0,2c0,0.4-0.1,0.5-0.5,0.5c-3.4,0-6.8,0-10.2,0c-0.4,0-0.5-0.1-0.5-0.5
			c0-0.7,0-1.4,0-2c0-0.4-0.1-0.5-0.5-0.5c-0.7,0-1.4,0-2.1,0c-0.3,0-0.4,0.1-0.4,0.4c0,0.7,0,1.4,0,2.2c0,0.3-0.1,0.4-0.4,0.4
			c-3.5,0-6.9,0-10.4,0c-0.3,0-0.4-0.1-0.4-0.4c0-0.7,0-1.4,0-2c0-0.4-0.1-0.6-0.6-0.6c-2,0-3.9,0-5.9,0c-0.5,0-0.7-0.1-0.7-0.6
			c0-3.6,0-7.2,0-10.8c0-0.5,0.1-0.6,0.6-0.6c3.3,0,6.7,0,10,0c0.4,0,0.6,0.1,0.6,0.6c0,0.6,0,1.3,0,1.9c0,0.5,0.2,0.6,0.6,0.5
			c0.6,0,1.3,0,1.9,0c0.4,0,0.6-0.1,0.5-0.5c0-0.7,0-1.4,0-2.1c0-0.3,0.1-0.4,0.4-0.4c3.4,0,6.9,0,10.3,0c0.3,0,0.4,0.1,0.4,0.4
			c0,0.7,0,1.4,0,2.1c0,0.3,0.1,0.5,0.4,0.5c0.7,0,1.4,0,2.1,0c0.3,0,0.4-0.1,0.4-0.4c0-0.7,0-1.4,0-2.2c0-0.3,0.1-0.4,0.4-0.4
			c3.4,0,6.9,0,10.3,0c0.4,0,0.5,0.1,0.5,0.5c0,0.7,0,1.4,0,2c0,0.4,0.1,0.5,0.5,0.5c0.7,0,1.4,0,2,0c0.4,0,0.5-0.1,0.5-0.5
			c0-0.7,0-1.4,0-2c0-0.4,0.1-0.5,0.5-0.5c2,0,4,0,6,0c0.5,0,0.7-0.1,0.6-0.6c0-1.1,0-2.3,0-3.4c0-0.4-0.1-0.6-0.6-0.6
			c-1.9,0-3.8,0-5.8,0c-14.2,0-28.3,0-42.5,0c-0.6,0-0.8-0.2-0.8-0.8c0.1-1,0-2,0-3c0-0.3,0.1-0.5,0.4-0.4c0.1,0,0.3,0,0.4,0
			c17.4,0,34.7,0,52.1,0c0.6,0,0.8,0.1,0.8,0.8c0,3.5,0,7,0,10.5c0,0.5-0.1,0.7-0.6,0.7c-1.9,0-3.9,0-5.8,0c-0.5,0-0.7,0.2-0.6,0.6
			c0,0.7,0,1.3,0,2c0,0.3-0.1,0.4-0.4,0.4c-3.5,0-6.9,0-10.4,0c-0.3,0-0.4-0.1-0.4-0.4c0-0.7,0-1.4,0-2.2c0-0.3-0.1-0.4-0.4-0.4
			c-0.7,0-1.4,0-2.2,0c-0.3,0-0.4,0.1-0.4,0.4c0,0.7,0,1.4,0,2.2c0,0.3-0.1,0.4-0.4,0.4c-3.5,0-6.9,0-10.4,0c-0.3,0-0.4-0.1-0.4-0.4
			c0-0.7,0-1.4,0-2.1c0-0.4-0.1-0.5-0.5-0.5c-0.7,0-1.4,0-2,0c-0.4,0-0.5,0.1-0.5,0.5c0,0.7,0,1.4,0,2c0,0.4,0,0.5-0.5,0.5
			c-3.4,0-6.9,0-10.3,0c-0.3,0-0.4-0.1-0.4-0.4c0-0.7,0-1.4,0-2.2c0-0.3-0.1-0.4-0.4-0.4c-0.7,0-1.4,0-2.2,0c-0.3,0-0.4,0.1-0.4,0.4
			c0,1.7,0,3.4,0,5.1c0,0.4,0.2,0.4,0.5,0.4c2,0,4,0,6,0c0.5,0,0.6,0.1,0.6,0.6c0,0.7,0,1.3,0,2c0,0.3,0,0.5,0.4,0.5
			c0.7,0,1.5,0,2.2,0c0.3,0,0.4-0.1,0.4-0.4c0-0.7,0-1.4,0-2.2c0-0.3,0.1-0.4,0.4-0.4c3.4,0,6.9,0,10.3,0c0.3,0,0.4,0.1,0.4,0.5
			c0,0.7,0,1.4,0,2.1c0,0.3,0.1,0.5,0.4,0.5c0.7,0,1.4,0,2.1,0c0.3,0,0.4-0.1,0.4-0.4c0-0.7,0-1.4,0-2.2c0-0.3,0.1-0.4,0.4-0.4
			c3.4,0,6.9,0,10.3,0c0.4,0,0.5,0.2,0.4,0.5c0,0.7,0,1.4,0,2.1c0,0.3,0.1,0.4,0.4,0.4c0.7,0,1.4,0,2.2,0c0.4,0,0.4-0.2,0.4-0.5
			c0-0.7,0-1.4,0-2.1c0-0.3,0.1-0.5,0.4-0.5c3.4,0,6.9,0,10.3,0c0.4,0,0.5,0.1,0.5,0.5c0,5.2,0,10.4,0,15.5c0,0.4-0.1,0.4-0.5,0.4
			c-2,0-4,0-6,0c-0.4,0-0.6,0.1-0.6,0.6c0,0.7,0,1.4,0,2c0,0.4-0.1,0.5-0.5,0.5c-3.4,0-6.8,0-10.2,0c-0.4,0-0.5-0.1-0.5-0.5
			c0-0.7,0-1.4,0-2.2c0-0.3-0.1-0.4-0.4-0.4c-0.7,0-1.4,0-2.2,0c-0.4,0-0.5,0.2-0.4,0.5c0,0.7,0,1.4,0,2.1c0,0.4-0.1,0.5-0.5,0.5
			c-3.4,0-6.8,0-10.2,0c-0.4,0-0.5-0.1-0.5-0.5c0-0.7,0-1.4,0-2.1c0-0.3,0-0.5-0.4-0.5c-0.7,0-1.5,0-2.2,0c-0.3,0-0.4,0.1-0.4,0.4
			c0,0.7,0,1.5,0,2.2c0,0.4-0.1,0.5-0.5,0.5c-3.4,0-6.9,0-10.3,0c-0.3,0-0.4-0.1-0.4-0.4c0-0.7,0-1.5,0-2.2c0-0.3-0.1-0.4-0.4-0.4
			c-0.7,0-1.5,0-2.2,0c-0.3,0-0.4,0.1-0.4,0.4c0,1.7,0,3.4,0,5.1c0,0.4,0.1,0.5,0.5,0.5c2,0,4,0,6,0c0.5,0,0.6,0.1,0.6,0.6
			c0,0.6,0,1.3,0,1.9c0,0.4,0.1,0.5,0.5,0.5c0.7,0,1.4,0,2.1,0c0.3,0,0.4-0.1,0.4-0.4c0-0.7,0-1.4,0-2.1c0-0.3,0.1-0.5,0.4-0.5
			c3.4,0,6.9,0,10.3,0c0.4,0,0.5,0.1,0.5,0.5c0,0.7,0,1.4,0,2c0,0.4,0.1,0.5,0.5,0.5c0.7,0,1.4,0,2,0c0.4,0,0.5-0.1,0.5-0.5
			c0-0.7,0-1.4,0-2c0-0.4,0.1-0.5,0.5-0.5c3.4,0,6.8,0,10.2,0c0.4,0,0.5,0.1,0.5,0.5c0,0.7,0,1.4,0,2c0,0.3,0.1,0.5,0.5,0.5
			c0.7,0,1.4,0,2.2,0c0.3,0,0.4-0.1,0.4-0.4c0-0.7,0-1.4,0-2c0-0.5,0.2-0.6,0.6-0.6c3.4,0,6.9,0,10.3,0c0.1,0,0.2,0,0.3,0
			C265.9,72,265.9,74.3,265.9,76.6z"/>
		<path class="st0" d="M198.8,0c0,0.2,0,0.5,0,0.7c0,29.4,0,52.8,0,82.2c0,0.6-0.1,0.9-0.8,0.8c-0.6-0.1-1.4,0.2-1.7-0.1
			c-0.4-0.4-0.1-1.2-0.1-1.8c0-29,0-52,0-81c0-0.3,0.1-0.5-0.1-0.8C197,0,197.9,0,198.8,0z"/>
		<path class="st0" d="M187.3,120.5c0-2.6,0-5.3,0-7.9c0-0.3,0.1-0.4,0.4-0.4c2.5,0,5,0,7.6,0c0.5,0,0.4,0.3,0.4,0.6
			c0,2.6,0,5.2,0,7.8C192.9,120.5,190.1,120.5,187.3,120.5z"/>
		<path class="st1" d="M0,37c0.3-0.9,0.5-1.8,0.9-2.6c2.4-4.8,9.2-5.8,12.9-1.8c0.1,0.1,0.2,0.2,0.4,0.3c0-0.7,0-1.3,0-2
			c0-0.4,0.1-0.5,0.5-0.5c0.4,0,0.6,0.1,0.5,0.5c0,1.4,0,2.8,0,4.3c0,0.2,0.1,0.5-0.2,0.5c-0.3,0-0.8,0.3-0.9-0.3
			c-0.8-2.8-4.4-4.7-7.8-3.8c-3.2,0.8-5.2,3.8-5,7.2c0.3,3.6,2.3,6.1,5.7,6.6c2.3,0.4,4.5-0.1,6.3-1.8c0.7-0.7,1.1-1.6,1.4-2.5
			c0.1-0.5,0.1-0.7-0.5-0.7c-1,0-2.1,0-3.1,0c-0.5,0-0.5-0.2-0.5-0.6c0-0.4,0-0.6,0.5-0.6c1.6,0,3.1,0,4.7,0c0.4,0,0.5,0.1,0.5,0.5
			c-0.2,3.7-2.8,6.4-6.5,6.9C7.3,46.8,5,46.5,3,44.9c-1.6-1.2-2.5-2.9-2.9-4.8c0-0.1,0-0.3-0.1-0.3C0,38.9,0,38,0,37z"/>
		<path class="st1" d="M108.2,46.4c-1.6,0-3.2,0-4.8,0c-0.5,0-0.6-0.1-0.6-0.6c0-0.5,0-1.1,0-1.6c0-0.4,0.1-0.5,0.5-0.5
			c0.5,0,1,0,1.5,0c0.4,0,0.5-0.1,0.5-0.5c0-3.2,0-6.4,0-9.6c0-0.4-0.1-0.5-0.5-0.5c-0.5,0-1,0-1.5,0c-0.3,0-0.5-0.1-0.5-0.4
			c0-0.6,0-1.2,0-1.8c0-0.3,0.1-0.4,0.4-0.4c3.1,0,6.2-0.1,9.3,0.1c3.5,0.1,6,1.8,7,5c0.9,2.9,0.6,5.6-1.2,8.1
			c-1.1,1.5-2.6,2.4-4.5,2.7c-1.7,0.3-3.5,0.1-5.2,0.1C108.4,46.4,108.3,46.4,108.2,46.4z M109.4,38.4c0,1.6,0,3.2,0,4.8
			c0,0.3,0.1,0.5,0.4,0.5c0.5,0,1.1,0,1.6,0c1.9-0.1,3.2-1.2,3.8-3c0.4-1.2,0.4-2.5,0.1-3.8c-0.4-2.3-1.7-3.4-4-3.7
			c-0.5-0.1-1,0-1.5-0.1c-0.4,0-0.5,0.1-0.5,0.5C109.4,35.2,109.4,36.8,109.4,38.4z"/>
		<path class="st1" d="M153.5,36.4c0.1-1.2,0.1-1.2,1.2-1.2c1.3,0,2.7,0,4,0c0.3,0,0.5,0.1,0.5,0.5c0,0.5,0,1.1,0,1.6
			c0,0.4-0.2,0.5-0.5,0.5c-1.4,0-1.4,0-1.4,1.4c0,2.3,0,4.6,0,6.8c0,3.4-1.8,5.3-5.2,5.5c-1.4,0.1-2.9,0-4.3-0.4
			c-0.1,0-0.1,0-0.2-0.1c-0.4-0.1-0.8-0.3-1-0.6c-0.3-0.5,0.3-0.6,0.4-0.9c0,0,0,0,0-0.1c0.3-0.4,0.6-1,1-1.3
			c0.5-0.3,0.9,0.3,1.4,0.4c1.1,0.3,2.1,0.4,3.1-0.2c0.8-0.5,1.5-2.2,1.1-3c-0.2-0.3-0.4,0-0.5,0.1c-0.6,0.4-1.2,0.8-2,0.9
			c-1.4,0.3-2.6,0-3.6-1c-1.5-1.4-2-3.2-1.9-5.1c0.1-1.5,0.6-2.9,1.7-4c1.6-1.6,4.3-1.7,5.9-0.2C153.3,36.2,153.4,36.3,153.5,36.4z
			 M151.5,38c-0.9,0-1.6,0.5-1.9,1.3c-0.4,0.9-0.4,1.9,0,2.8c0.3,0.9,1,1.4,1.8,1.5c0.9,0,1.7-0.4,2-1.3c0.4-1,0.4-2.1,0-3.1
			C153,38.5,152.4,38.1,151.5,38z"/>
		<path class="st1" d="M137.7,36.1c1-0.7,2.1-1.1,3.4-1c1.6,0.1,2.9,1.2,3,2.8c0.2,1.7,0.1,3.5,0.1,5.2c0,0.5,0.1,0.7,0.6,0.6
			c1,0,1.1,0,1.1,1.1c0,1.6,0,1.6-1.5,1.6c-1.1,0-2.1,0-3.2,0c-0.5,0-0.6-0.1-0.6-0.6c0-2.1,0-4.1,0-6.2c0-0.2,0-0.5-0.1-0.7
			c-0.2-0.5-0.4-0.7-1-0.7c-0.5,0-1,0.1-1.4,0.4c-0.3,0.2-0.4,0.4-0.4,0.7c0,1.3,0,2.6,0,3.9c0,0.4,0.1,0.6,0.6,0.6
			c0.9,0,0.9,0,0.9,0.9c0,0.5,0.2,1.3-0.1,1.6c-0.4,0.4-1.1,0.1-1.6,0.1c-1.5,0-3,0-4.6,0c-0.4,0-0.5-0.1-0.5-0.5c0-0.6,0-1.1,0-1.7
			c0-0.3,0.1-0.4,0.4-0.4c1.3,0,1.3-0.1,1.3-1.3c0-1.4,0-2.7,0-4.1c0-0.4-0.1-0.5-0.5-0.5c-1.2,0-1.2,0-1.2-1.2c0-1.3,0-1.3,1.4-1.3
			c1,0,2.1,0,3.1,0C137.7,35.3,137.7,35.3,137.7,36.1z"/>
		<path class="st1" d="M174.4,46.4c-1,0-1.9,0-2.9,0c-0.5,0-0.6-0.1-0.6-0.6c0-0.5,0-1,0-1.5c0-0.5,0.1-0.6,0.6-0.6
			c1.2,0,1.2,0,1.2-1.1c0-1.4,0-2.8,0-4.2c0-0.4-0.1-0.6-0.6-0.6c-1.2,0-1.2,0-1.2-1.2c0-1.4,0-1.4,1.4-1.4c1.2,0,2.3,0,3.5,0
			c0.2,0,0.5,0,0.5,0.3c-0.1,0.8,0.4,0.4,0.6,0.3c0.9-0.6,1.8-0.8,2.8-0.7c2.1,0.1,3.1,1.6,3.2,3.2c0.1,1.6,0.1,3.1,0,4.7
			c0,0.6,0.2,0.8,0.8,0.7c0.1,0,0.3,0,0.4,0c0.3,0,0.5,0.1,0.5,0.4c-0.1,0.7,0.3,1.6-0.1,2.1c-0.4,0.4-1.3,0.1-2,0.1
			c-0.9,0-1.8,0-2.7,0c-0.4,0-0.5-0.1-0.5-0.5c0-2.1,0-4.2,0-6.3c0-1.3-0.6-1.7-1.8-1.3c-1.1,0.3-1.1,0.3-1.1,1.5c0,1.1,0,2.3,0,3.4
			c0,0.5,0.1,0.6,0.6,0.6c0.9,0,0.9,0,0.9,0.9c0,0.5,0.2,1.3-0.1,1.6c-0.4,0.4-1.1,0.1-1.6,0.1C175.5,46.4,174.9,46.4,174.4,46.4z"
			/>
		<path class="st1" d="M120.3,40.8c-0.1-3.6,2.4-5.9,6-5.8c3,0.1,5.9,2,5.7,6.4c-0.2,2.7-2.4,5.4-6,5.3
			C122.7,46.6,120.2,44.3,120.3,40.8z M128.4,40.8c0-0.6-0.1-1.2-0.3-1.8c-0.4-0.8-1-1.2-1.8-1.2c-0.9,0-1.5,0.4-1.8,1.1
			c-0.5,1.3-0.6,2.6,0,3.8c0.3,0.7,0.9,1.1,1.8,1.1c0.8,0,1.4-0.4,1.8-1.1C128.3,42.1,128.3,41.5,128.4,40.8z"/>
		<path class="st1" d="M166.7,41.6c-1.2,0-2.4,0-3.6,0c-0.5,0-0.5,0.2-0.4,0.6c0.4,2.3,3,2.9,4.5,1.4c0.4-0.4,0.9-0.6,1.4-0.3
			c0.5,0.2,1.1,0.4,1.6,0.5c0.5,0.1,0.5,0.3,0.2,0.6c-0.8,0.9-1.7,1.6-2.8,1.9c-1.9,0.6-3.9,0.6-5.7-0.3c-1.7-0.8-2.8-2.2-2.9-4.2
			c-0.2-2,0.2-3.8,1.6-5.2c1.5-1.5,3.3-1.9,5.3-1.5c3.1,0.5,4.8,3.1,4.7,6c0,0.4-0.1,0.5-0.5,0.5C169,41.6,167.8,41.6,166.7,41.6z
			 M162.6,39.6c1.4,0,2.7,0,4.1,0c0.5,0,0.5-0.1,0.4-0.5c-0.3-1.1-1.3-1.8-2.4-1.7C163.5,37.5,162.8,38.1,162.6,39.6z"/>
		<path class="st1" d="M31.2,36.9c1-0.8,1.9-1.4,3-1.7c1.6-0.4,3.3,0,3.9,1.5c0.2,0.4,0.3,0.1,0.4,0c0.8-0.6,1.6-1.1,2.5-1.4
			c0.5-0.2,1.1-0.3,1.6-0.3c1.9,0.1,2.8,1.1,2.8,3c0,2.2,0,4.4,0,6.5c0,0.5,0.1,0.7,0.7,0.7c0.2,0,0.3,0,0.5,0
			c0.5-0.1,0.7,0.1,0.6,0.6c0,0.3-0.1,0.5-0.5,0.5c-1.4,0-2.7,0-4.1,0c-0.5,0-0.4-0.3-0.4-0.6c0-0.3,0-0.6,0.4-0.5c0,0,0.1,0,0.1,0
			c1.4,0,1.4,0,1.4-1.5c0-1.8,0-3.5,0-5.3c0-2-1-2.7-2.9-2.2c-1,0.3-1.9,0.9-2.6,1.6c-0.2,0.2-0.3,0.4-0.3,0.7c0,2.1,0,4.1,0,6.2
			c0,0.4,0.1,0.5,0.5,0.5c0.3,0,0.5,0,0.8,0c0.5-0.1,0.6,0.2,0.6,0.6c0,0.4-0.1,0.5-0.5,0.5c-1.3,0-2.7,0-4,0
			c-0.5,0-0.5-0.2-0.5-0.6c0-0.3,0-0.6,0.5-0.6c0.5,0,1.1,0.2,1.4-0.1c0.2-0.3,0.1-0.9,0.1-1.4c0-1.7,0-3.4,0-5.1c0-2.1-1-2.8-3-2.2
			c-1.1,0.3-1.9,1-2.7,1.7c-0.2,0.2-0.2,0.4-0.2,0.6c0,2.1,0,4.1,0,6.2c0,0.4,0.1,0.5,0.5,0.5c0.2,0,0.5,0,0.7,0
			c0.6-0.1,0.7,0.2,0.6,0.7c0,0.4-0.1,0.5-0.5,0.4c-1.4,0-2.8,0-4.1,0c-0.5,0-0.5-0.3-0.5-0.6c0-0.4,0-0.5,0.5-0.5
			c0.5,0,1.2,0.3,1.4-0.1c0.2-0.3,0.1-1,0.1-1.5c0-2.3,0-4.5,0-6.8c0-0.5-0.1-0.6-0.6-0.6c-0.3,0-0.5,0-0.8,0
			c-0.7,0.1-0.7-0.3-0.7-0.8c0-0.3,0.1-0.3,0.3-0.3c0.8,0,1.7,0,2.5,0c0.3,0,0.4,0.1,0.4,0.4C31.2,36,31.2,36.4,31.2,36.9z"/>
		<path class="st0" d="M195.7,91.9c0,1.2,0,2.5,0,3.7c0,0.4-0.1,0.5-0.5,0.5c-2.5,0-5,0-7.5,0c-0.4,0-0.5-0.1-0.5-0.5
			c0-2.5,0-4.9,0-7.4c0-0.4,0.1-0.5,0.5-0.5c2.5,0,4.9,0,7.4,0c0.4,0,0.5,0.2,0.5,0.5C195.7,89.4,195.7,90.6,195.7,91.9z"/>
		<path class="st0" d="M203.7,100c1.2,0,2.5,0,3.7,0c0.4,0,0.6,0.1,0.5,0.5c0,2.5,0,4.9,0,7.4c0,0.4-0.1,0.5-0.5,0.5
			c-2.5,0-4.9,0-7.4,0c-0.4,0-0.5-0.1-0.5-0.5c0-2.5,0-5,0-7.5c0-0.4,0.1-0.5,0.5-0.5C201.2,100,202.5,100,203.7,100z"/>
		<path class="st1" d="M64.8,41.1c-1.5,0-3,0-4.5,0c-0.4,0-0.5,0.1-0.5,0.5c0.3,1.8,1.3,3.1,3,3.8c1.8,0.7,3.5,0.3,5-1
			c0.2-0.2,0.4-0.4,0.6-0.6c0.4-0.4,0.7-0.5,1.2-0.1c0.3,0.2,0,0.3-0.1,0.5c-1,1.4-2.3,2.2-4,2.5c-2.5,0.5-5-0.5-6.2-2.6
			c-1.3-2.2-1.1-5.4,0.6-7.2c1.6-1.8,3.7-2.3,5.9-1.7c2.2,0.6,3.3,2.3,3.8,4.4c0.3,1.5,0.3,1.5-1.2,1.5C67.2,41.1,66,41.1,64.8,41.1
			z M64.2,40c1.2,0,2.5,0,3.7,0c0.6,0,0.7-0.2,0.5-0.7C67.8,37.2,66.2,36,64,36c-2,0-3.5,1.4-4,3.5c-0.1,0.4,0,0.5,0.4,0.5
			C61.6,40,62.9,40,64.2,40z"/>
		<path class="st1" d="M53.3,41.1c-1.5,0-3,0-4.4,0c-0.5,0-0.6,0.1-0.5,0.6c0.3,1.8,1.3,3.1,3,3.7c1.8,0.7,3.5,0.2,4.9-1
			c0.3-0.2,0.5-0.5,0.8-0.8c0.2-0.2,0.3-0.2,0.5-0.1c0.7,0.3,0.7,0.3,0.3,0.9c-2.6,3.4-8.1,3.2-10.1-0.4c-1.9-3.3-0.4-7.6,3-8.7
			c3.6-1.1,7.2,0.8,7.5,5.5c0,0.4-0.2,0.4-0.4,0.4C56.3,41.1,54.8,41.1,53.3,41.1z M52.6,40c1.2,0,2.5,0,3.7,0
			c0.6,0,0.6-0.2,0.5-0.7c-0.6-2.2-2.1-3.3-4.3-3.3c-2,0-3.6,1.3-4.1,3.4c-0.1,0.5,0,0.6,0.5,0.6C50.1,40,51.3,40,52.6,40z"/>
		<path class="st1" d="M72.7,36.9c0.7-0.5,1.3-0.9,2-1.2c0.8-0.4,1.7-0.6,2.6-0.5c1.6,0.2,2.6,1.2,2.6,2.8c0,2.3,0,4.5,0,6.8
			c0,0.5,0.1,0.7,0.6,0.6c0.2,0,0.4,0,0.6,0c0.6-0.1,0.7,0.2,0.6,0.7c0,0.3-0.1,0.4-0.4,0.4c-1.4,0-2.7,0-4.1,0
			c-0.5,0-0.5-0.2-0.4-0.6c0-0.3-0.1-0.6,0.4-0.6c0,0,0,0,0.1,0c0.5,0,1.1,0.1,1.3-0.1c0.3-0.3,0.1-1,0.1-1.5c0-1.8,0-3.7,0-5.5
			c0-1.5-0.8-2.2-2.3-2c-1.4,0.2-2.5,0.9-3.5,1.8c-0.2,0.1-0.2,0.3-0.2,0.5c0,2.1,0,4.1,0,6.2c0,0.4,0.1,0.5,0.5,0.5
			c0.2,0,0.5,0,0.7,0c0.6-0.1,0.7,0.2,0.6,0.7c0,0.3-0.1,0.4-0.4,0.4c-1.4,0-2.8,0-4.3,0c-0.5,0-0.5-0.2-0.4-0.6
			c0-0.3-0.1-0.6,0.4-0.6c0,0,0,0,0.1,0c0.5,0,1.2,0.2,1.5-0.1c0.4-0.3,0.1-1,0.1-1.6c0-2.2,0-4.5,0-6.7c0-0.4-0.1-0.6-0.6-0.6
			c-0.3,0-0.6,0-1,0c-0.5,0.1-0.6-0.2-0.6-0.6c0-0.3,0.1-0.5,0.5-0.5c0.8,0,1.6,0,2.4,0c0.4,0,0.5,0.1,0.5,0.5
			C72.6,36.1,72.7,36.4,72.7,36.9z"/>
		<path class="st1" d="M23.2,41.1c-1.5,0-3,0-4.4,0c-0.5,0-0.6,0.2-0.5,0.6c0.3,3.1,3.9,4.9,6.8,3.5c0.8-0.4,1.4-0.9,1.9-1.6
			c0.4-0.5,0.7-0.1,1,0.1c0.4,0.2,0,0.4-0.1,0.6c-1.7,2.2-4,2.9-6.6,2.3c-2.4-0.5-3.8-2.1-4.2-4.5c-0.7-3.3,1.1-6.3,4.2-6.9
			c3.8-0.9,6.8,1.5,7,5.6c0,0.4-0.1,0.4-0.5,0.4C26.2,41.1,24.7,41.1,23.2,41.1z M22.5,40c1.3,0,2.6,0,3.9,0c0.2,0,0.5,0.1,0.4-0.3
			c-0.3-1-0.7-2-1.5-2.7c-1.3-1.1-2.8-1.3-4.3-0.7c-1.6,0.6-2.3,1.9-2.7,3.4c-0.1,0.4,0.2,0.3,0.4,0.3C20,40,21.3,40,22.5,40z"/>
		<path class="st1" d="M92.2,41.1c-1.5,0-3,0-4.4,0c-0.6,0-0.6,0.2-0.5,0.7c0.5,3.3,4.1,5,7.1,3.3c0.6-0.4,1.2-0.8,1.6-1.5
			c0.4-0.5,0.7-0.1,1,0c0.4,0.2,0,0.4-0.1,0.6c-1.5,2.2-4.8,3.1-7.5,2.1c-2.4-1-3.8-3.6-3.4-6.4c0.7-4.7,5.3-5.9,8.2-4.4
			c2.1,1.1,2.8,3,3,5.3c0,0.4-0.3,0.3-0.5,0.3C95.2,41.1,93.7,41.1,92.2,41.1z M91.5,40c1.3,0,2.6,0,3.9,0c0.3,0,0.5,0,0.4-0.4
			c-0.5-2.2-2.1-3.6-4.3-3.6c-2.1,0-3.8,1.4-4.2,3.6c-0.1,0.5,0.1,0.4,0.4,0.4C89,40,90.2,40,91.5,40z"/>
		<path class="st1" d="M83.6,31.8c0,1,0,1.9,0,2.9c0,0.5,0.1,0.6,0.6,0.6c0.4,0,0.8,0,1.1,0c0.6,0,0.8,0.3,0.6,0.9
			c-0.1,0.2-0.2,0.2-0.4,0.2c-0.5,0-1,0-1.5,0c-0.3,0-0.5,0.1-0.5,0.5c0,2.5,0,5,0,7.5c0,1.1,0.4,1.4,1.5,1.2c0.3,0,0.5-0.1,0.8-0.1
			c0.1,1.3,0.2,1.1-0.9,1.3c-0.2,0-0.5,0.1-0.8,0.1c-1.2,0-1.9-0.7-1.9-1.9c0-2.6,0-5.2,0-7.8c0-0.5-0.1-0.7-0.6-0.6
			c-0.2,0-0.5,0-0.8,0c-0.6,0.1-0.7-0.2-0.6-0.7c0-0.3,0.1-0.5,0.4-0.4c0,0,0,0,0.1,0c0.5,0,1.1,0.2,1.4-0.1c0.3-0.3,0.2-1,0.1-1.4
			C82.2,32.7,82.8,32.3,83.6,31.8z"/>
	</g>
</g>
</svg>
