<svg id="Laag_1" data-name="Laag 1" xmlns="http://www.w3.org/2000/svg" viewBox="0 0 231.85 86.53">
    <defs>
        <style>.cls-1{fill:#0086cb;}</style>
    </defs>
    <title>Logo_sv</title>
    <path class="cls-1"
          d="M55.16,35h0c-3-1.08-6,2.85-9,.54-3.23-2.47-6.46,2.28-9.69.28l-.32-.23V19.16h19Zm0,18.49c0,9.21-7.92,10.14-12.11,10.69a13.65,13.65,0,0,0-6.94,3.12h0V44.67H29.87V64.24l-.71-.11a25.34,25.34,0,0,1-5.87-1.27V44.67H17.06V35.54h6.23V19.16h6.58V35.54h6.24v9.13h0c3.34,2.55,6.68-2.56,10,0,3,2.3,6-1.63,9-.55h0Zm0-35.27H17.06a1,1,0,0,0-1,1V53.44c0,10,8.68,11.11,12.84,11.65l.13,0A12.75,12.75,0,0,1,35.44,68a1,1,0,0,0,1.34,0,12.8,12.8,0,0,1,6.39-2.86l.13,0c4.17-.54,12.84-1.66,12.84-11.65V19.16a1,1,0,0,0-1-1"/>
    <path class="cls-1"
          d="M130.17,27.82a1.54,1.54,0,0,1,1.13-.45,1.49,1.49,0,0,1,1.19.56,1.92,1.92,0,0,1,.36,1.08h-3.18a1.76,1.76,0,0,1,.5-1.19m2.08,3.65a1.51,1.51,0,0,1-.91.27,1.59,1.59,0,0,1-1.19-.49,2.16,2.16,0,0,1-.53-1.44h4.25c0-.12,0-.2,0-.26a3.09,3.09,0,0,0-.73-2.2,2.69,2.69,0,0,0-3.79,0,3.18,3.18,0,0,0-.74,2.24,3,3,0,0,0,.73,2.16,3,3,0,0,0,3.62.29,2.41,2.41,0,0,0,.88-1.36l-1-.13a1.92,1.92,0,0,1-.6.9m-4.73.11a.56.56,0,0,1-.32-.07.33.33,0,0,1-.17-.18,1.54,1.54,0,0,1,0-.53V27.46h1v-.75h-1v-2l-1,.58v1.42h-.7v.75h.7v3.28a3.4,3.4,0,0,0,.12,1.14.92.92,0,0,0,.41.44,1.67,1.67,0,0,0,.82.17,3.45,3.45,0,0,0,.73-.09l-.14-.85-.43,0m-6.87.83V29.3a1.93,1.93,0,0,1,.45-1.49,1.59,1.59,0,0,1,1.07-.39,1.25,1.25,0,0,1,.68.17.89.89,0,0,1,.39.47,2.43,2.43,0,0,1,.12.88v3.47h1V28.9a4.83,4.83,0,0,0-.06-.93,2,2,0,0,0-.3-.72,1.53,1.53,0,0,0-.65-.49,2.44,2.44,0,0,0-.95-.18,2,2,0,0,0-1.81.94v-.81h-.87v5.7Zm-6-4.59a1.55,1.55,0,0,1,1.12-.45,1.48,1.48,0,0,1,1.2.56,1.84,1.84,0,0,1,.37,1.08h-3.19a1.81,1.81,0,0,1,.5-1.19m2.08,3.65a1.51,1.51,0,0,1-.91.27,1.59,1.59,0,0,1-1.19-.49,2.22,2.22,0,0,1-.53-1.44h4.25c0-.12,0-.2,0-.26a3.09,3.09,0,0,0-.73-2.2,2.46,2.46,0,0,0-1.87-.77,2.5,2.5,0,0,0-1.92.79,3.18,3.18,0,0,0-.74,2.24,3,3,0,0,0,.73,2.16,3,3,0,0,0,3.62.29,2.41,2.41,0,0,0,.88-1.36l-1-.13a1.92,1.92,0,0,1-.6.9m-8.34-3.65a1.55,1.55,0,0,1,1.12-.45,1.5,1.5,0,0,1,1.2.56A2,2,0,0,1,111.1,29h-3.19a1.76,1.76,0,0,1,.5-1.19m2.08,3.65a1.51,1.51,0,0,1-.91.27,1.59,1.59,0,0,1-1.19-.49,2.16,2.16,0,0,1-.53-1.44h4.25c0-.12,0-.2,0-.26a3.09,3.09,0,0,0-.73-2.2,2.45,2.45,0,0,0-1.87-.77,2.5,2.5,0,0,0-1.92.79,3.14,3.14,0,0,0-.74,2.24,3,3,0,0,0,.74,2.16,2.59,2.59,0,0,0,2,.77,2.65,2.65,0,0,0,1.63-.48,2.35,2.35,0,0,0,.87-1.36l-1-.13a1.92,1.92,0,0,1-.6.9m-11.65.94v-3A3.37,3.37,0,0,1,99,28.26a1.21,1.21,0,0,1,.5-.63,1.43,1.43,0,0,1,.76-.21.89.89,0,0,1,.77.32,1.61,1.61,0,0,1,.24,1v3.7h1V29.1a1.77,1.77,0,0,1,.4-1.28,1.33,1.33,0,0,1,1-.4,1.11,1.11,0,0,1,.58.15.8.8,0,0,1,.34.41,2.78,2.78,0,0,1,.09.84v3.59h1V28.5a2,2,0,0,0-.46-1.45,1.76,1.76,0,0,0-1.31-.47,2,2,0,0,0-1.76,1,1.41,1.41,0,0,0-.57-.74,1.93,1.93,0,0,0-1-.26,2,2,0,0,0-1,.25,2,2,0,0,0-.72.68v-.8h-.87v5.7Zm-6-4.59A1.53,1.53,0,0,1,94,27.37a1.5,1.5,0,0,1,1.2.56A2,2,0,0,1,95.55,29H92.36a1.76,1.76,0,0,1,.5-1.19m2.08,3.65a1.55,1.55,0,0,1-.91.27,1.59,1.59,0,0,1-1.19-.49,2.16,2.16,0,0,1-.53-1.44h4.25c0-.12,0-.2,0-.26a3.14,3.14,0,0,0-.73-2.2A2.45,2.45,0,0,0,94,26.58a2.49,2.49,0,0,0-1.92.79,3.14,3.14,0,0,0-.74,2.24A3,3,0,0,0,92,31.77a2.62,2.62,0,0,0,2,.77,2.68,2.68,0,0,0,1.64-.48,2.52,2.52,0,0,0,.88-1.36l-1-.13a1.92,1.92,0,0,1-.6.9m-8.5-3.57a1.4,1.4,0,0,1,1.1-.52,1.43,1.43,0,0,1,1.11.53,2.35,2.35,0,0,1,.47,1.58,2.4,2.4,0,0,1-.45,1.61,1.44,1.44,0,0,1-1.12.51,1.43,1.43,0,0,1-1.12-.51A2.53,2.53,0,0,1,86,29.46a2.34,2.34,0,0,1,.45-1.56m-.65,6.37a2.71,2.71,0,0,0,1.65.46,2.93,2.93,0,0,0,1.45-.33,2,2,0,0,0,.86-.87A4.7,4.7,0,0,0,90,31.64V26.71h-.89v.69a2,2,0,0,0-1.67-.82A2.22,2.22,0,0,0,85.29,28a3.73,3.73,0,0,0-.3,1.51,3.19,3.19,0,0,0,.65,2,2.13,2.13,0,0,0,1.82.85A2,2,0,0,0,89,31.66,6.55,6.55,0,0,1,89,32.91a1.32,1.32,0,0,1-.5.75,1.71,1.71,0,0,1-1,.27,1.62,1.62,0,0,1-1-.27.94.94,0,0,1-.33-.63l-.94-.15a1.58,1.58,0,0,0,.61,1.39"/>
    <path class="cls-1"
          d="M147.65,52.15a4.27,4.27,0,0,0,1.25-.78,3.19,3.19,0,0,0,.81-1.18,4.14,4.14,0,0,0,.29-1.64,4.57,4.57,0,0,0-.38-1.85,4.64,4.64,0,0,0-1-1.53,4.74,4.74,0,0,0-1.53-1,4.41,4.41,0,0,0-1.85-.38,4.55,4.55,0,0,0-1.88.38,5,5,0,0,0-1.54,1,4.66,4.66,0,0,0-1,1.53,4.57,4.57,0,0,0-.38,1.85v4a4.69,4.69,0,0,0,.38,1.86,5,5,0,0,0,1,1.55A4.83,4.83,0,0,0,143.31,57a4.47,4.47,0,0,0,1.85.38,9.51,9.51,0,0,0,1.84-.19,3.44,3.44,0,0,0,1.65-.79.86.86,0,0,0,.34-.66.89.89,0,0,0-.26-.65.93.93,0,0,0-.63-.25,1.12,1.12,0,0,0-.29,0,.8.8,0,0,0-.21.13,3.66,3.66,0,0,1-1.08.48,4.83,4.83,0,0,1-1.15.14,3.56,3.56,0,0,1-1.26-.23,3.07,3.07,0,0,1-1-.63,2.89,2.89,0,0,1-.69-1,3,3,0,0,1-.25-1.25v-4a3,3,0,0,1,.24-1.18,3.12,3.12,0,0,1,.65-1,3,3,0,0,1,1-.66,3,3,0,0,1,1.2-.24,2.92,2.92,0,0,1,1.17.24,3.16,3.16,0,0,1,1,.66,3.13,3.13,0,0,1,.9,2.15,2.4,2.4,0,0,1-.19,1,1.56,1.56,0,0,1-.48.65,1.88,1.88,0,0,1-.7.37,8,8,0,0,1-.81.2l-.41.07a2.57,2.57,0,0,0-.4.07c-.3,0-.55.09-.73.13a2,2,0,0,0-.54.3.69.69,0,0,0-.22.55.91.91,0,0,0,.25.63.84.84,0,0,0,.63.26,2.87,2.87,0,0,0,.73-.08l.71-.14a7.37,7.37,0,0,0,1.57-.44"/>
    <path class="cls-1"
          d="M135.49,57.13a3.6,3.6,0,0,0,1.25-.68,3.79,3.79,0,0,0,.88-1.07,4.11,4.11,0,0,0,.46-1.37c0-.08,0-.2,0-.36a2.13,2.13,0,0,0,0-.56,3.4,3.4,0,0,0-.15-.7,4.38,4.38,0,0,0-.34-.79,4.85,4.85,0,0,0-3.21-2,5.26,5.26,0,0,1-1.53-.56,2.79,2.79,0,0,1-.75-.66,1.1,1.1,0,0,1-.26-.57c0-.17,0-.26,0-.3a2,2,0,0,1,.78-1.38,2.76,2.76,0,0,1,3.35.24.86.86,0,0,0,.64.24.88.88,0,0,0,.84-1,1,1,0,0,0-.31-.62,4.44,4.44,0,0,0-4.82-.81,3.86,3.86,0,0,0-1.46,1.16,3.56,3.56,0,0,0-.7,1.63,3.22,3.22,0,0,0,.2,1.76,4.07,4.07,0,0,0,1.25,1.58A5.94,5.94,0,0,0,134,51.37a4,4,0,0,1,1.46.56,2.56,2.56,0,0,1,.7.7,1.08,1.08,0,0,1,.19.62c0,.18,0,.31,0,.37a3.11,3.11,0,0,1-.92,1.48,2.29,2.29,0,0,1-1.7.44,3,3,0,0,1-1.46-.46,2.11,2.11,0,0,1-.92-1,.9.9,0,0,0-.5-.48.86.86,0,0,0-.67,0,.89.89,0,0,0-.47.52,1,1,0,0,0,0,.69,3.89,3.89,0,0,0,1.53,1.79,4.87,4.87,0,0,0,2.37.78h.18l.16,0a4.78,4.78,0,0,0,1.54-.25"/>
    <path class="cls-1"
          d="M118.45,57.12a.79.79,0,0,0,.26-.62V48.8a4.85,4.85,0,0,0-6.53-4.56,4.73,4.73,0,0,0-1.42.81v-6.5a.83.83,0,0,0-.26-.61.89.89,0,0,0-.63-.26.87.87,0,0,0-.87.88V56.5a.87.87,0,0,0,.87.88.89.89,0,0,0,.63-.26.82.82,0,0,0,.26-.62V48.78a3.06,3.06,0,0,1,.24-1.2,3.18,3.18,0,0,1,.66-1,3.53,3.53,0,0,1,1-.67,3.26,3.26,0,0,1,1.21-.24,3.21,3.21,0,0,1,1.2.24,3.53,3.53,0,0,1,1,.67,3.18,3.18,0,0,1,.66,1,3.06,3.06,0,0,1,.24,1.2V56.5a.84.84,0,0,0,.24.62.83.83,0,0,0,.63.26.88.88,0,0,0,.63-.26"/>
    <path class="cls-1"
          d="M105,56.82a4.79,4.79,0,0,0,1.75-1.6.83.83,0,0,0,.13-.65.92.92,0,0,0-1-.7.86.86,0,0,0-.55.36,2.85,2.85,0,0,1-1.11,1,3.13,3.13,0,0,1-2.66.12,3,3,0,0,1-1-.67,2.9,2.9,0,0,1-.67-1,3,3,0,0,1-.24-1.2v-3.9a3,3,0,0,1,.24-1.2,2.94,2.94,0,0,1,.67-1,3.34,3.34,0,0,1,1-.67,3.05,3.05,0,0,1,1.2-.23,3.26,3.26,0,0,1,1.16.21,2.94,2.94,0,0,1,1,.68.87.87,0,0,0,1.22,0,.92.92,0,0,0,0-1.26,4.77,4.77,0,0,0-1.56-1,4.94,4.94,0,0,0-1.84-.35,4.55,4.55,0,0,0-1.88.38,5,5,0,0,0-1.56,1,4.86,4.86,0,0,0-1,1.55,4.8,4.8,0,0,0-.38,1.89v3.9a4.8,4.8,0,0,0,.38,1.89,4.81,4.81,0,0,0,2.6,2.59,4.71,4.71,0,0,0,1.88.38,4.77,4.77,0,0,0,2.27-.56"/>
    <path class="cls-1"
          d="M95.15,57.12a.85.85,0,0,0,.25-.62V45.07a.87.87,0,0,0-.25-.62.91.91,0,0,0-1.25,0,.81.81,0,0,0-.27.62V56.5a.8.8,0,0,0,.27.62.88.88,0,0,0,1.25,0"/>
    <path class="cls-1"
          d="M95.15,42.59A.89.89,0,0,0,95.4,42a.93.93,0,0,0-.25-.63.82.82,0,0,0-.62-.26.85.85,0,0,0-.65.26.93.93,0,0,0-.25.63.86.86,0,0,0,.9.87.84.84,0,0,0,.62-.25"/>
    <path class="cls-1"
          d="M82.88,53.79a5.09,5.09,0,0,0,.41-2,4.56,4.56,0,0,0-1.47-3.41,10.81,10.81,0,0,0-4.38-2.29,10,10,0,0,1-2.14-.87,4.17,4.17,0,0,1-1.19-.93,2.19,2.19,0,0,1-.51-.92,3.51,3.51,0,0,1-.1-.81,3,3,0,0,1,.3-1.33,3.45,3.45,0,0,1,.81-1.08,4.05,4.05,0,0,1,2.66-1,4.35,4.35,0,0,1,1.78.42,3.37,3.37,0,0,1,1.39,1.19.84.84,0,0,0,.56.36.81.81,0,0,0,.68-.16A.8.8,0,0,0,82,40.4a.84.84,0,0,0-.15-.65,5.3,5.3,0,0,0-2-1.71,5.85,5.85,0,0,0-2.58-.63,5.94,5.94,0,0,0-2.09.37,5.41,5.41,0,0,0-1.77,1,5.26,5.26,0,0,0-1.24,1.63,4.88,4.88,0,0,0-.5,2.1A4.25,4.25,0,0,0,72,44.19a4.2,4.2,0,0,0,.76,1.26,5.34,5.34,0,0,0,1.06.95,11.11,11.11,0,0,0,1.18.68c.39.17.76.33,1.1.44s.62.2.84.26a9.55,9.55,0,0,1,3.47,1.7,3,3,0,0,1,1.11,2.32,3.43,3.43,0,0,1-1.08,2.5,4.57,4.57,0,0,1-1.55,1,4.66,4.66,0,0,1-1.85.32A4.89,4.89,0,0,1,74.67,55a3.89,3.89,0,0,1-1.6-1.69h0v0a1.08,1.08,0,0,1-.09-.86,1.23,1.23,0,0,1,.55-.7.82.82,0,0,0,.42-.53.85.85,0,0,0-.07-.66.91.91,0,0,0-.53-.42.8.8,0,0,0-.67.08,2.69,2.69,0,0,0-1.31,1.51,3,3,0,0,0-2,0,.87.87,0,0,0-.49.47.85.85,0,0,0,0,.68.78.78,0,0,0,.44.47.89.89,0,0,0,.68,0,1.08,1.08,0,0,1,.88,0,1.18,1.18,0,0,1,.61.63V54s0,0,0,0,0,0,0,0l0,0v0a5.43,5.43,0,0,0,1,1.33,5.94,5.94,0,0,0,1.31,1,6.29,6.29,0,0,0,3.27.89,6.78,6.78,0,0,0,2.5-.42,6.25,6.25,0,0,0,2.16-1.39,5.36,5.36,0,0,0,1.18-1.75"/>
    <path class="cls-1"
          d="M90.6,57.38A4.6,4.6,0,0,1,86,52.78V45.59H84.65a.86.86,0,0,1-.65-.27.93.93,0,0,1-.25-.63.8.8,0,0,1,.26-.61.93.93,0,0,1,.64-.24h5.19a.86.86,0,0,1,.62.24.79.79,0,0,1,.25.61.88.88,0,0,1-.25.63.81.81,0,0,1-.62.27H87.73v7.19A2.72,2.72,0,0,0,88,53.89a2.76,2.76,0,0,0,.63.9,3.11,3.11,0,0,0,.9.61,2.64,2.64,0,0,0,1.12.23.79.79,0,0,1,.61.25.88.88,0,0,1,.24.62.84.84,0,0,1-.24.62.8.8,0,0,1-.61.26"/>
    <path class="cls-1"
          d="M127.13,57.38a4.53,4.53,0,0,1-1.8-.37,4.64,4.64,0,0,1-1.47-1,4.55,4.55,0,0,1-1.35-3.24V45.59h-1.33a.86.86,0,0,1-.65-.27.93.93,0,0,1-.25-.63.78.78,0,0,1,.27-.61.88.88,0,0,1,.63-.24h5.19a.84.84,0,0,1,.62.24.8.8,0,0,1,.26.61.89.89,0,0,1-.26.63.8.8,0,0,1-.62.27h-2.11v7.19a2.81,2.81,0,0,0,.85,2,3,3,0,0,0,.91.61,2.6,2.6,0,0,0,1.11.23.79.79,0,0,1,.61.25.88.88,0,0,1,.24.62.84.84,0,0,1-.24.62.8.8,0,0,1-.61.26"/>
    <path class="cls-1"
          d="M207.76,57.12a.82.82,0,0,0,.26-.62V48.8a4.8,4.8,0,0,0-.38-1.89,4.83,4.83,0,0,0-2.59-2.59,4.8,4.8,0,0,0-1.89-.38,4.93,4.93,0,0,0-1.67.29,4.85,4.85,0,0,0-1.42.82v-6.5a.79.79,0,0,0-.27-.61.88.88,0,0,0-.63-.26.85.85,0,0,0-.62.26.81.81,0,0,0-.25.62V56.5a.81.81,0,0,0,.25.62.85.85,0,0,0,.62.26.88.88,0,0,0,.63-.26.81.81,0,0,0,.27-.62V48.79a2.91,2.91,0,0,1,.24-1.21A3,3,0,0,1,202,45.93a3,3,0,0,1,2.4,0,3.07,3.07,0,0,1,1,.66,3.21,3.21,0,0,1,.67,1,3.26,3.26,0,0,1,.24,1.21V56.5a.85.85,0,0,0,.87.88.89.89,0,0,0,.63-.26"/>
    <path class="cls-1"
          d="M194.22,56.82A4.85,4.85,0,0,0,196,55.23a.86.86,0,0,0,.13-.66.92.92,0,0,0-1-.7.87.87,0,0,0-.55.37,3,3,0,0,1-1.11,1,3.18,3.18,0,0,1-1.46.35,3.06,3.06,0,0,1-1.2-.24,3.18,3.18,0,0,1-1-.66,3.07,3.07,0,0,1-.66-1,3,3,0,0,1-.24-1.2v-3.9a3,3,0,0,1,.24-1.2,3,3,0,0,1,1.65-1.65,3.14,3.14,0,0,1,2.36,0,2.83,2.83,0,0,1,1,.67.82.82,0,0,0,.61.25.8.8,0,0,0,.6-.25.89.89,0,0,0,0-1.26,4.54,4.54,0,0,0-1.56-1,4.67,4.67,0,0,0-1.83-.36,4.82,4.82,0,0,0-4.85,4.86v3.9a4.79,4.79,0,0,0,.37,1.89A4.83,4.83,0,0,0,190.06,57a5,5,0,0,0,4.16-.18"/>
    <path class="cls-1"
          d="M182.48,52.15a4.41,4.41,0,0,0,1.25-.78,3.19,3.19,0,0,0,.81-1.18,4.29,4.29,0,0,0,.29-1.64,4.64,4.64,0,0,0-.38-1.85,4.85,4.85,0,0,0-1-1.53,5.17,5.17,0,0,0-1.52-1,4.79,4.79,0,0,0-3.74,0,5.26,5.26,0,0,0-1.54,1,4.88,4.88,0,0,0-1,1.53,4.64,4.64,0,0,0-.38,1.85v4a4.74,4.74,0,0,0,.38,1.87,5.06,5.06,0,0,0,1,1.55A4.92,4.92,0,0,0,178.13,57a4.55,4.55,0,0,0,1.86.38,10.19,10.19,0,0,0,1.83-.18,3.54,3.54,0,0,0,1.66-.8.86.86,0,0,0,.34-.66.82.82,0,0,0-.27-.64.85.85,0,0,0-.62-.26,1.06,1.06,0,0,0-.29,0,.74.74,0,0,0-.22.13,3.47,3.47,0,0,1-1.07.47,4.42,4.42,0,0,1-1.15.14,3.32,3.32,0,0,1-1.26-.23,3,3,0,0,1-1-.63,2.61,2.61,0,0,1-.69-1,3.08,3.08,0,0,1-.25-1.26v-4a2.83,2.83,0,0,1,.24-1.18,3,3,0,0,1,1.63-1.62,3,3,0,0,1,1.2-.25,2.93,2.93,0,0,1,1.17.25,3,3,0,0,1,1,.65,3.24,3.24,0,0,1,.65,1,3,3,0,0,1,.24,1.18,2.54,2.54,0,0,1-.18,1,1.76,1.76,0,0,1-.48.66,2,2,0,0,1-.7.36,5.77,5.77,0,0,1-.82.2l-.41.07-.39.07c-.3,0-.55.09-.73.13a2,2,0,0,0-.54.3.7.7,0,0,0-.22.55.86.86,0,0,0,.26.63.79.79,0,0,0,.61.27,3.5,3.5,0,0,0,.74-.08,6.81,6.81,0,0,1,.71-.15,7.54,7.54,0,0,0,1.57-.44"/>
    <path class="cls-1"
          d="M174.66,39a.87.87,0,0,0,.26-.64.91.91,0,0,0-.92-.92,3.56,3.56,0,0,0-1.26.23,3.78,3.78,0,0,0-1.05.62,3.41,3.41,0,0,0-.78.94,3.62,3.62,0,0,0-.44,1.17,1.33,1.33,0,0,0,0,.32v9.81a3,3,0,0,1-.6,1.82,7,7,0,0,1-1.4,1.43,10,10,0,0,1-1.62,1c-.55.26-1,.46-1.27.58l-1-.48V41.58a2.16,2.16,0,0,1,.17-.83,2.25,2.25,0,0,1,.46-.69,2.33,2.33,0,0,1,.68-.46,2.14,2.14,0,0,1,.84-.17.64.64,0,0,0,.45-.18.63.63,0,0,0,.2-.46.59.59,0,0,0-.2-.44.64.64,0,0,0-.45-.18,3.33,3.33,0,0,0-1.33.27,3.89,3.89,0,0,0-1.09.74,3.33,3.33,0,0,0-1,2.4V54.31l-1.6-.83V41.06a3.46,3.46,0,0,0-.29-1.39,4.12,4.12,0,0,0-.78-1.14,4,4,0,0,0-1.15-.76,3.43,3.43,0,0,0-1.39-.29.85.85,0,0,0-.64.27.92.92,0,0,0-.25.65.9.9,0,0,0,.25.64.87.87,0,0,0,.64.25,1.78,1.78,0,0,1,1.77,1.77V54a.92.92,0,0,0,.14.48.83.83,0,0,0,.37.35l4.69,2.38.21.07.21,0h.14l.15,0,.57-.22c.33-.13.73-.32,1.21-.56a16.18,16.18,0,0,0,1.54-.93,10.28,10.28,0,0,0,1.51-1.3,6.77,6.77,0,0,0,1.16-1.66,4.64,4.64,0,0,0,.46-2V41.06A1.76,1.76,0,0,1,174,39.29a.92.92,0,0,0,.66-.25"/>
    <path class="cls-1"
          d="M216.47,57.38a4.49,4.49,0,0,1-1.8-.37,4.64,4.64,0,0,1-1.47-1,4.55,4.55,0,0,1-1.35-3.24V45.59h-1.33a.86.86,0,0,1-.65-.27.88.88,0,0,1-.25-.63.8.8,0,0,1,.26-.61.93.93,0,0,1,.64-.24h5.19a.86.86,0,0,1,.62.24.8.8,0,0,1,.26.61.89.89,0,0,1-.26.63.81.81,0,0,1-.62.27H213.6v7.19a2.72,2.72,0,0,0,.22,1.11,2.91,2.91,0,0,0,.63.9,3,3,0,0,0,.91.61,2.57,2.57,0,0,0,1.11.23.79.79,0,0,1,.61.25.88.88,0,0,1,.24.62.84.84,0,0,1-.24.62.8.8,0,0,1-.61.26"/>
</svg>