<?xml version="1.0" encoding="utf-8"?>
<!-- Generator: Adobe Illustrator 27.0.1, SVG Export Plug-In . SVG Version: 6.00 Build 0)  -->
<svg version="1.1" id="Layer_1" xmlns="http://www.w3.org/2000/svg" xmlns:xlink="http://www.w3.org/1999/xlink" x="0px" y="0px"
	 viewBox="0 0 155.7277679 82.9666748" style="enable-background:new 0 0 155.7277679 82.9666748;" xml:space="preserve">
<style type="text/css">
	.st0{fill:#5B2D87;}
</style>
<g>
	<path class="st0" d="M50.6427498,36.9710083l2.3510132,2.1519775c0,0,6.8590088-2.2359619,6.9630127-2.2049561
		C78.2657318,42.4030151,116.484726,58.434021,116.484726,58.434021l12.0809937-8.4860229
		c0,0-3.2529907-3.3120117-8.9519653-10.5289917c-6.5050049-8.2399902-10.2969971-14.6710205-10.2969971-14.6710205
		s32.6569824,10.4689941,36.7780151,12.2480469l9.6329956-6.7980347
		c-14.7810059-4.7069702-7.6230469-10.1309814-11.2310181-13.0479736c-3.8220215-3.0930176-6.3580322-0.90802-8.7529907-2.9730225
		c-2.3939819-2.0639648,1.1549683-3.4519653,0.1389771-5.8629761c-1.4869995-3.5250244-6.4979858-1.3220215-8.1759644-3.0010376
		c-1.2410278-1.2409668,2.1189575-3.1659546,3.2749634-4.0459595L128.6687469,0l-12.1669922,5.7810059l2.4519653,1.4030151
		l4.9540405-1.4860229c6.2479858,5.2590332,11.8649902,10.9819946,19.5150146,19.4349976
		c-8.9730225-5.5880127-12.9510498-0.0629883-18.552002-2.7249756c-3.3580322-1.5980225-2.3670044-3.7999878-4.8179932-4.7910156
		c-3.9260254-1.5880127-10.4860229,1.5139771-13.2400513-0.3010254c-1.2109985-0.7999878-1.3479614-2.4239502-0.5230103-3.1389771
		c0.8260498-0.71698,3.3320312-2.4769897,3.3320312-2.4769897l-2.4520264-1.4869995L85.451767,20.4799805l2.3689575,1.7620239
		l5.6970215-1.7059937l8.7260132,2.4210205c0,0,13.0199585,19.4060059,13.5709839,20.0669556
		c-10.15802-6.6889648-17.0120239-1.4580078-21.7999878-3.6599731c-4.7269897-2.1740112-0.0570068-3.7639771-2.0380249-6.0020142
		c-3.1929932-3.6049805-16.8200073,4.0200195-16.8729858-3.8519897l4.3200073-3.2219849l-2.4780273-1.7620239L50.6427498,36.9710083
		z"/>
	<path class="st0" d="M9.917285,64.4575806c-0.0200195,0.0690002-0.0490112,0.1239929-0.0880127,0.1659851
		c-0.0390015,0.0410156-0.0939941,0.0730286-0.1619873,0.0950012c-0.0679932,0.0220032-0.1530151,0.0380249-0.2529907,0.0480042
		c-0.1010132,0.0090027-0.2250366,0.0140076-0.3720093,0.0140076c-0.151001,0-0.2800293-0.0050049-0.3859863-0.0140076
		c-0.1050415-0.0099792-0.1920166-0.026001-0.2600098-0.0480042c-0.0690308-0.0219727-0.1199951-0.0539856-0.1539917-0.0950012
		c-0.0350342-0.0419922-0.0620117-0.0969849-0.0809937-0.1659851l-1.9920044-7.1799927H6.1542845l-1.8369751,7.1799927
		c-0.0140381,0.0690002-0.0390015,0.1239929-0.072998,0.1659851c-0.0339966,0.0410156-0.0840454,0.0730286-0.1470337,0.0950012
		c-0.0639648,0.0220032-0.1459963,0.0380249-0.2470095,0.0480042c-0.0999756,0.0090027-0.2279663,0.0140076-0.3850098,0.0140076
		c-0.1619873,0-0.2969971-0.0050049-0.4039917-0.0140076c-0.1079712-0.0099792-0.1969604-0.026001-0.2649536-0.0480042
		c-0.0690308-0.0219727-0.1210327-0.0539856-0.15802-0.0950012c-0.0369873-0.0419922-0.0620117-0.0969849-0.0770264-0.1659851
		l-2.5130005-8.7819824c-0.0299683-0.1130371-0.0459595-0.2009888-0.0479736-0.2640381
		c-0.0029907-0.0639648,0.0169678-0.1129761,0.059021-0.1469727c0.0409546-0.0339966,0.1089478-0.0560303,0.2019653-0.0670166
		c0.0930176-0.0100098,0.21698-0.0139771,0.3740234-0.0139771c0.1519775,0,0.2719727,0.0039673,0.3599854,0.0109863
		s0.1560059,0.0209961,0.2020264,0.039978c0.0469971,0.0200195,0.0789795,0.0469971,0.0959473,0.0809937
		c0.0180054,0.0340576,0.0310059,0.0790405,0.0410156,0.132019l2.1380005,7.9670105h0.007019l2.0289919-7.9519958
		c0.0139771-0.0540161,0.03302-0.098999,0.0549927-0.1359863c0.0220337-0.0370483,0.0570068-0.0650024,0.1060181-0.0840454
		c0.0490112-0.0199585,0.1189575-0.0339966,0.2099609-0.0449829c0.0910034-0.0100098,0.2090454-0.0139771,0.3560181-0.0139771
		c0.1370239,0,0.2460327,0.0039673,0.3270264,0.0139771c0.0809937,0.0109863,0.1459961,0.0250244,0.1950073,0.0449829
		c0.0489502,0.019043,0.0839844,0.0469971,0.105957,0.0840454c0.0220337,0.0369873,0.0410156,0.0819702,0.0560303,0.1359863
		l2.1820068,7.9519958h0.0149536l2.0950317-7.9590149c0.0139771-0.0490112,0.0289917-0.09198,0.0440063-0.1289673
		c0.0139771-0.0370483,0.0449829-0.0650024,0.0910034-0.0840454c0.0469971-0.0199585,0.1129761-0.0339966,0.1989746-0.0449829
		c0.085022-0.0100098,0.2000122-0.0139771,0.34198-0.0139771c0.1460571,0,0.2630005,0.0059814,0.348999,0.0180054
		c0.0860596,0.0119629,0.1480103,0.0360107,0.1870117,0.0700073s0.0580444,0.0829468,0.0549927,0.1469727
		c-0.0019531,0.0640259-0.0159912,0.1519775-0.039978,0.2639771L9.917285,64.4575806z"/>
	<path class="st0" d="M20.3285999,64.5609741c0,0.0580139-0.019043,0.1019897-0.0580444,0.132019
		c-0.039978,0.0289917-0.0939941,0.0509949-0.1629639,0.065979c-0.0679932,0.0140076-0.1680298,0.0220032-0.2999878,0.0220032
		c-0.1279907,0-0.2300415-0.0079956-0.3060303-0.0220032c-0.0759888-0.0149841-0.1309814-0.0369873-0.164978-0.065979
		c-0.0339966-0.0300293-0.0510254-0.0740051-0.0510254-0.132019v-0.6619873
		c-0.2890015,0.3089905-0.6109619,0.5489807-0.96698,0.7200012c-0.3549805,0.17099-0.7310181,0.2569885-1.1279907,0.2569885
		c-0.3470459,0-0.6619873-0.0450134-0.9440308-0.1359863c-0.2819815-0.0900269-0.5219717-0.2210083-0.7199697-0.3919983
		c-0.1990356-0.1720276-0.3530273-0.3830261-0.4630127-0.6330261c-0.1110229-0.2489929-0.1660156-0.5339966-0.1660156-0.8519897
		c0-0.3720093,0.0759888-0.6950073,0.2280273-0.9700012c0.1519775-0.2739868,0.3699951-0.5019836,0.6539917-0.6839905
		c0.2839956-0.1809998,0.6320181-0.3170166,1.0440054-0.40802c0.4110107-0.0899963,0.8739624-0.1359863,1.3889771-0.1359863
		h0.9110107v-0.5140076c0-0.2539978-0.0269775-0.4799805-0.0809937-0.6759949
		c-0.0540161-0.1950073-0.1409912-0.3590088-0.2609863-0.4890137c-0.1199951-0.1289673-0.276001-0.2269897-0.467041-0.2940063
		c-0.1900024-0.065979-0.4259644-0.0979614-0.7049561-0.0979614c-0.2990112,0-0.5670166,0.0349731-0.8040161,0.105957
		c-0.2380371,0.0710449-0.4459839,0.1490479-0.625,0.2350464s-0.328002,0.164978-0.4490347,0.2349854
		c-0.1199951,0.0709839-0.2089844,0.1069946-0.2679443,0.1069946c-0.0390015,0-0.072998-0.0100098-0.1030273-0.0300293
		c-0.0289917-0.0189819-0.0549927-0.0489502-0.0770264-0.0879517c-0.0219727-0.0390015-0.0379639-0.0889893-0.0469971-0.1500244
		c-0.0099487-0.0620117-0.0149536-0.1289673-0.0149536-0.2030029c0-0.1220093,0.0079956-0.2189941,0.026001-0.289978
		c0.0169678-0.0709839,0.0579834-0.1390381,0.1239624-0.2020264c0.06604-0.0639648,0.1799927-0.1380005,0.342041-0.223999
		c0.1619873-0.0859985,0.3479605-0.1640015,0.558959-0.2349854c0.210022-0.0720215,0.44104-0.1300049,0.69104-0.177002
		c0.2489624-0.0460205,0.5019531-0.0690308,0.7559814-0.0690308c0.4760132,0,0.8800049,0.0530396,1.2130127,0.1610107
		c0.3330078,0.1080322,0.6029663,0.2659912,0.80896,0.473999c0.2050171,0.2090454,0.3540039,0.467041,0.4470215,0.7750244
		c0.0930176,0.3089905,0.1400146,0.6690063,0.1400146,1.0809937V64.5609741z M19.1235828,61.539978h-1.0360107
		c-0.3339844,0-0.6220093,0.0289917-0.8670044,0.0849915s-0.4489746,0.1390076-0.6109619,0.2490234
		c-0.1610107,0.1109924-0.2800293,0.242981-0.3560181,0.3979797c-0.0759888,0.1530151-0.1140137,0.3320007-0.1140137,0.5320129
		c0,0.3429871,0.1090088,0.6159973,0.3280029,0.8190002c0.21698,0.2039795,0.5230103,0.3059998,0.9140015,0.3059998
		c0.3190308,0,0.6140137-0.0820007,0.8859863-0.2430115c0.2720337-0.1619873,0.5570068-0.4089966,0.8560181-0.7420044V61.539978z"/>
	<path class="st0" d="M27.6611805,64.0681763c0,0.1419983-0.0100098,0.2550049-0.0289917,0.3380127
		c-0.0200195,0.0839844-0.0499878,0.1439819-0.0880127,0.1829834c-0.039978,0.0400085-0.098999,0.0769958-0.177002,0.1109924
		c-0.0780029,0.0350037-0.1669922,0.0630188-0.2680054,0.085022c-0.0999756,0.0220032-0.2069702,0.039978-0.3200073,0.0549927
		c-0.1119995,0.0140076-0.2249756,0.0220032-0.3379517,0.0220032c-0.3430176,0-0.6370239-0.0460205-0.882019-0.1369934
		c-0.2449951-0.0900269-0.4459839-0.2270203-0.6019897-0.4110107c-0.1570435-0.1839905-0.2709961-0.4169922-0.342041-0.697998
		c-0.0709839-0.2820129-0.1069946-0.6130066-0.1069946-0.9960022V58.755188h-0.9249878
		c-0.0739746,0-0.1329956-0.0400391-0.177002-0.118042c-0.0440063-0.0779419-0.065979-0.2049561-0.065979-0.381958
		c0-0.0930176,0.0059814-0.1719971,0.0180054-0.2349854c0.0119629-0.0640259,0.0279541-0.1160278,0.0479736-0.15802
		c0.0189819-0.0410156,0.0449829-0.0709839,0.0770264-0.0880127c0.0319824-0.0180054,0.0669556-0.026001,0.1069946-0.026001
		h0.9179688v-1.572998c0-0.0339966,0.0090332-0.065979,0.026001-0.0949707
		c0.0170288-0.0290527,0.0490112-0.0550537,0.0950317-0.0770264c0.0469971-0.0219727,0.1099854-0.0380249,0.1879883-0.0479736
		c0.0789795-0.0100098,0.1759644-0.0150146,0.2940063-0.0150146c0.1229858,0,0.2229614,0.0050049,0.302002,0.0150146
		c0.0780029,0.0099487,0.1389771,0.026001,0.1829834,0.0479736s0.0759888,0.0479736,0.0950317,0.0770264
		c0.0199585,0.0289917,0.0299683,0.0609741,0.0299683,0.0949707v1.572998h1.6970215
		c0.0390015,0,0.0739746,0.0079956,0.1029663,0.026001c0.0300293,0.0170288,0.0560303,0.0469971,0.0780029,0.0880127
		c0.0220337,0.0419922,0.0380249,0.0939941,0.0480347,0.15802c0.0089722,0.0629883,0.0139771,0.1419678,0.0139771,0.2349854
		c0,0.177002-0.0219727,0.3040161-0.065979,0.381958c-0.0440063,0.0780029-0.1030273,0.118042-0.177002,0.118042h-1.6970215
		v3.6889954c0,0.4549866,0.0670166,0.7999878,0.2020264,1.0319824c0.1349487,0.2330017,0.3759766,0.348999,0.723999,0.348999
		c0.1129761,0,0.2129517-0.0109863,0.3009644-0.0329895s0.1669922-0.0450134,0.2360229-0.0690002
		c0.0679932-0.0249939,0.1270142-0.0480042,0.1759644-0.0700073c0.0490112-0.0220032,0.0930176-0.0329895,0.132019-0.0329895
		c0.0239868,0,0.0480347,0.006012,0.0700073,0.0180054s0.0390015,0.0359802,0.0510254,0.0700073
		c0.0130005,0.0339966,0.0239868,0.0809937,0.0339966,0.1389771C27.6561756,63.906189,27.6611805,63.9801636,27.6611805,64.0681763"
		/>
	<path class="st0" d="M36.5515633,60.9594727c0,0.1910095-0.0479736,0.3270264-0.1439819,0.40802
		s-0.2050171,0.1210022-0.3289795,0.1210022h-4.35602c0,0.367981,0.0369873,0.697998,0.1119995,0.992981
		c0.072998,0.2929993,0.1959858,0.5460205,0.3690205,0.756012c0.1719971,0.2109985,0.3959961,0.3729858,0.6719971,0.4849854
		c0.2749634,0.1130066,0.6119995,0.1690063,1.0120239,0.1690063c0.3139648,0,0.5949707-0.026001,0.8409424-0.0769958
		c0.2470093-0.0509949,0.460022-0.1090088,0.6390381-0.1730042c0.1799927-0.0629883,0.3280029-0.1199951,0.4429932-0.1719971
		c0.1159668-0.052002,0.2030029-0.0780029,0.2620239-0.0780029c0.0349731,0,0.0650024,0.0090027,0.0929565,0.026001
		c0.0270386,0.0169983,0.0480347,0.0429993,0.0629883,0.0780029c0.0140381,0.0339966,0.0250244,0.0820007,0.03302,0.1430054
		c0.007019,0.0610046,0.0109863,0.1359863,0.0109863,0.223999c0,0.0629883-0.0029907,0.1180115-0.0079956,0.1650085
		c-0.0050049,0.04599-0.0109863,0.0889893-0.0180054,0.125c-0.006958,0.0369873-0.0199585,0.0699768-0.0369873,0.1000061
		c-0.0169678,0.0289917-0.0390015,0.0569763-0.065979,0.0839844c-0.0270386,0.0270081-0.1060181,0.0710144-0.2390137,0.1319885
		c-0.132019,0.0610046-0.3029785,0.1210022-0.5139771,0.1800232c-0.2109985,0.0589905-0.4540405,0.1109924-0.7319946,0.1579895
		c-0.276001,0.0469971-0.5720215,0.0700073-0.8850098,0.0700073c-0.5440063,0-1.0200195-0.0760193-1.4290161-0.2279968
		c-0.4089985-0.1520081-0.7540302-0.3770142-1.0330219-0.6760254c-0.2789917-0.2989807-0.4899902-0.6739807-0.631958-1.1239929
		c-0.1420288-0.4509888-0.2130127-0.9750061-0.2130127-1.572998c0-0.5679932,0.0739746-1.07901,0.2210083-1.5319824
		c0.1469727-0.45401,0.3579712-0.8379822,0.6350098-1.1540222c0.2769775-0.315979,0.6109619-0.55896,1.0029926-0.7279663
		c0.3919678-0.1680298,0.8309937-0.2530518,1.315979-0.2530518c0.5189819,0,0.9609985,0.0830078,1.3259888,0.25
		c0.3649902,0.1660156,0.6650391,0.3910522,0.901001,0.6720581c0.2349854,0.2819824,0.4069824,0.6129761,0.5170288,0.9919739
		c0.1109619,0.3800049,0.1659546,0.7850037,0.1659546,1.2170105V60.9594727z M35.3315926,60.5994873
		c0.0150146-0.6369934-0.1270142-1.1359863-0.4249878-1.4990234c-0.2980347-0.3629761-0.7410278-0.5440063-1.3270264-0.5440063
		c-0.3009644,0-0.5650024,0.0560303-0.7919922,0.1690063c-0.2260132,0.1130371-0.4160156,0.2620239-0.5689697,0.447998
		c-0.1520386,0.1860352-0.270998,0.4040222-0.3550434,0.6510315c-0.0839844,0.2469788-0.1300049,0.5050049-0.1409912,0.7749939
		H35.3315926z"/>
	<path class="st0" d="M44.0674934,58.3725586c0,0.1079712-0.0020142,0.1989746-0.007019,0.2719727
		s-0.0149536,0.1310425-0.0289917,0.1730347c-0.0150146,0.0419922-0.032959,0.072998-0.0559692,0.0949707
		c-0.0220337,0.0220337-0.0530396,0.03302-0.092041,0.03302s-0.0869751-0.0109863-0.1430054-0.03302
		c-0.0559692-0.0219727-0.1199951-0.0440063-0.190979-0.065979s-0.151001-0.0429688-0.2390137-0.0629883
		c-0.0879517-0.0189819-0.1829834-0.0289917-0.2860107-0.0289917c-0.1229858,0-0.242981,0.0239868-0.3609619,0.072998
		c-0.1170044,0.0499878-0.2410278,0.1300049-0.3699951,0.242981c-0.1310425,0.1129761-0.2670288,0.2619934-0.40802,0.4490051
		c-0.1419678,0.1860046-0.2999878,0.4140015-0.4710083,0.6829834v4.3500061c0,0.0400085-0.0100098,0.072998-0.0289917,0.1000061
		c-0.0200195,0.0270081-0.052002,0.0499878-0.0949707,0.0700073c-0.0440063,0.0189819-0.1060181,0.0329895-0.184021,0.0440063
		c-0.0789795,0.0099792-0.1799927,0.0139771-0.302002,0.0139771c-0.1170044,0-0.2150269-0.0039978-0.2940063-0.0139771
		c-0.0780029-0.0110168-0.1409912-0.0250244-0.1870117-0.0440063c-0.0469971-0.0200195-0.0789795-0.0429993-0.0960083-0.0700073
		c-0.0169678-0.0270081-0.0249634-0.0599976-0.0249634-0.1000061v-6.6129761c0-0.0390015,0.007019-0.072998,0.0219727-0.1000366
		c0.0140381-0.0269775,0.0440063-0.0509644,0.0880127-0.0739746c0.0440063-0.0220337,0.0999756-0.0360107,0.1690063-0.0440063
		c0.0689697-0.0059814,0.1589966-0.0100098,0.2719727-0.0100098c0.1080322,0,0.1970215,0.0040283,0.2680054,0.0100098
		c0.0710449,0.0079956,0.1260376,0.0219727,0.1660156,0.0440063c0.0390015,0.0230103,0.0670166,0.0469971,0.0839844,0.0739746
		c0.0170288,0.0270386,0.026001,0.0610352,0.026001,0.1000366v0.9619751
		c0.1810303-0.2639771,0.3510132-0.4799805,0.5110474-0.6469727c0.1589966-0.1660156,0.30896-0.2969971,0.4509888-0.3930054
		c0.1430054-0.0960083,0.282959-0.1619873,0.4229736-0.197998c0.1390381-0.0369873,0.2800293-0.0549927,0.4219971-0.0549927
		c0.0640259,0,0.1359863,0.0029907,0.217041,0.0109863c0.0809937,0.007019,0.1659546,0.0209961,0.2539673,0.039978
		c0.0880127,0.0200195,0.1669922,0.0419922,0.2379761,0.06604c0.0720215,0.0249634,0.1220093,0.0489502,0.151001,0.0739746
		c0.0300293,0.0250244,0.0490112,0.0479736,0.059021,0.0700073c0.0100098,0.0219727,0.0189819,0.0499878,0.026001,0.0839844
		c0.007019,0.0350342,0.0120239,0.085022,0.0150146,0.151001C44.0665169,58.1705322,44.0674934,58.2595825,44.0674934,58.3725586"/>
	<path class="st0" d="M51.1503792,62.7527771c0,0.3380127-0.0629883,0.6390076-0.1870117,0.9039917
		c-0.125,0.2640076-0.3029785,0.4869995-0.532959,0.6679993c-0.2310181,0.1809998-0.5050049,0.3190002-0.8230591,0.4120178
		c-0.3189697,0.0929871-0.6689453,0.1399841-1.0509644,0.1399841c-0.2360229,0-0.460022-0.0189819-0.6719971-0.0549927
		c-0.2139893-0.0369873-0.4050293-0.0840149-0.5740356-0.1400146c-0.1689453-0.0559998-0.3119507-0.1149902-0.4299927-0.1769714
		c-0.1170044-0.0610046-0.2030029-0.1160278-0.256958-0.1650085c-0.0540161-0.0490112-0.0930176-0.1170044-0.118042-0.2050171
		c-0.0239868-0.0879822-0.0360107-0.2089844-0.0360107-0.3609924c0-0.0929871,0.0040283-0.17099,0.0140381-0.2349854
		c0.0100098-0.0640259,0.0219727-0.1140137,0.0369873-0.1549988c0.0150146-0.0380249,0.0350342-0.0670166,0.0629883-0.0840149
		c0.0270386-0.0169983,0.0570068-0.026001,0.092041-0.026001c0.0529785,0,0.1329956,0.0339966,0.2379761,0.1000061
		s0.2360229,0.1390076,0.3900146,0.2170105c0.1539917,0.0779724,0.3359985,0.1499939,0.5479736,0.2159729
		c0.210022,0.0660095,0.4520264,0.1000061,0.7269897,0.1000061c0.2050171,0,0.3920288-0.0220032,0.5580444-0.0669861
		c0.1669922-0.0440063,0.3109741-0.1090088,0.43396-0.1940002c0.1230469-0.0859985,0.217041-0.1950073,0.28302-0.3280029
		c0.065979-0.1319885,0.098999-0.2879944,0.098999-0.4689941c0-0.1870117-0.0479736-0.3430176-0.1430054-0.4710083
		c-0.0960083-0.1270142-0.2219849-0.2399902-0.3789673-0.3380127c-0.1570435-0.0979919-0.3330078-0.1849976-0.5290527-0.2609863
		c-0.1959839-0.0750122-0.3979492-0.1560059-0.605957-0.2390137c-0.2080078-0.0829773-0.4110107-0.177002-0.6100464-0.2829895
		c-0.1989746-0.105011-0.3759766-0.2340088-0.532959-0.3859863c-0.1570435-0.151001-0.28302-0.3320007-0.3779907-0.5429993
		c-0.0960083-0.2109985-0.1430054-0.4630127-0.1430054-0.757019c0-0.2599792,0.0499878-0.5090027,0.1499634-0.7460022
		c0.1000366-0.2379761,0.2510376-0.4459839,0.4520264-0.6239624c0.2009888-0.1790161,0.4519653-0.322998,0.7529907-0.4310303
		c0.3010254-0.1069946,0.6530151-0.1619873,1.0549927-0.1619873c0.1760254,0,0.3530273,0.0159912,0.5289917,0.0449829
		c0.1760254,0.0289917,0.335022,0.065979,0.4780273,0.1099854c0.1419678,0.0440063,0.2630005,0.092041,0.3629761,0.1430054
		c0.1000366,0.052002,0.1760254,0.0970459,0.2280273,0.1359863c0.052002,0.0400391,0.0859985,0.0730591,0.1029663,0.1030273
		c0.0170288,0.0300293,0.0300293,0.0620117,0.0370483,0.0999756c0.006958,0.0360107,0.0149536,0.0820312,0.0219727,0.1350098
		c0.007019,0.0540161,0.0109863,0.1199951,0.0109863,0.197998c0,0.0840454-0.0039673,0.1560059-0.0109863,0.2180176
		c-0.007019,0.0609741-0.0189819,0.1110229-0.0369873,0.1500244c-0.0170288,0.039978-0.0369873,0.0679932-0.0629883,0.0849609
		c-0.0240479,0.0170288-0.0510254,0.0250244-0.0800171,0.0250244c-0.0440063,0-0.1080322-0.026001-0.190979-0.0800171
		c-0.0840454-0.0540161-0.19104-0.1119995-0.3240356-0.1729736c-0.132019-0.0610352-0.2879639-0.1190186-0.4660034-0.1730347
		c-0.1790161-0.0539551-0.3839722-0.0809937-0.6140137-0.0809937c-0.2059937,0-0.3869629,0.0230103-0.5440063,0.0700073
		c-0.1569824,0.0460205-0.2849731,0.1119995-0.3859863,0.1989746c-0.0999756,0.0859985-0.1759644,0.1870117-0.2269897,0.3040161
		c-0.052002,0.118042-0.0780029,0.2460022-0.0780029,0.3830261c0,0.190979,0.0490112,0.3509827,0.1480103,0.4809875
		c0.0969849,0.1300049,0.2249756,0.243988,0.3809814,0.3420105c0.15802,0.0969849,0.3359985,0.1859741,0.5369873,0.2639771
		c0.2010498,0.07901,0.4050293,0.1600037,0.6140137,0.2430115c0.2080078,0.0830078,0.4130249,0.1759949,0.6170044,0.2789917
		c0.2030029,0.1029968,0.3829956,0.2279968,0.5400391,0.375c0.1569824,0.1470032,0.282959,0.322998,0.3779907,0.5290222
		C51.1024055,62.2237854,51.1503792,62.4687805,51.1503792,62.7527771"/>
	<path class="st0" d="M59.4454842,63.5460815c0,0.0840149-0.0029907,0.1560059-0.0079956,0.2170105
		s-0.0130005,0.1129761-0.026001,0.1539917c-0.0120239,0.0419922-0.026001,0.0780029-0.0440063,0.1109924
		c-0.0169678,0.0320129-0.0559692,0.0780029-0.1170044,0.1400146c-0.0609741,0.0610046-0.164978,0.1359863-0.3120117,0.2269897
		c-0.1469727,0.0910034-0.3129883,0.17099-0.4959717,0.2420044c-0.184021,0.071991-0.3840332,0.1289978-0.598999,0.1730042
		c-0.2160034,0.0440063-0.4379883,0.065979-0.6690063,0.065979c-0.4749756,0-0.8959961-0.0779724-1.2639771-0.2349854
		c-0.3670044-0.1570129-0.6750488-0.3850098-0.9219971-0.6870117c-0.2480469-0.3009949-0.4360352-0.67099-0.56604-1.1089783
		c-0.1300049-0.4390259-0.1950073-0.9450073-0.1950073-1.5180054c0-0.6520081,0.0800171-1.2109985,0.2390137-1.6790161
		s0.3770142-0.8519897,0.6539917-1.1499634c0.2770386-0.2990112,0.6030273-0.5209961,0.9780273-0.6650391
		c0.3739624-0.1439819,0.7799683-0.21698,1.2160034-0.21698c0.2099609,0,0.414978,0.0189819,0.6139526,0.0579834
		c0.1980591,0.0390015,0.3800049,0.0910034,0.5470581,0.1550293c0.1659546,0.0639648,0.3139648,0.1369629,0.4439697,0.2199707
		s0.2249756,0.1539917,0.28302,0.2130127c0.05896,0.059021,0.098999,0.1060181,0.1209717,0.1400146
		c0.0220337,0.0349731,0.0410156,0.0750122,0.0549927,0.1209717c0.0150146,0.0469971,0.0250244,0.098999,0.0300293,0.15802
		c0.0050049,0.05896,0.006958,0.132019,0.006958,0.2210083c0,0.190979-0.0219727,0.3239746-0.065979,0.3999939
		c-0.0440063,0.0769958-0.0979614,0.1139832-0.1610107,0.1139832c-0.0739746,0-0.157959-0.0400085-0.2539673-0.1210022
		c-0.0950317-0.0809631-0.217041-0.1700134-0.3640137-0.2679749c-0.1459961-0.0980225-0.3250122-0.1879883-0.5319824-0.2680054
		c-0.2090454-0.0820312-0.4550171-0.1220093-0.7390137-0.1220093c-0.5830078,0-1.0300293,0.223999-1.3410034,0.6730042
		c-0.3109741,0.447998-0.46698,1.0979919-0.46698,1.9509888c0,0.4259949,0.0409546,0.8000183,0.1220093,1.1210022
		c0.0799561,0.3200073,0.1989746,0.5889893,0.355957,0.8040161c0.1570435,0.2159729,0.348999,0.3759766,0.5770264,0.4819946
		c0.2279663,0.1049805,0.4879761,0.1569824,0.782959,0.1569824c0.2780151,0,0.5230103-0.0440063,0.7340088-0.1319885
		c0.2109985-0.0880127,0.394043-0.1839905,0.5480347-0.2900085c0.1539917-0.1049805,0.2839966-0.2009888,0.3889771-0.2869873
		c0.1060181-0.085022,0.1879883-0.1280212,0.2460327-0.1280212c0.0349731,0,0.0639648,0.0100098,0.0879517,0.0290222
		c0.0250244,0.019989,0.0460205,0.0529785,0.0630493,0.098999c0.0169678,0.0469971,0.0289917,0.1059875,0.0369873,0.1759949
		C59.4414558,63.3640747,59.4454842,63.4480896,59.4454842,63.5460815"/>
	<path class="st0" d="M68.5558319,64.5531006c0,0.0390015-0.0100098,0.072998-0.0289917,0.1000061
		c-0.0189819,0.026001-0.0510254,0.0489807-0.0960083,0.0690002c-0.0440063,0.019989-0.1049805,0.0339966-0.184021,0.0440063
		c-0.0780029,0.0099792-0.1759644,0.0149841-0.2940063,0.0149841c-0.1219482,0-0.2219849-0.0050049-0.3009644-0.0149841
		c-0.0780029-0.0100098-0.1390381-0.0240173-0.1829834-0.0440063c-0.0440063-0.0200195-0.0760498-0.0429993-0.0950317-0.0690002
		c-0.0200195-0.0270081-0.0299683-0.0610046-0.0299683-0.1000061v-3.8729858c0-0.3770142-0.0300293-0.6800232-0.0890503-0.9110107
		c-0.0579834-0.230011-0.1439819-0.4290161-0.256958-0.5950317c-0.1119995-0.1669922-0.2590332-0.2939453-0.4370117-0.3829956
		c-0.1790161-0.0879517-0.3850098-0.131958-0.6210327-0.131958c-0.3039551,0-0.6079712,0.1079712-0.9109497,0.3239746
		c-0.3040161,0.2150269-0.6230469,0.5310059-0.9550171,0.947998v4.6220093c0,0.0390015-0.0100098,0.072998-0.0300293,0.1000061
		c-0.0189819,0.026001-0.0509605,0.0489807-0.0949669,0.0690002c-0.0440063,0.019989-0.1049805,0.0339966-0.184021,0.0440063
		c-0.0789795,0.0099792-0.1789551,0.0149841-0.302002,0.0149841c-0.1170044,0-0.2139893-0.0050049-0.2929688-0.0149841
		c-0.0790405-0.0100098-0.1409912-0.0240173-0.1879883-0.0440063c-0.0460205-0.0200195-0.0780029-0.0429993-0.0960083-0.0690002
		c-0.0170288-0.0270081-0.0250244-0.0610046-0.0250244-0.1000061v-9.8189697c0-0.0380249,0.0079956-0.0720215,0.0250244-0.1020508
		c0.0180054-0.0299683,0.0499878-0.0539551,0.0960083-0.0739746c0.0469971-0.0189819,0.1089478-0.0339966,0.1879883-0.0440063
		c0.0789795-0.0089722,0.1759644-0.0139771,0.2929688-0.0139771c0.1230469,0,0.2230225,0.0050049,0.302002,0.0139771
		c0.0790405,0.0100098,0.1400146,0.0250244,0.184021,0.0440063c0.0440063,0.0200195,0.075985,0.0440063,0.0949669,0.0739746
		c0.0200195,0.0300293,0.0300293,0.0640259,0.0300293,0.1020508v3.9619751
		c0.3469849-0.3670044,0.6970215-0.6400146,1.0509644-0.8190308c0.3520508-0.1789551,0.7070312-0.2689819,1.0640259-0.2689819
		c0.4420166,0,0.8129883,0.0750122,1.1149902,0.2250366c0.3010254,0.1489868,0.5440063,0.3479614,0.7310181,0.598999
		c0.1859741,0.2489624,0.3189697,0.5419922,0.3989868,0.8779602c0.0820312,0.335022,0.1220093,0.7400208,0.1220093,1.2160034
		V64.5531006z"/>
	<path class="st0" d="M77.5565033,64.5609741c0,0.0580139-0.0200195,0.1019897-0.059021,0.132019
		c-0.0390015,0.0289917-0.0930176,0.0509949-0.1619873,0.065979c-0.0679932,0.0140076-0.1680298,0.0220032-0.2999878,0.0220032
		c-0.1279907,0-0.2300415-0.0079956-0.3060303-0.0220032c-0.0759888-0.0149841-0.1309814-0.0369873-0.164978-0.065979
		c-0.0339966-0.0300293-0.0510254-0.0740051-0.0510254-0.132019v-0.6619873
		c-0.289978,0.3089905-0.6109619,0.5489807-0.96698,0.7200012c-0.3549805,0.17099-0.7310181,0.2569885-1.1279907,0.2569885
		c-0.3470459,0-0.6619873-0.0450134-0.9450073-0.1359863c-0.2810059-0.0900269-0.5209961-0.2210083-0.7189941-0.3919983
		c-0.1990356-0.1720276-0.3530273-0.3830261-0.4630127-0.6330261c-0.1110229-0.2489929-0.1660156-0.5339966-0.1660156-0.8519897
		c0-0.3720093,0.0759888-0.6950073,0.2280273-0.9700012c0.1519775-0.2739868,0.3699951-0.5019836,0.6549683-0.6839905
		c0.2839966-0.1809998,0.6310425-0.3170166,1.0430298-0.40802c0.4110107-0.0899963,0.8739624-0.1359863,1.3889771-0.1359863
		h0.9110107v-0.5140076c0-0.2539978-0.0269775-0.4799805-0.0800171-0.6759949
		c-0.0549927-0.1950073-0.1419678-0.3590088-0.2619629-0.4890137c-0.1199951-0.1289673-0.2750244-0.2269897-0.4660034-0.2940063
		c-0.19104-0.065979-0.427002-0.0979614-0.7059937-0.0979614c-0.2990112,0-0.5670166,0.0349731-0.8049927,0.105957
		c-0.2370605,0.0710449-0.4450073,0.1490479-0.625,0.2350464c-0.1780396,0.0859985-0.3270264,0.164978-0.4470215,0.2349854
		c-0.1210327,0.0709839-0.210022,0.1069946-0.2689819,0.1069946c-0.0390015,0-0.072998-0.0100098-0.1030273-0.0300293
		c-0.0289917-0.0189819-0.0549927-0.0489502-0.0770264-0.0879517c-0.0219727-0.0390015-0.0379639-0.0889893-0.0469971-0.1500244
		c-0.0099487-0.0620117-0.0149536-0.1289673-0.0149536-0.2030029c0-0.1220093,0.0089722-0.2189941,0.026001-0.289978
		c0.0169678-0.0709839,0.0579834-0.1390381,0.1239624-0.2020264c0.06604-0.0639648,0.1799927-0.1380005,0.342041-0.223999
		c0.1619873-0.0859985,0.3479614-0.1640015,0.5579834-0.2349854c0.2109985-0.0720215,0.440979-0.1300049,0.690979-0.177002
		c0.25-0.0460205,0.5020142-0.0690308,0.757019-0.0690308c0.4749756,0,0.8800049,0.0530396,1.2130127,0.1610107
		c0.3330078,0.1080322,0.6019897,0.2659912,0.8079834,0.473999c0.2059937,0.2090454,0.3549805,0.467041,0.447998,0.7750244
		c0.0930176,0.3089905,0.1400146,0.6690063,0.1400146,1.0809937V64.5609741z M76.3514862,61.539978h-1.0360107
		c-0.3339844,0-0.6229858,0.0289917-0.867981,0.0849915c-0.2440186,0.0559998-0.4470215,0.1390076-0.6090088,0.2490234
		c-0.1619873,0.1109924-0.2810059,0.242981-0.3569946,0.3979797c-0.0750122,0.1530151-0.1140137,0.3320007-0.1140137,0.5320129
		c0,0.3429871,0.1090088,0.6159973,0.3280029,0.8190002c0.21698,0.2039795,0.5230103,0.3059998,0.9140015,0.3059998
		c0.3190308,0,0.6140137-0.0820007,0.8859863-0.2430115c0.2720337-0.1619873,0.5570068-0.4089966,0.8560181-0.7420044V61.539978z"/>
	<path class="st0" d="M87.674057,61.1426697c0,0.57901-0.0620117,1.0980225-0.1870117,1.5580139
		c-0.125,0.4609985-0.3079834,0.8519897-0.5509644,1.1719971c-0.2420044,0.321991-0.5430298,0.5690002-0.9000244,0.7430115
		c-0.3579712,0.1739807-0.7680054,0.2609863-1.2279663,0.2609863c-0.1960449,0-0.3770142-0.019989-0.5430298-0.0589905
		c-0.1669922-0.0400085-0.3299561-0.1000061-0.4890137-0.1839905c-0.1599731-0.0830078-0.3179932-0.1880188-0.473999-0.3160095
		c-0.1569824-0.1270142-0.3239746-0.276001-0.5-0.447998v3.3070068c0,0.0390015-0.0099487,0.072998-0.0289917,0.1029968
		c-0.0199585,0.0289917-0.052002,0.0539856-0.0960083,0.072998c-0.0439453,0.019989-0.1049805,0.0350037-0.18396,0.0440063
		c-0.0780029,0.0099792-0.1790161,0.0149841-0.3010254,0.0149841c-0.1170044,0-0.2149658-0.0050049-0.2940063-0.0149841
		c-0.0780029-0.0090027-0.1409912-0.0240173-0.1869507-0.0440063c-0.0470581-0.0190125-0.0790405-0.0440063-0.0960083-0.072998
		c-0.0170288-0.0299988-0.0250244-0.0639954-0.0250244-0.1029968v-9.2369995c0-0.0440063,0.007019-0.0800171,0.0209961-0.1069946
		c0.0150146-0.0270386,0.0449829-0.0499878,0.0889893-0.0690308c0.0440063-0.0209961,0.1000366-0.0339966,0.1690063-0.0419922
		c0.0690308-0.0059814,0.1520386-0.0100098,0.25-0.0100098c0.1019897,0,0.1870117,0.0040283,0.2540283,0.0100098
		c0.065979,0.0079956,0.1199951,0.0209961,0.1640015,0.0419922c0.0440063,0.019043,0.0749512,0.0419922,0.09198,0.0690308
		c0.0180054,0.0269775,0.026001,0.0629883,0.026001,0.1069946v0.8880005
		c0.2009888-0.2050171,0.3939819-0.3840332,0.5809937-0.5350342c0.1860352-0.1529541,0.3740234-0.2789917,0.5620117-0.3789673
		c0.1879883-0.1010132,0.382019-0.1760254,0.5809937-0.2280273c0.197998-0.052002,0.4069824-0.0780029,0.6279907-0.0780029
		c0.4799805,0,0.8890381,0.0939941,1.2269897,0.2800293c0.3380127,0.1859741,0.6140137,0.440979,0.8270264,0.7639771
		c0.2130127,0.3240356,0.367981,0.6990051,0.46698,1.1280212C87.6250458,60.2086792,87.674057,60.6636963,87.674057,61.1426697
		 M86.4180756,61.2826843c0-0.3380127-0.026001-0.6650085-0.0780029-0.9809875
		c-0.0510254-0.3160095-0.1400146-0.5960083-0.2659912-0.8410034s-0.2949829-0.440979-0.5059814-0.5880127
		c-0.2130127-0.1469727-0.4760132-0.2210083-0.7910156-0.2210083c-0.15802,0-0.3140259,0.0239868-0.46698,0.0700073
		c-0.1520386,0.0469971-0.3080444,0.1210327-0.4650269,0.2210083c-0.15802,0.0999756-0.322998,0.2319946-0.4949951,0.3959961
		c-0.1740112,0.1650085-0.3560181,0.3670044-0.5480347,0.6059875v2.632019
		c0.335022,0.4069824,0.6530151,0.71698,0.9540405,0.9329834c0.3009644,0.2160034,0.6159668,0.322998,0.9469604,0.322998
		c0.3050537,0,0.5670166-0.072998,0.7870483-0.2200012c0.2189941-0.1469727,0.3969727-0.3429871,0.5319824-0.5879822
		s0.2349854-0.5190125,0.2999878-0.822998C86.3860931,61.8976746,86.4180756,61.5916748,86.4180756,61.2826843"/>
	<path class="st0" d="M59.72472,82.5470886c0,0.0540161-0.0090332,0.1000061-0.0290527,0.1360168
		c-0.0199585,0.0369873-0.065979,0.0679932-0.1399536,0.09198c-0.0740356,0.0240173-0.1810303,0.0419922-0.322998,0.0509949
		c-0.1420288,0.0100098-0.3359985,0.0150146-0.5809937,0.0150146c-0.2050171,0-0.3700562-0.0050049-0.4920044-0.0150146
		c-0.1230469-0.0090027-0.2190552-0.0279846-0.2900391-0.0549927c-0.0719604-0.026001-0.1220093-0.0610046-0.151001-0.1019897
		c-0.0299683-0.0419922-0.0539551-0.0920105-0.0739746-0.151001l-0.8519897-2.1239929
		c-0.1030273-0.2400208-0.2030029-0.4530029-0.3010254-0.6390076c-0.0980225-0.1870117-0.2069702-0.3420105-0.3269653-0.4670105
		c-0.1210327-0.125-0.2590332-0.2189941-0.4150391-0.2829895c-0.1569824-0.0630188-0.3389893-0.0960083-0.5440063-0.0960083
		h-0.6029663v3.6230164c0,0.0499878-0.0159912,0.0939941-0.0480347,0.1329956
		c-0.0310059,0.0390015-0.0839844,0.0709839-0.157959,0.0950012c-0.0740356,0.0249939-0.1719971,0.0440063-0.2940063,0.0589905
		c-0.1220093,0.0150146-0.2789917,0.0220032-0.4700317,0.0220032c-0.1859741,0-0.3410034-0.0069885-0.46698-0.0220032
		c-0.125-0.0149841-0.223999-0.0339966-0.2969971-0.0589905c-0.0740356-0.0240173-0.125-0.0559998-0.1539917-0.0950012
		c-0.0300293-0.0390015-0.0450439-0.0830078-0.0450439-0.1329956v-8.6340027c0-0.2160034,0.0560303-0.3720093,0.1660156-0.4670105
		c0.1099854-0.0960083,0.2460327-0.1440125,0.40802-0.1440125h2.4609985c0.25,0,0.4559937,0.0050049,0.617981,0.0160217
		c0.1610107,0.0090027,0.3079834,0.0220032,0.44104,0.0359802c0.3809814,0.0540161,0.7259521,0.1470032,1.0319824,0.2790222
		c0.3059692,0.1319885,0.565979,0.3059998,0.7789917,0.5179749c0.2130127,0.2130127,0.3759766,0.4660034,0.4890137,0.757019
		c0.1129761,0.2919922,0.1690063,0.6260071,0.1690063,1.0029907c0,0.3190002-0.0400391,0.6090088-0.1210327,0.8720093
		c-0.0809937,0.2609863-0.2000122,0.4949951-0.3569946,0.7009888s-0.3499756,0.3850098-0.5809937,0.5370178
		c-0.2290039,0.1519775-0.4920044,0.2739868-0.7860107,0.3670044c0.1420288,0.0689697,0.276001,0.1519775,0.401001,0.25
		c0.125,0.0979919,0.2420044,0.2159729,0.3519897,0.3559875c0.1110229,0.1399841,0.2150269,0.2990112,0.3129883,0.4779968
		c0.0980225,0.178009,0.1940308,0.381012,0.2860107,0.6059875l0.8010254,1.8740234
		c0.0739746,0.1869812,0.1229858,0.321991,0.1469727,0.4079895C59.7126961,82.4310913,59.72472,82.4990845,59.72472,82.5470886
		 M57.2336922,76.0950928c0-0.3139954-0.0709839-0.5780029-0.2130127-0.7940063
		c-0.1419678-0.2149963-0.375-0.3670044-0.697998-0.4549866c-0.0979614-0.0249939-0.2099609-0.0450134-0.3349609-0.059021
		c-0.125-0.0149841-0.2970581-0.0219727-0.5180054-0.0219727h-0.8670044v2.696991h0.9849854
		c0.2739868,0,0.5139771-0.0329895,0.7199707-0.098999c0.2050171-0.0660095,0.3770142-0.1589966,0.5140381-0.2799988
		c0.1380005-0.1199951,0.2399902-0.2630005,0.30896-0.4290161C57.1996956,76.4870911,57.2336922,76.3010864,57.2336922,76.0950928"
		/>
	<path class="st0" d="M64.8308563,73.7723999c0,0.3729858-0.0770264,0.6289978-0.2280273,0.7720032
		c-0.1519775,0.1419983-0.43396,0.2129822-0.8449669,0.2129822c-0.4160156,0-0.6970215-0.0679932-0.842041-0.2049866
		c-0.1439819-0.1380005-0.21698-0.3850098-0.21698-0.7430115c0-0.3719788,0.0750122-0.6309814,0.2249756-0.7749939
		c0.1490479-0.144989,0.4320068-0.2170105,0.8480225-0.2170105c0.4119835,0,0.6909752,0.0700073,0.8389854,0.2090149
		C64.7578583,73.1663818,64.8308563,73.4143982,64.8308563,73.7723999 M64.6908417,82.5473938
		c0,0.0490112-0.0139771,0.0920105-0.0440063,0.1279907c-0.0289917,0.0379944-0.0800171,0.0680237-0.151001,0.0920105
		c-0.0700073,0.0249939-0.164978,0.0429993-0.2819824,0.0559998c-0.117981,0.0119934-0.2680016,0.0180054-0.4490318,0.0180054
		c-0.1819458,0-0.3309937-0.006012-0.447998-0.0180054c-0.117981-0.0130005-0.2119751-0.0310059-0.282959-0.0559998
		c-0.0720215-0.0239868-0.1210327-0.0540161-0.151001-0.0920105c-0.0289917-0.0359802-0.0440063-0.0789795-0.0440063-0.1279907
		v-6.5409851c0-0.0480042,0.0150146-0.0910034,0.0440063-0.1280212c0.0299683-0.0369873,0.0789795-0.0690002,0.151001-0.0960083
		c0.0709839-0.0269775,0.164978-0.0479736,0.282959-0.0619812c0.1170044-0.0140076,0.2660522-0.0220032,0.447998-0.0220032
		c0.1810303,0,0.3310509,0.0079956,0.4490318,0.0220032c0.1170044,0.0140076,0.2119751,0.0350037,0.2819824,0.0619812
		c0.0709839,0.0270081,0.1220093,0.059021,0.151001,0.0960083c0.0300293,0.0370178,0.0440063,0.0800171,0.0440063,0.1280212
		V82.5473938z"/>
	<path class="st0" d="M74.3749847,75.9849854c0,0.0239868-0.0009766,0.0539856-0.0040283,0.0880127
		c-0.0019531,0.0349731-0.006958,0.071991-0.0139771,0.1139832c-0.0079956,0.0410156-0.0169678,0.0889893-0.0299683,0.1430054
		c-0.0120239,0.0539856-0.0280151,0.1149902-0.0480347,0.1839905l-1.9689941,5.9300232
		c-0.0239868,0.0839844-0.0570068,0.1509705-0.098999,0.2029724c-0.0419922,0.0510254-0.1110229,0.0910034-0.2059937,0.1210022
		c-0.0950317,0.0290222-0.2249756,0.0490112-0.3900146,0.0580139c-0.1629639,0.0100098-0.3779907,0.0149841-0.6430054,0.0149841
		c-0.2589722,0-0.4710083-0.0059814-0.6350098-0.0179749c-0.164978-0.0120239-0.2929688-0.03302-0.3859863-0.0630188
		c-0.0930176-0.0289917-0.1599731-0.0690002-0.2019653-0.1210022c-0.0410156-0.0509949-0.0750122-0.1159973-0.1000366-0.1949768
		l-1.9689941-5.9300232c-0.0289917-0.0979919-0.0529785-0.1860046-0.0689697-0.2649841
		c-0.0170288-0.0780029-0.0280151-0.1350098-0.0300293-0.1690063s-0.0029907-0.0660095-0.0029907-0.0950012
		c0-0.0490112,0.0130005-0.0920105,0.039978-0.1289978c0.0270386-0.0369873,0.0750122-0.0670166,0.1430054-0.0920105
		c0.0690308-0.0239868,0.1619873-0.0409851,0.28302-0.0509949c0.1199951-0.0100098,0.2709961-0.0149841,0.4519653-0.0149841
		c0.2010498,0,0.3619995,0.0059814,0.4850464,0.0189819c0.1220093,0.0119934,0.2189941,0.0289917,0.2909546,0.0509949
		c0.0700073,0.0220032,0.1210327,0.0540161,0.1500244,0.0950012c0.0289917,0.0420227,0.0540161,0.0920105,0.072998,0.151001
		l1.492981,4.8139954l0.0440063,0.1830139l0.0440063-0.1830139l1.4689941-4.8139954
		c0.0150146-0.0589905,0.0380249-0.1089783,0.0700073-0.151001c0.0310059-0.0409851,0.0820312-0.072998,0.151001-0.0950012
		c0.0679932-0.0220032,0.1600342-0.0390015,0.2750244-0.0509949c0.1149902-0.0130005,0.2659912-0.0189819,0.4519653-0.0189819
		c0.1820068,0,0.3300171,0.0049744,0.4450073,0.0149841s0.2040405,0.0270081,0.2680054,0.0509949
		c0.0640259,0.0249939,0.1080322,0.0550232,0.1329956,0.0920105C74.3629608,75.8929749,74.3749847,75.9359741,74.3749847,75.9849854
		"/>
	<path class="st0" d="M79.260788,73.7723999c0,0.3729858-0.0770264,0.6289978-0.2280273,0.7720032
		c-0.1519775,0.1419983-0.43396,0.2129822-0.8449707,0.2129822c-0.4169922,0-0.6970215-0.0679932-0.842041-0.2049866
		c-0.1439819-0.1380005-0.21698-0.3850098-0.21698-0.7430115c0-0.3719788,0.0750122-0.6309814,0.223999-0.7749939
		c0.1500244-0.144989,0.4329834-0.2170105,0.8499756-0.2170105c0.4110107,0,0.6900024,0.0700073,0.8370361,0.2090149
		C79.1867523,73.1663818,79.260788,73.4143982,79.260788,73.7723999 M79.1207733,82.5473938
		c0,0.0490112-0.0139771,0.0920105-0.0440063,0.1279907c-0.0299683,0.0379944-0.0800171,0.0680237-0.151001,0.0920105
		c-0.0709839,0.0249939-0.164978,0.0429993-0.2819824,0.0559998c-0.117981,0.0119934-0.2680054,0.0180054-0.4490356,0.0180054
		c-0.1819458,0-0.3309937-0.006012-0.447998-0.0180054c-0.117981-0.0130005-0.2119751-0.0310059-0.282959-0.0559998
		c-0.0720215-0.0239868-0.1210327-0.0540161-0.151001-0.0920105c-0.0300293-0.0359802-0.0440063-0.0789795-0.0440063-0.1279907
		v-6.5409851c0-0.0480042,0.0139771-0.0910034,0.0440063-0.1280212c0.0299683-0.0369873,0.0789795-0.0690002,0.151001-0.0960083
		c0.0709839-0.0269775,0.164978-0.0479736,0.282959-0.0619812c0.1170044-0.0140076,0.2660522-0.0220032,0.447998-0.0220032
		c0.1810303,0,0.3310547,0.0079956,0.4490356,0.0220032c0.1170044,0.0140076,0.2109985,0.0350037,0.2819824,0.0619812
		c0.0709839,0.0270081,0.1210327,0.059021,0.151001,0.0960083c0.0300293,0.0370178,0.0440063,0.0800171,0.0440063,0.1280212
		V82.5473938z"/>
	<path class="st0" d="M88.8265839,79.0786743c0,0.2250061-0.0510254,0.3919983-0.151001,0.5
		c-0.1000366,0.1069946-0.2380371,0.1610107-0.4150391,0.1610107H84.269577c0,0.2799988,0.0339966,0.5329895,0.0999756,0.7609863
		s0.1710205,0.4210205,0.3150024,0.5810242c0.1450195,0.1589966,0.3319702,0.2799988,0.559021,0.3629761
		c0.2279663,0.0840149,0.5009766,0.125,0.8200073,0.125c0.322998,0,0.6079712-0.0229797,0.8519897-0.0699768
		c0.2449951-0.0460205,0.4569702-0.0970154,0.6359863-0.1540222c0.1790161-0.0559998,0.3269653-0.1080017,0.4439697-0.1539917
		c0.118042-0.0469971,0.2140503-0.0700073,0.2870483-0.0700073c0.0449829,0,0.0809937,0.0079956,0.1109619,0.026001
		c0.0289917,0.0169983,0.0530396,0.0480042,0.072998,0.0910034c0.0200195,0.0440063,0.03302,0.1069946,0.0400391,0.1870117
		c0.0079956,0.0820007,0.0109863,0.1829834,0.0109863,0.3059998c0,0.1080017-0.0020142,0.1990051-0.007019,0.2749939
		c-0.0050049,0.0769958-0.0119629,0.1409912-0.0219727,0.1960144c-0.0100098,0.0529785-0.0250244,0.0979919-0.0440063,0.1349792
		c-0.0200195,0.0370178-0.0460205,0.072998-0.0770264,0.1069946c-0.0319824,0.0339966-0.1189575,0.0810242-0.2609863,0.1390076
		c-0.1419678,0.0589905-0.3239746,0.1170044-0.5440063,0.1730042c-0.2199707,0.0570068-0.4729614,0.1059875-0.757019,0.1470032
		c-0.2849731,0.0419922-0.5879517,0.0629883-0.9109497,0.0629883c-0.5840454,0-1.0950317-0.0740051-1.5320435-0.2209778
		c-0.4389648-0.1470032-0.8049927-0.3700256-1.098999-0.6690063c-0.2949829-0.2990112-0.5130005-0.6759949-0.657959-1.132019
		c-0.144043-0.4549866-0.217041-0.9889832-0.217041-1.6019897c0-0.5820007,0.0760498-1.1080017,0.2280273-1.5759888
		c0.1519775-0.4670105,0.3720093-0.8640137,0.6619873-1.1900024c0.2880249-0.3269958,0.6400146-0.5750122,1.0540161-0.7460022
		c0.4140015-0.1719971,0.8809814-0.2579956,1.3999634-0.2579956c0.5490112,0,1.0180054,0.0809937,1.4070435,0.242981
		c0.3899536,0.1620178,0.7089844,0.3850098,0.9589844,0.6730042c0.2509766,0.2860107,0.434021,0.625,0.5510254,1.0180054
		c0.117981,0.3909912,0.177002,0.8179932,0.177002,1.2779846V79.0786743z M87.0335541,78.5496826
		c0.0139771-0.5190125-0.0900269-0.927002-0.3120117-1.223999c-0.223999-0.29599-0.5679932-0.4440002-1.032959-0.4440002
		c-0.2350464,0-0.4400024,0.0440063-0.6140137,0.1319885c-0.1740112,0.0880127-0.3190308,0.2070007-0.434021,0.3560181
		c-0.1140137,0.1499939-0.2030029,0.3259888-0.2630005,0.5289917c-0.0620117,0.20401-0.0980225,0.42099-0.1079712,0.651001
		H87.0335541z"/>
	<path class="st0" d="M96.3647308,76.6022034c0,0.1759949-0.0050049,0.3210144-0.0139771,0.4330139
		c-0.0110474,0.1129761-0.0250244,0.2009888-0.0450439,0.2649841c-0.0199585,0.0639954-0.0449829,0.1080017-0.0769653,0.1319885
		c-0.0320435,0.0250244-0.0720215,0.0370178-0.1210327,0.0370178c-0.0390015,0-0.0830078-0.0079956-0.131958-0.026001
		c-0.0500488-0.0169983-0.1040039-0.0350037-0.1660156-0.0549927c-0.0610352-0.0190125-0.1290283-0.0380249-0.2020264-0.0550232
		c-0.0739746-0.0169983-0.1539917-0.026001-0.2420044-0.026001c-0.1029663,0-0.2059937,0.0210266-0.30896,0.0630188
		c-0.1030273,0.0419922-0.2090454,0.1059875-0.3200073,0.1940002c-0.1099854,0.0879822-0.2250366,0.2059937-0.3450317,0.3540039
		c-0.1199951,0.1459961-0.2489624,0.3269958-0.3859863,0.5429993v4.0859985c0,0.0489807-0.0139771,0.09198-0.0440063,0.1289978
		c-0.0299683,0.0359802-0.0799561,0.0669861-0.151001,0.0910034c-0.0709839,0.0249939-0.164978,0.0429993-0.2819824,0.0559998
		c-0.117981,0.0119934-0.2680054,0.0180054-0.4489746,0.0180054c-0.1820068,0-0.3310547-0.006012-0.447998-0.0180054
		c-0.118042-0.0130005-0.2120361-0.0310059-0.28302-0.0559998c-0.0720215-0.0240173-0.1210327-0.0550232-0.151001-0.0910034
		c-0.0289917-0.0370178-0.0440063-0.0800171-0.0440063-0.1289978V75.992218c0-0.0490112,0.0120239-0.0920105,0.0369873-0.1290283
		c0.0239868-0.0369873,0.0679932-0.0669861,0.132019-0.09198c0.0639648-0.0240173,0.1459961-0.0419922,0.2459717-0.0540161
		c0.1010132-0.0130005,0.2270508-0.0189819,0.3790283-0.0189819c0.1560059,0,0.2860107,0.0059814,0.3889771,0.0189819
		c0.1030273,0.0120239,0.1830444,0.0299988,0.2390137,0.0540161c0.0560303,0.0249939,0.0969849,0.0549927,0.1209717,0.09198
		c0.0250244,0.0370178,0.0370483,0.0800171,0.0370483,0.1290283v0.815979
		c0.1709595-0.2449951,0.3330078-0.446991,0.4849854-0.6069946c0.1519775-0.1589966,0.2960205-0.2850037,0.434021-0.3779907
		c0.1369629-0.0930176,0.2739868-0.15802,0.4109497-0.1950073c0.1370239-0.0360107,0.2750244-0.0549927,0.4120483-0.0549927
		c0.0629883,0,0.131958,0.0039978,0.2049561,0.0109863c0.0740356,0.0079956,0.1500244,0.0200195,0.2290039,0.0370178
		c0.0780029,0.0169983,0.1459961,0.0369873,0.2050171,0.0589905s0.1019897,0.0449829,0.1279907,0.0690002
		c0.0270386,0.0249939,0.0469971,0.052002,0.0599976,0.0809937c0.0109863,0.0289917,0.0230103,0.0700073,0.0319824,0.1210022
		c0.0100098,0.052002,0.0180054,0.1289978,0.0220337,0.2319946C96.3617401,76.2861938,96.3647308,76.4262085,96.3647308,76.6022034"
		/>
	<path class="st0" d="M105.196579,79.0786743c0,0.2250061-0.0510254,0.3919983-0.151001,0.5
		c-0.1000366,0.1069946-0.2380371,0.1610107-0.4150391,0.1610107h-3.9899902c0,0.2799988,0.03302,0.5329895,0.098999,0.7609863
		s0.1710205,0.4210205,0.3150024,0.5810242c0.1450195,0.1589966,0.3319702,0.2799988,0.559021,0.3629761
		c0.2279663,0.0840149,0.5009766,0.125,0.8200073,0.125c0.322998,0,0.6079712-0.0229797,0.8519897-0.0699768
		c0.2449951-0.0460205,0.4569702-0.0970154,0.6359863-0.1540222c0.1790161-0.0559998,0.3269653-0.1080017,0.4439697-0.1539917
		c0.118042-0.0469971,0.2140503-0.0700073,0.2870483-0.0700073c0.0449829,0,0.0809937,0.0079956,0.1109619,0.026001
		c0.0289917,0.0169983,0.0530396,0.0480042,0.072998,0.0910034c0.0200195,0.0440063,0.03302,0.1069946,0.0400391,0.1870117
		c0.0079956,0.0820007,0.0109863,0.1829834,0.0109863,0.3059998c0,0.1080017-0.0020142,0.1990051-0.007019,0.2749939
		c-0.0050049,0.0769958-0.0119629,0.1409912-0.0219727,0.1960144c-0.0100098,0.0529785-0.0239868,0.0979919-0.0440063,0.1349792
		c-0.0200195,0.0370178-0.0460205,0.072998-0.0770264,0.1069946c-0.0319824,0.0339966-0.1189575,0.0810242-0.2619629,0.1390076
		c-0.1409912,0.0589905-0.322998,0.1170044-0.5430298,0.1730042c-0.2199707,0.0570068-0.4729614,0.1059875-0.757019,0.1470032
		c-0.2849731,0.0419922-0.5879517,0.0629883-0.9109497,0.0629883c-0.5840454,0-1.0950317-0.0740051-1.5320435-0.2209778
		c-0.4389648-0.1470032-0.8049927-0.3700256-1.098999-0.6690063c-0.2949829-0.2990112-0.5130005-0.6759949-0.657959-1.132019
		c-0.1450195-0.4549866-0.217041-0.9889832-0.217041-1.6019897c0-0.5820007,0.0760498-1.1080017,0.2280273-1.5759888
		c0.1519775-0.4670105,0.3720093-0.8640137,0.6619873-1.1900024c0.2880249-0.3269958,0.6400146-0.5750122,1.0540161-0.7460022
		c0.4140015-0.1719971,0.8800049-0.2579956,1.3999634-0.2579956c0.5490112,0,1.0180054,0.0809937,1.4070435,0.242981
		c0.3899536,0.1620178,0.7089844,0.3850098,0.9589844,0.6730042c0.2509766,0.2860107,0.434021,0.625,0.5510254,1.0180054
		c0.117981,0.3909912,0.177002,0.8179932,0.177002,1.2779846V79.0786743z M103.4035492,78.5496826
		c0.0139771-0.5190125-0.0900269-0.927002-0.3120117-1.223999c-0.223999-0.29599-0.5679932-0.4440002-1.032959-0.4440002
		c-0.2350464,0-0.4400024,0.0440063-0.6140137,0.1319885c-0.1740112,0.0880127-0.3190308,0.2070007-0.434021,0.3560181
		c-0.1149902,0.1499939-0.2030029,0.3259888-0.2639771,0.5289917c-0.0610352,0.20401-0.0970459,0.42099-0.1060181,0.651001
		H103.4035492z"/>
	<path class="st0" d="M114.7848358,82.5473938c0,0.0490112-0.0139771,0.0920105-0.0440063,0.1279907
		c-0.0299683,0.0379944-0.0789795,0.0680237-0.1469727,0.0920105c-0.0690308,0.0249939-0.1630249,0.0429993-0.28302,0.0559998
		c-0.1199951,0.0119934-0.2680054,0.0180054-0.4450073,0.0180054c-0.1809692,0-0.3309937-0.006012-0.4519653-0.0180054
		c-0.1190186-0.0130005-0.2140503-0.0310059-0.2820435-0.0559998c-0.0689697-0.0239868-0.117981-0.0540161-0.1469727-0.0920105
		c-0.0300293-0.0359802-0.0440063-0.0789795-0.0440063-0.1279907v-3.7409973c0-0.3179932-0.0230103-0.5679932-0.0700073-0.7489929
		s-0.1140137-0.3370056-0.2020264-0.4670105c-0.0879517-0.1289978-0.2029419-0.2309875-0.34198-0.302002
		c-0.1400146-0.0700073-0.302002-0.1059875-0.4879761-0.1059875c-0.2360229,0-0.473999,0.0859985-0.7139893,0.2579956
		c-0.2400513,0.17099-0.4900513,0.4199829-0.7490234,0.7489929v4.3580017c0,0.0490112-0.0150146,0.0920105-0.0440063,0.1279907
		c-0.0289917,0.0379944-0.0800171,0.0680237-0.151001,0.0920105c-0.0709839,0.0249939-0.1660156,0.0429993-0.28302,0.0559998
		c-0.1170044,0.0119934-0.2669678,0.0180054-0.447998,0.0180054c-0.1820068,0-0.3309937-0.006012-0.4489746-0.0180054
		c-0.1170044-0.0130005-0.2109985-0.0310059-0.2819824-0.0559998c-0.0710449-0.0239868-0.1210327-0.0540161-0.151001-0.0920105
		c-0.0289917-0.0359802-0.0440063-0.0789795-0.0440063-0.1279907v-6.5549927c0-0.0490112,0.0119629-0.0920105,0.0369873-0.1289978
		c0.0239868-0.0370178,0.0679932-0.0670166,0.132019-0.0910034c0.0629883-0.0249939,0.1459961-0.0429993,0.2459717-0.0559998
		c0.1010132-0.0119934,0.2269897-0.0180054,0.3790283-0.0180054c0.1560059,0,0.2859497,0.006012,0.3889771,0.0180054
		c0.1030273,0.0130005,0.1829834,0.0310059,0.2390137,0.0559998c0.0559692,0.0239868,0.0960083,0.0539856,0.1209717,0.0910034
		c0.0250244,0.0369873,0.0369873,0.0799866,0.0369873,0.1289978v0.7569885
		c0.3620605-0.3919983,0.7310181-0.6860046,1.1060181-0.8819885c0.375-0.1960144,0.7659912-0.2950134,1.1719971-0.2950134
		c0.4460449,0,0.8220215,0.0740051,1.1279907,0.2220154c0.3060303,0.1459961,0.5540161,0.3459778,0.7420044,0.5979919
		c0.1890259,0.2529907,0.3250122,0.5480042,0.40802,0.8859863c0.0839844,0.3380127,0.125,0.7440186,0.125,1.2200012V82.5473938z"/>
	<path class="st0" d="M120.2580414,82.5473938c0,0.0490112-0.0139771,0.0920105-0.0440063,0.1279907
		c-0.0299683,0.0379944-0.0800171,0.0680237-0.151001,0.0920105c-0.0709839,0.0249939-0.164978,0.0429993-0.2819824,0.0559998
		c-0.117981,0.0119934-0.2680054,0.0180054-0.4490356,0.0180054c-0.1819458,0-0.3309937-0.006012-0.447998-0.0180054
		c-0.117981-0.0130005-0.2119751-0.0310059-0.282959-0.0559998c-0.0720215-0.0239868-0.1210327-0.0540161-0.151001-0.0920105
		c-0.0300293-0.0359802-0.0440063-0.0789795-0.0440063-0.1279907v-9.6640015c0-0.0480042,0.0139771-0.0929871,0.0440063-0.1329956
		c0.0299683-0.0390015,0.0789795-0.0710144,0.151001-0.0979919c0.0709839-0.0270081,0.164978-0.0480042,0.282959-0.0630188
		c0.1170044-0.0149841,0.2660522-0.0220032,0.447998-0.0220032c0.1810303,0,0.3310547,0.007019,0.4490356,0.0220032
		c0.1170044,0.0150146,0.2109985,0.0360107,0.2819824,0.0630188c0.0709839,0.0269775,0.1210327,0.0589905,0.151001,0.0979919
		c0.0300293,0.0400085,0.0440063,0.0849915,0.0440063,0.1329956V82.5473938z"/>
	<path class="st0" d="M129.4936371,82.5700073c0,0.0679932-0.0239868,0.1219788-0.072998,0.1609802
		c-0.0499878,0.0400085-0.1259766,0.0679932-0.2319946,0.0849915c-0.1049805,0.0170288-0.2609863,0.0250244-0.4660034,0.0250244
		c-0.2210083,0-0.382019-0.0079956-0.4810181-0.0250244c-0.1010132-0.0169983-0.1719971-0.0449829-0.2139893-0.0849915
		c-0.0419922-0.0390015-0.0620117-0.0929871-0.0620117-0.1609802v-0.5230103
		c-0.2699585,0.2900085-0.5769653,0.5149841-0.9229736,0.677002c-0.3450317,0.1609802-0.7280273,0.2420044-1.1500244,0.2420044
		c-0.3479614,0-0.6679688-0.0450134-0.9589844-0.1360168c-0.2910156-0.0899963-0.5430298-0.2250061-0.757019-0.4039917
		c-0.2130127-0.1790161-0.3779907-0.401001-0.4949951-0.6650085c-0.117981-0.2649841-0.177002-0.572998-0.177002-0.9259949
		c0-0.3819885,0.0740356-0.7139893,0.223999-0.9949951c0.1500244-0.2829895,0.3720093-0.5150146,0.6690063-0.6990051
		c0.2960205-0.1839905,0.664978-0.3190002,1.1060181-0.4079895c0.440979-0.0870056,0.9519653-0.132019,1.5360107-0.132019h0.6389771
		v-0.3970032c0-0.2059937-0.0209961-0.3859863-0.0620117-0.539978c-0.0419922-0.1540222-0.1109619-0.28302-0.2059937-0.3860168
		c-0.0960083-0.1029968-0.2230225-0.1789856-0.3829956-0.2279968c-0.1589966-0.0489807-0.3560181-0.072998-0.5910034-0.072998
		c-0.3079834,0-0.5839844,0.0339966-0.8269653,0.1029968c-0.2420044,0.0679932-0.4570312,0.1440125-0.6430054,0.2270203
		c-0.1860352,0.0839844-0.342041,0.1599731-0.4660034,0.2289734c-0.125,0.0680237-0.2270508,0.1020203-0.3049927,0.1020203
		c-0.0550537,0-0.1020508-0.0169983-0.144043-0.0509949c-0.0419922-0.0340271-0.0759888-0.0830078-0.1029663-0.1470032
		c-0.026001-0.0639954-0.0469971-0.1419983-0.0620117-0.2350159c-0.0150146-0.0929871-0.0220337-0.1959839-0.0220337-0.3089905
		c0-0.151001,0.0120239-0.2720032,0.0370483-0.3600159c0.0239868-0.0879822,0.0709839-0.1679993,0.1389771-0.2389832
		c0.0690308-0.0710144,0.1890259-0.1490173,0.3610229-0.2350159c0.1709595-0.0859985,0.3719482-0.164978,0.6019897-0.2389832
		c0.2299805-0.072998,0.4819946-0.1329956,0.7529907-0.1799927c0.2719727-0.0460205,0.552002-0.0700073,0.84198-0.0700073
		c0.5140381,0,0.9540405,0.0509949,1.3190308,0.151001c0.3649902,0.1009827,0.664978,0.2550049,0.8999634,0.4629822
		c0.2350464,0.2080078,0.4070435,0.4760132,0.5140381,0.8050232c0.1079712,0.3280029,0.1619873,0.71698,0.1619873,1.1679993
		V82.5700073z M127.6786346,79.7619934h-0.7059937c-0.2980347,0-0.5529785,0.0220032-0.7639771,0.0660095
		c-0.2110596,0.0439758-0.382019,0.1109924-0.5140381,0.1990051c-0.1329956,0.0879822-0.2290039,0.1940002-0.2910156,0.3190002
		c-0.0609741,0.1259766-0.09198,0.2689819-0.09198,0.4299927c0,0.2749939,0.0880127,0.4899902,0.2620239,0.6470032
		c0.1729736,0.1569824,0.414978,0.2349854,0.7229614,0.2349854c0.2600098,0,0.4990234-0.0660095,0.717041-0.197998
		c0.2179565-0.1319885,0.4389648-0.3259888,0.664978-0.5809937V79.7619934z"/>
	<path class="st0" d="M139.4054413,82.5473938c0,0.0490112-0.0139771,0.0920105-0.0440063,0.1279907
		c-0.0299683,0.0379944-0.0789795,0.0680237-0.1469727,0.0920105c-0.0690308,0.0249939-0.1630249,0.0429993-0.28302,0.0559998
		c-0.1199951,0.0119934-0.2689819,0.0180054-0.4450073,0.0180054c-0.1809692,0-0.3309937-0.006012-0.4519653-0.0180054
		c-0.1200562-0.0130005-0.2140503-0.0310059-0.2820435-0.0559998c-0.0689697-0.0239868-0.117981-0.0540161-0.1469727-0.0920105
		c-0.0300293-0.0359802-0.0449829-0.0789795-0.0449829-0.1279907v-3.7409973c0-0.3179932-0.0230103-0.5679932-0.0690308-0.7489929
		c-0.0469971-0.1809998-0.1140137-0.3370056-0.2020264-0.4670105c-0.0879517-0.1289978-0.2029419-0.2309875-0.34198-0.302002
		c-0.1400146-0.0700073-0.3029785-0.1059875-0.4879761-0.1059875c-0.2360229,0-0.473999,0.0859985-0.7139893,0.2579956
		c-0.2400513,0.17099-0.4900513,0.4199829-0.7490234,0.7489929v4.3580017c0,0.0490112-0.0150146,0.0920105-0.0440063,0.1279907
		c-0.0299683,0.0379944-0.0800171,0.0680237-0.151001,0.0920105c-0.0709839,0.0249939-0.1660156,0.0429993-0.28302,0.0559998
		c-0.117981,0.0119934-0.2669678,0.0180054-0.447998,0.0180054c-0.1820068,0-0.3309937-0.006012-0.4489746-0.0180054
		c-0.1170044-0.0130005-0.2109985-0.0310059-0.2819824-0.0559998c-0.0710449-0.0239868-0.1210327-0.0540161-0.151001-0.0920105
		c-0.0289917-0.0359802-0.0440063-0.0789795-0.0440063-0.1279907v-6.5549927c0-0.0490112,0.0119629-0.0920105,0.0369873-0.1289978
		c0.0239868-0.0370178,0.0679932-0.0670166,0.132019-0.0910034c0.0629883-0.0249939,0.1449585-0.0429993,0.2459717-0.0559998
		c0.1010132-0.0119934,0.2269897-0.0180054,0.3790283-0.0180054c0.1560059,0,0.2859497,0.006012,0.3889771,0.0180054
		c0.1030273,0.0130005,0.1829834,0.0310059,0.2390137,0.0559998c0.0559692,0.0239868,0.0960083,0.0539856,0.1209717,0.0910034
		c0.0250244,0.0369873,0.0369873,0.0799866,0.0369873,0.1289978v0.7569885
		c0.3620605-0.3919983,0.7310181-0.6860046,1.1060181-0.8819885c0.375-0.1960144,0.7659912-0.2950134,1.1719971-0.2950134
		c0.4460449,0,0.8220215,0.0740051,1.1279907,0.2220154c0.3060303,0.1459961,0.5530396,0.3459778,0.7420044,0.5979919
		c0.1890259,0.2529907,0.3250122,0.5480042,0.40802,0.8859863c0.0839844,0.3380127,0.125,0.7440186,0.125,1.2200012V82.5473938z"/>
	<path class="st0" d="M149.2437592,82.5473022c0,0.0539856-0.0130005,0.098999-0.0369873,0.1359863
		c-0.0249634,0.0360107-0.065979,0.0670166-0.125,0.0920105c-0.05896,0.0239868-0.1380005,0.0409851-0.2390137,0.052002
		c-0.0999756,0.0090027-0.223999,0.0140076-0.3709717,0.0140076c-0.1569824,0-0.2839966-0.0050049-0.382019-0.0140076
		c-0.0979614-0.0110168-0.1779785-0.0280151-0.2390137-0.052002c-0.0609741-0.0249939-0.1049805-0.0559998-0.131958-0.0920105
		c-0.0270386-0.0369873-0.0400391-0.0820007-0.0400391-0.1359863v-0.7269897
		c-0.3389893,0.3619995-0.6929932,0.6439819-1.0619507,0.8449707c-0.3699951,0.2010193-0.7810059,0.3010254-1.2310181,0.3010254
		c-0.5,0-0.9229736-0.0970154-1.2680054-0.2910156c-0.3449707-0.1929932-0.6270142-0.45401-0.8449707-0.7819824
		c-0.2180176-0.3280029-0.3760376-0.7120056-0.473999-1.1500244c-0.0980225-0.4379883-0.1470337-0.8999939-0.1470337-1.3849792
		c0-0.5840149,0.0620117-1.1080017,0.1870117-1.572998c0.1259766-0.4660034,0.3079834-0.8630066,0.5469971-1.1900024
		c0.2409668-0.32901,0.539978-0.5810242,0.8980103-0.757019c0.3569946-0.177002,0.7689819-0.2649841,1.2340088-0.2649841
		c0.3670044,0,0.7009888,0.0749817,1,0.223999c0.2979736,0.1499939,0.5949707,0.368988,0.8889771,0.6579895V72.906311
		c0-0.0490112,0.0130005-0.0930176,0.039978-0.1330261c0.0270386-0.0390015,0.0760498-0.071991,0.1470337-0.098999
		c0.0709839-0.0269775,0.1660156-0.0479736,0.282959-0.0629883c0.1170044-0.0140076,0.2670288-0.0220032,0.4480591-0.0220032
		c0.1809692,0,0.3309937,0.0079956,0.447998,0.0220032c0.117981,0.0150146,0.2109985,0.0360107,0.2799683,0.0629883
		c0.0679932,0.0270081,0.1170044,0.0599976,0.1470337,0.098999c0.0289917,0.0400085,0.0439453,0.0840149,0.0439453,0.1330261
		V82.5473022z M147.4067841,78.1672974c-0.2650146-0.3330078-0.5180054-0.5870056-0.7609863-0.7640076
		c-0.2420044-0.1759949-0.4960327-0.2649841-0.7609863-0.2649841c-0.2400513,0-0.4460449,0.0599976-0.6210327,0.1799927
		c-0.1740112,0.1210022-0.3129883,0.2810059-0.4179688,0.4819946c-0.1060181,0.2000122-0.184021,0.4250183-0.2360229,0.6719971
		c-0.0510254,0.2480164-0.0770264,0.5010071-0.0770264,0.7600098c0,0.2749939,0.0220337,0.5419922,0.06604,0.8009949
		c0.0449829,0.2600098,0.1170044,0.4920044,0.21698,0.6950073c0.1010132,0.2030029,0.2340088,0.3659973,0.401001,0.4889832
		c0.1660156,0.1220093,0.3770142,0.1830139,0.632019,0.1830139c0.1269531,0,0.2509766-0.0180054,0.3709717-0.0549927
		c0.1199951-0.0360107,0.2420044-0.0960083,0.3670044-0.1790161s0.2540283-0.1929932,0.3859863-0.3280029
		c0.1329956-0.1340027,0.2770386-0.2999878,0.434021-0.4960022V78.1672974z"/>
</g>
</svg>
