<?xml version="1.0" encoding="utf-8"?>
<!-- Generator: Adobe Illustrator 26.3.1, SVG Export Plug-In . SVG Version: 6.00 Build 0)  -->
<svg version="1.1" id="Laag_1" xmlns="http://www.w3.org/2000/svg" xmlns:xlink="http://www.w3.org/1999/xlink" x="0px" y="0px"
	 viewBox="0 0 315.8 121.3" style="enable-background:new 0 0 315.8 121.3;" xml:space="preserve">
<style type="text/css">
	.st0{fill:#40BFDC;}
	.st1{fill:#60605A;}
</style>
<g>
	<path class="st0" d="M57.6,0.5c0.6,0.2,0.9,0.7,1,1.3c0,0.2,0.1,0.3,0.3,0.4c2.4,1.7,4.7,3.4,7.1,5.2c0.2,0.1,0.2,0.2,0.2,0.4
		c-0.9,3.8-1.9,7.5-2.8,11.3c0,0.1,0,0.1-0.1,0.2c-0.8-0.6-1.5-1.1-2.3-1.7c-2.9-2.2-5.9-4.3-8.8-6.5c-0.2-0.1-0.3-0.2-0.5,0
		c-0.4,0.2-0.7,0.1-1-0.1c-0.3-0.3-0.4-0.6-0.3-1c0.1-0.3,0.2-0.5,0.4-0.7c2-2.8,4.1-5.5,6.1-8.3c0.2-0.3,0.4-0.4,0.7-0.5
		C57.5,0.5,57.5,0.5,57.6,0.5z M62.4,7.5c0-0.1-0.1-0.1-0.1-0.2C62.1,7.1,62,7,61.8,6.8c-0.2-0.3-0.3-0.2-0.6-0.1
		c-0.6,0.5-1.2,0.9-1.8,1.4c-0.2,0.1-0.3,0.1-0.4,0c-0.3-0.4-0.7-0.9-1.1-1.3c-0.2-0.2-0.4-0.7-0.6-0.7c-0.3,0-0.5,0.4-0.8,0.5
		c-0.2,0.1-0.2,0.2-0.1,0.4c0.5,0.6,1,1.2,1.5,1.8c0.1,0.2,0.1,0.2,0,0.4c-0.5,0.3-0.9,0.7-1.3,1c-0.2,0.2-0.7,0.4-0.7,0.6
		c-0.1,0.3,0.4,0.5,0.5,0.8c0.1,0.2,0.3,0.2,0.5,0.1c0.6-0.5,1.3-1,1.9-1.5c0.2-0.1,0.2-0.1,0.4,0c0.3,0.4,0.7,0.9,1.1,1.3
		c0.2,0.2,0.4,0.7,0.6,0.7c0.3,0,0.5-0.4,0.8-0.5c0.2-0.1,0.2-0.3,0-0.4c-0.5-0.6-1-1.2-1.4-1.8c-0.2-0.2-0.2-0.3,0.1-0.5
		c0.6-0.5,1.2-0.9,1.8-1.4C62.3,7.7,62.4,7.6,62.4,7.5z"/>
	<path class="st0" d="M62.5,61.9c2.8,0,5.5,0,8.3,0c0.4,0,0.4,0,0.3,0.4c-3,8.1-6,16.2-9,24.3c-3.7,10-7.4,19.9-11.1,29.9
		c-0.5,1.3-1,2.6-1.4,3.9c-0.1,0.2-0.2,0.4-0.5,0.4c-4.1,0-8.3,0-12.4,0c-0.2,0-0.4-0.1-0.5-0.3c-2.2-6-4.4-11.9-6.6-17.9
		c-0.1-0.3-0.2-0.4-0.5-0.3c-3.8,0.8-7.5,1.7-11.3,2.5c-0.9,0.2-0.9,0.2-1.1-0.7c-0.6-2.6-1.2-5.2-1.8-7.8c-0.1-0.3,0-0.3,0.3-0.4
		c3.8-0.7,7.7-1.4,11.5-2c3.4-0.6,6.9-1.2,10.3-1.8c0.8-0.1,0.8-0.1,0.9,0.6c0.7,3.6,1.4,7.3,2.2,10.9c0,0.2,0.1,0.3,0.3,0.3
		c1.6,0,3.2,0,4.8,0c0.2,0,0.3-0.1,0.3-0.3c0.8-4.4,1.6-8.7,2.4-13.1c0-0.3,0.1-0.4,0.4-0.4c2.6-0.4,5.2-0.9,7.8-1.4
		c0.3,0,0.4-0.1,0.4-0.4c0.3-1.9,0.6-3.8,0.8-5.6c0-0.2,0-0.3-0.2-0.3c-1.9-0.1-3.9-0.2-5.8-0.3c-0.5,0-0.9-0.1-1.4-0.1
		c-0.2,0-0.3-0.1-0.3-0.3c0.6-2.8,1.2-5.6,1.7-8.5c0.7-3.6,1.5-7.3,2.2-10.9c0.1-0.3,0.2-0.4,0.5-0.4C56.9,61.9,59.7,61.9,62.5,61.9
		z"/>
	<path class="st0" d="M60.7,31c0.1,0.3-0.1,0.3-0.3,0.1c0,0.1,0,0.2,0,0.3c-0.1,0-0.1-0.2-0.3-0.2c-0.1,0,0,0.2-0.1,0.3
		c-0.1,0-0.1-0.2-0.2-0.3c0,0.1-0.1,0.2-0.2,0.3c-0.1-0.1,0-0.2-0.2-0.3c-0.1,0.3,0,0.6,0.1,0.8c0.3,1.9,0.6,3.9,0.9,5.8
		c0,0.1,0.1,0.3,0.1,0.4c0.4,0.7,0.7,1.4,1.1,2.2c0.1,0.2,0.1,0.4,0.1,0.6c-0.6,3-1.3,6-1.9,9c0,0.2-0.1,0.3-0.3,0.3
		c-1.1,0-2.2,0-3.3,0c-0.2,0-0.3-0.1-0.2-0.3c0.6-3.2,1.3-6.4,1.9-9.6c0-0.2,0-0.3-0.1-0.5c-1.4-1.9-2.8-3.8-4.2-5.7
		c-0.2-0.2-0.2-0.2-0.4,0c-1.4,2.2-2.7,4.5-4.1,6.7C49,41.2,49,41.4,49,41.6c0,1.7,0.1,3.4,0.1,5.2c0,1.1,0,2.2,0.1,3.3
		c0,0.2,0,0.3-0.3,0.3c-1.4,0-2.9,0-4.3,0c-0.3,0-0.3-0.1-0.2-0.3c0.5-1.6,1-3.3,1.6-4.9c0.4-1,0.5-2.1,0.7-3.2
		c0.5-2.6,0.9-5.2,1.3-7.8c0.1-0.7,0.2-1.4,0.4-2.1c0-0.2,0-0.3-0.3-0.3c-0.7,0-1.5-0.1-2.2-0.1c-0.2,0-0.3,0-0.5,0.2
		c-0.8,0.8-1.6,1.6-2.5,2.3c-0.2,0.1-0.3,0.2-0.5,0.2c-0.6,0-1.3,0-1.9,0c-0.2,0-0.3,0.1-0.4,0.2c-0.8,1-1,2.1-0.7,3.3
		c0.8,4.1,1.7,8.2,2.5,12.3c0.1,0.3,0,0.3-0.2,0.3c-1.5,0-3,0-4.5,0c-0.2,0-0.3-0.1-0.3-0.3c0-1,0-1.9,0-2.9c0-3,0-6,0-9.1
		c0-0.2-0.1-0.3-0.2-0.5c-1.4-1.1-2.7-2.3-4.1-3.4c-0.1-0.1-0.2-0.2-0.3-0.3c-1.2-2.6-2.4-5.1-3.3-7.8c-0.3-0.7-0.4-1.5-0.2-2.2
		c0.1-0.3,0-0.7-0.1-1c-0.3-0.5-0.4-1.1-0.2-1.7c0.2-0.4,0.1-0.8-0.1-1.1c-0.3-0.5-0.3-1-0.1-1.5c0.2-0.4,0.2-0.9,0-1.3
		c-0.2-0.5-0.3-0.9,0-1.4c0.2-0.4,0.2-0.8,0-1.3c-0.2-0.4-0.1-0.7,0.1-1.1c0.3-0.3,0.3-0.7,0.2-1.1c-0.1-0.4-0.1-0.8,0.3-1.1
		c0.3-0.3,0.4-0.7,0.3-1.2c-0.1-0.4,0.1-0.7,0.4-1c0.2-0.2,0.5-0.4,0.5-0.8c0.1-0.2,0-0.4-0.2-0.6c-0.5-0.6-0.9-1.2-1.3-1.9
		c-0.4-0.9-0.2-1.3,0.9-1.4c0.4,0,0.8,0.1,1.2,0.3c0.6,0.2,1.2,0.4,1.9,0.5c0.4,0,0.7-0.1,1-0.3c0.4-0.4,0.9-0.6,1.4-0.5
		c1.4,0.1,2.8,0.2,4.2,0.4c0.8,0.1,1.5,0.6,1.9,1.3c1.2,2.2,2.5,4.4,3.7,6.5c0.4,0.6,0.3,1-0.3,1.3C44,14.2,44,14.3,44,14.4
		c0,0.9-0.4,1.3-1.3,1.3c-2,0-4.1,0-6.1,0c-0.3,0-0.4,0.1-0.5,0.4c-0.2,0.9-0.3,1.7-0.1,2.6c0.4,1.3,1.3,1.9,2.6,1.9
		c0.3,0,0.6,0,0.9,0c0.7,0.1,1.2-0.3,1.7-0.8c0.1-0.2,0.3-0.3,0.4-0.5c0.5-0.6,1.1-0.7,1.7-0.2c0.2,0.1,0.3,0.2,0.5,0.3
		c0.5,0.4,1.1,0.4,1.7,0.1c0.3-0.2,0.6-0.4,1-0.5c0.5-0.1,0.9,0,1.3,0.3c0.3,0.3,0.6,0.6,1.1,0.6c0.5,0.1,0.9-0.1,1.3-0.4
		c0.6-0.4,1.2-0.4,1.8-0.2c0.2,0.1,0.4,0.2,0.5,0.3c0.4,0.4,1,0.4,1.5,0.3c0.2-0.1,0.5-0.1,0.7-0.2c0.9,0,1.5,0.8,1.1,1.6
		c-0.1,0.3-0.2,0.6-0.1,0.9c0.2,0.4,0.5,0.6,1,0.6c1,0.1,1.3,0.8,0.9,1.7c-0.1,0.2-0.3,0.5-0.2,0.8c0.1,0.4,0.4,0.7,0.9,0.7
		c0.2,0,0.5,0,0.7,0.1c0.5,0.2,0.7,0.7,0.5,1.2c-0.1,0.2-0.2,0.4-0.3,0.6c-0.1,0.3-0.1,0.6,0.2,0.8c0.1-0.1,0-0.2,0.1-0.3
		c0.1,0,0.1,0.2,0.2,0.2c0.1,0,0.1-0.2,0.2-0.3c0,0.1,0.1,0.2,0.1,0.4c0.1-0.1,0.1-0.2,0.2-0.3c0,0.1,0,0.2,0,0.4
		c0.1-0.1,0.2-0.1,0.2-0.1c0,0,0,0,0,0c-0.1,0.3,0,0.3,0.4,0.1c-0.3,0.4-0.1,0.5,0.1,0.4c0,0.1-0.2,0.2-0.2,0.3c0.1,0,0.2,0,0.4,0
		c-0.1,0.1-0.2,0.1-0.3,0.2c0.1,0.1,0.2,0.1,0.3,0.1c0,0.1-0.2,0.1-0.2,0.2c0,0.1,0.2,0.1,0.2,0.3c-0.1,0-0.2,0-0.3,0
		c0.1,0.1,0.1,0.2,0.2,0.3l0,0c-0.1,0-0.2,0-0.3,0c0,0.1,0.1,0.2,0.1,0.3C60.9,31,60.8,31,60.7,31C60.7,31,60.6,31,60.7,31
		C60.6,31,60.6,31,60.7,31z M34.9,10L34.9,10c0,0.1-0.1,0.2,0,0.2c0.1,0,0.1,0.3,0.3,0.2c0.2,0.3,0.5,0.3,0.7,0.3c0.4,0,0.8,0,1.2,0
		c0.2,0,0.3-0.1,0.2-0.3c-0.3-0.6-0.3-1.2-0.7-1.7c-0.1-0.1-0.2-0.3-0.4-0.3c-0.1,0-0.1-0.1-0.1-0.1c0,0,0-0.1-0.1-0.1
		C35.9,8.4,36,8.1,35.9,8c0,0.4-0.2,0.1-0.3,0c0,0.1-0.1,0.2-0.1,0.3c-0.1-0.1-0.1-0.2-0.1-0.2c-0.1,0,0.1,0.4-0.3,0.2
		c-0.1-0.1-0.1,0-0.1,0.1c0,0.1,0,0.2-0.1,0.1c-0.2-0.1-0.1,0-0.1,0.1c0.1,0.1,0,0.1-0.1,0.1c0,0-0.2,0-0.1,0.1
		C34.9,9.1,34.6,9,34.5,9c0.1,0.1,0.2,0.1,0.2,0.2c0,0.1-0.1,0.1-0.2,0.1c0.1,0,0.2,0.1,0.3,0.1c-0.1,0.1-0.1,0.1-0.2,0.2
		c0.1,0,0.2,0,0.3,0.1c-0.1,0.1-0.1,0.2-0.2,0.2C34.7,9.9,34.8,10,34.9,10z"/>
	<path class="st0" d="M23.3,61.9c2.8,0,5.6,0,8.3,0c0.3,0,0.4,0.1,0.5,0.4c0.9,4.5,1.8,9,2.6,13.5c0.3,1.7,0.7,3.4,1,5.2
		c0,0.2,0,0.3-0.2,0.3c-1.4-0.1-2.8-0.2-4.2-0.2c-2.2-0.1-4.5-0.3-6.7-0.4c-1.4-0.1-2.7-0.1-4.1-0.2c-2.2-0.1-4.5-0.3-6.7-0.4
		c-1.4-0.1-2.7-0.1-4.1-0.2c-1.3-0.1-2.6-0.1-4-0.2c-0.2,0-0.3-0.1-0.3-0.3c-0.7-2.8-1.3-5.7-2-8.5c-0.1-0.2,0-0.3,0.2-0.3
		c2.3,0.2,4.7,0.4,7,0.6c2.4,0.2,4.9,0.4,7.3,0.7c0.3,0,0.2-0.1,0.2-0.3c-1.1-2.9-2.2-5.7-3.2-8.6c-0.1-0.2-0.2-0.5-0.3-0.7
		c-0.1-0.2,0-0.2,0.1-0.2c0.1,0,0.2,0,0.2,0C17.7,61.9,20.5,61.9,23.3,61.9z"/>
	<path class="st0" d="M25.8,37.6c2.1,0.5,4.1,1.1,6.1,1.6c-0.4,0.5-0.7,0.9-1,1.3c-0.6,0.7-1.2,1.4-1.7,2.2
		c-0.1,0.2-0.2,0.2-0.4,0.1c-1.5-1.3-2.9-2.6-4.4-4c-0.3-0.3-0.6-0.6-0.9-0.8c-0.1-0.1-0.1-0.2,0-0.3c1.2-1.4,2.4-2.7,3.6-4.1
		c0.7-0.8,1.4-1.6,2.1-2.4c0,0,0.1-0.1,0.1-0.1c0.3,0.6,0.6,1.2,0.8,1.8c0.3,0.6,0.6,1.3,0.9,1.9c0.1,0.2,0.1,0.3-0.1,0.4
		c-1.6,0.8-3.1,1.5-4.7,2.3C26.1,37.5,26,37.5,25.8,37.6z"/>
	<path class="st0" d="M60.6,28.8C60.6,28.8,60.6,28.8,60.6,28.8C60.7,28.8,60.7,28.8,60.6,28.8C60.6,28.8,60.6,28.8,60.6,28.8z"/>
	<path class="st0" d="M61.1,30.7C61.2,30.7,61.2,30.7,61.1,30.7C61.2,30.7,61.2,30.8,61.1,30.7C61.2,30.7,61.2,30.7,61.1,30.7
		C61.2,30.7,61.1,30.7,61.1,30.7z"/>
	<path class="st0" d="M34.9,10C34.9,9.9,34.9,9.9,34.9,10C34.9,9.9,34.9,9.9,34.9,10C34.9,9.9,34.9,10,34.9,10
		C34.9,10,34.9,10,34.9,10z"/>
</g>
<g>
	<path class="st1" d="M172.3,69.5c-2.3,3.4-4.6,6.9-7,10.4c-0.1-0.1-0.2-0.2-0.3-0.3c-2.2-3.2-4.3-6.5-6.5-9.7
		c-0.1-0.1-0.1-0.1-0.2-0.2c0,0,0,0-0.1,0c0,0.1,0,0.2,0,0.4c0,4.9,0,9.9,0,14.8c0,0.1,0,0.1,0,0.2c0,0.2-0.1,0.2-0.2,0.2
		c-1.1,0-2.2,0-3.3,0c-0.2,0-0.2-0.1-0.2-0.2c0,0,0-0.1,0-0.1c0-7.1,0-14.2,0-21.2c0-0.4,0-0.4,0.4-0.4c1.1,0,2.3,0,3.4,0
		c0.2,0,0.3,0.1,0.4,0.2c1.2,1.9,2.5,3.8,3.7,5.7c0.9,1.4,1.8,2.8,2.7,4.2c0.2,0.3,0.2,0.3,0.4,0c0.6-0.9,1.1-1.7,1.7-2.6
		c1.3-2,2.6-4.1,3.9-6.1c0.3-0.4,0.5-0.8,0.8-1.2c0.1-0.2,0.2-0.2,0.4-0.2c1.2,0,2.3,0,3.5,0c0.3,0,0.3,0,0.3,0.3
		c0,6.1,0,12.2,0,18.4c0,1,0,2,0,3c0,0.2-0.1,0.3-0.3,0.3c-1.1,0-2.2,0-3.2,0c-0.3,0-0.3,0-0.3-0.3c0-5,0-10,0-15.1
		C172.4,69.8,172.4,69.7,172.3,69.5C172.4,69.5,172.3,69.5,172.3,69.5z"/>
	<path class="st1" d="M244.8,69.7c0,0.1,0,0.2,0,0.3c0,4.9,0,9.9,0,14.8c0,0.5,0,0.4-0.4,0.4c-1,0-2,0-3,0c-0.2,0-0.3-0.1-0.3-0.3
		c0-7.1,0-14.3,0-21.4c0-0.2,0.1-0.3,0.3-0.3c1,0,2,0,3,0c0.2,0,0.3,0,0.4,0.2c1.2,1.5,2.3,3,3.5,4.5c1.1,1.4,2.1,2.8,3.2,4.2
		c1.2,1.6,2.5,3.2,3.7,4.8c0.4,0.5,0.8,1,1.1,1.4c0,0,0.1,0.1,0.1,0.1c0-0.1,0.1-0.1,0.1-0.2c0-0.1,0-0.2,0-0.2c0-4.8,0-9.6,0-14.4
		c0-0.4,0-0.4,0.4-0.4c1,0,2.1,0,3.1,0c0.2,0,0.3,0.1,0.3,0.3c0,7.1,0,14.3,0,21.4c0,0.2-0.1,0.3-0.3,0.3c-0.9,0-1.8,0-2.7,0
		c-0.1,0-0.2-0.1-0.3-0.1c-0.7-0.9-1.4-1.7-2.1-2.6c-0.9-1.2-1.8-2.3-2.7-3.5c-0.7-0.9-1.4-1.8-2.1-2.8c-0.9-1.1-1.8-2.3-2.7-3.4
		c-0.8-1-1.5-2-2.3-3C245,69.7,244.9,69.7,244.8,69.7C244.9,69.7,244.8,69.7,244.8,69.7z"/>
	<path class="st1" d="M116.2,65.9c-0.8,1-1.6,1.9-2.4,2.8c-0.5-0.3-0.9-0.6-1.3-0.9c-1.1-0.7-2.2-1.2-3.5-1.3
		c-0.5,0-1.1-0.1-1.6-0.1c-1.5,0.1-2.9,0.5-4.1,1.5c-1.2,1-2,2.2-2.5,3.6c-0.2,0.6-0.3,1.2-0.4,1.9c-0.2,1.3,0,2.6,0.4,3.9
		c0.3,1,0.8,1.8,1.5,2.6c1.2,1.3,2.6,2,4.3,2.3c2,0.3,4-0.1,5.8-1.1c0,0,0.1,0,0.1-0.1c0.6-0.2,0.8-0.7,0.8-1.3c-0.1-1,0-2,0-3
		c0-0.3,0-0.3-0.3-0.3c-1.7,0-3.4,0-5,0c-0.3,0-0.3,0-0.3-0.3c0-0.9,0-1.8,0-2.8c0-0.2,0-0.3,0.3-0.3c2.9,0,5.9,0,8.8,0
		c0.2,0,0.3,0.1,0.3,0.3c0,2.9,0,5.8,0,8.7c0,0.1-0.1,0.3-0.2,0.4c-0.9,0.7-1.8,1.4-2.8,1.9c-1.4,0.7-2.8,1.1-4.3,1.3
		c-1,0.1-1.9,0.2-2.9,0.1c-1.8-0.1-3.5-0.6-5.1-1.5c-1-0.6-1.8-1.2-2.5-2c-1.1-1.3-1.9-2.8-2.4-4.4c-0.4-1.3-0.5-2.7-0.4-4
		c0.1-1.4,0.4-2.7,1-4c0.4-1,1-1.9,1.7-2.7c0.9-1,1.9-1.9,3.1-2.5c1-0.6,2.2-1,3.3-1.2c1.1-0.2,2.1-0.3,3.2-0.2
		c1.1,0.1,2.2,0.2,3.3,0.6c1.2,0.4,2.4,1,3.4,1.8C115.7,65.5,116,65.7,116.2,65.9z"/>
	<path class="st1" d="M127.8,74.3c0-3.5,0-7.1,0-10.6c0-0.3,0-0.3,0.3-0.3c5.2,0,10.5,0,15.7,0c0.3,0,0.3,0,0.3,0.3
		c0,0.9,0,1.8,0,2.8c0,0.2-0.1,0.3-0.3,0.3c-3.9,0-7.9,0-11.8,0c-0.4,0-0.4,0-0.4,0.4c0,1.7,0,3.4,0,5.1c0,0.3,0,0.3,0.3,0.3
		c3.5,0,6.9,0,10.4,0c0.3,0,0.3,0,0.3,0.3c0,0.9,0,1.8,0,2.7c0,0.3,0,0.3-0.3,0.3c-3.4,0-6.8,0-10.2,0c-0.1,0-0.1,0-0.2,0
		c-0.3,0-0.3,0-0.3,0.3c0,0.6,0,1.1,0,1.7c0,1.2,0,2.4,0,3.7c0,0.3,0,0.3,0.3,0.3c4,0,8,0,11.9,0c0.4,0,0.4,0,0.4,0.4
		c0,0.9,0,1.8,0,2.8c0,0.2,0,0.3-0.3,0.3c-5.3,0-10.6,0-16,0c-0.2,0-0.3-0.1-0.3-0.3C127.8,81.4,127.8,77.8,127.8,74.3z"/>
	<path class="st1" d="M214.7,74.2c0-3.5,0-7.1,0-10.6c0-0.3,0-0.3,0.3-0.3c5.2,0,10.4,0,15.7,0c0.3,0,0.3,0,0.3,0.3
		c0,0.9,0,1.8,0,2.7c0,0.3,0,0.3-0.3,0.3c-3.9,0-7.9,0-11.8,0c-0.4,0-0.4,0-0.4,0.4c0,1.7,0,3.4,0,5.1c0,0.3,0,0.3,0.3,0.3
		c3.5,0,6.9,0,10.4,0c0.3,0,0.3,0,0.3,0.3c0,0.9,0,1.8,0,2.8c0,0.3,0,0.3-0.3,0.3c-3.5,0-6.9,0-10.4,0c-0.4,0-0.4,0-0.4,0.4
		c0,1.8,0,3.5,0,5.3c0,0.4,0,0.4,0.4,0.4c4,0,8,0,11.9,0c0.4,0,0.4,0,0.4,0.4c0,0.9,0,1.8,0,2.8c0,0.2-0.1,0.3-0.3,0.3
		c-5.3,0-10.6,0-16,0c-0.2,0-0.3-0.1-0.3-0.3C214.7,81.4,214.7,77.8,214.7,74.2z"/>
	<path class="st1" d="M187.1,74.3c0-3.5,0-7.1,0-10.6c0-0.3,0-0.3,0.4-0.3c5.2,0,10.4,0,15.6,0c0.3,0,0.3,0,0.3,0.3
		c0,0.9,0,1.8,0,2.7c0,0.3,0,0.3-0.3,0.3c-3.9,0-7.7,0-11.6,0c-0.1,0-0.2,0-0.2,0c-0.3,0-0.3,0-0.3,0.3c0,1.4,0,2.7,0,4.1
		c0,0.4,0,0.7,0,1.1c0,0.3,0,0.3,0.3,0.3c3.2,0,6.3,0,9.5,0c0.4,0,0.7,0,1.1,0c0.1,0,0.2,0,0.2,0.2c0,1,0,2,0,3
		c0,0.2-0.1,0.2-0.3,0.2c-1.1,0-2.2,0-3.3,0c-2.4,0-4.8,0-7.2,0c-0.4,0-0.4,0-0.4,0.3c0,1.8,0,3.5,0,5.3c0,0.3,0,0.3,0.4,0.3
		c4,0,7.9,0,11.9,0c0.5,0,0.4,0,0.4,0.4c0,0.9,0,1.8,0,2.7c0,0.2-0.1,0.3-0.3,0.3c-5.3,0-10.6,0-15.9,0c-0.3,0-0.3-0.1-0.3-0.3
		C187.1,81.4,187.1,77.8,187.1,74.3z"/>
	<path class="st1" d="M295.6,74.3c0-3.5,0-7.1,0-10.6c0-0.3,0-0.3,0.3-0.3c5.2,0,10.4,0,15.6,0c0.3,0,0.3,0,0.3,0.3
		c0,0.9,0,1.9,0,2.8c0,0.2-0.1,0.3-0.3,0.3c-3.9,0-7.9,0-11.8,0c-0.4,0-0.4,0-0.4,0.4c0,1.7,0,3.4,0,5.1c0,0.3,0,0.3,0.4,0.3
		c3.5,0,6.9,0,10.4,0c0.3,0,0.3,0,0.3,0.3c0,0.9,0,1.8,0,2.8c0,0.2-0.1,0.3-0.3,0.3c-3.5,0-7,0-10.4,0c-0.4,0-0.4,0-0.4,0.4
		c0,1.8,0,3.5,0,5.3c0,0.3,0,0.3,0.3,0.3c4,0,8,0,12,0c0.4,0,0.4,0,0.4,0.4c0,0.9,0,1.9,0,2.8c0,0.2-0.1,0.3-0.3,0.3
		c-5.3,0-10.6,0-16,0c-0.3,0-0.2-0.1-0.2-0.3C295.6,81.4,295.6,77.8,295.6,74.3z"/>
	<path class="st1" d="M279.9,76c0,3,0,5.9,0,8.9c0,0.3,0,0.3-0.3,0.3c-1.1,0-2.2,0-3.2,0c-0.3,0-0.3,0-0.3-0.3c0-5.9,0-11.8,0-17.6
		c0-0.1,0-0.2,0-0.2c0-0.2-0.1-0.3-0.3-0.3c-1.1,0-2.3,0-3.4,0c-1.1,0-2.1,0-3.2,0c-0.2,0-0.3-0.1-0.3-0.3c0-1,0-1.9,0-2.9
		c0-0.3,0-0.3,0.3-0.3c5.4,0,10.8,0,16.2,0c0.3,0,0.6,0,0.9,0c0.2,0,0.2,0.1,0.2,0.2c0,1,0,2,0,3.1c0,0.2-0.1,0.2-0.3,0.2
		c-2,0-4,0-6.1,0c-0.4,0-0.4,0-0.4,0.4C279.9,70.1,279.9,73.1,279.9,76z"/>
	<g>
		<path class="st1" d="M233.1,103.8c0,0.2,0,0.3,0,0.4c0,4.9,0,9.9,0,14.8c0,0.1,0,0.1,0,0.2c0,0.2,0,0.2-0.2,0.2
			c-1.1,0-2.2,0-3.3,0c-0.2,0-0.2-0.1-0.2-0.2c0-0.2,0-0.4,0-0.6c0-6.9,0-13.9,0-20.8c0-0.4,0-0.4,0.4-0.4c1,0,1.9,0,2.9,0
			c0.2,0,0.3,0.1,0.4,0.2c0.7,0.9,1.4,1.8,2.1,2.7c0.9,1.2,1.8,2.3,2.7,3.5c0.7,0.8,1.3,1.7,2,2.5c0.9,1.2,1.8,2.3,2.7,3.5
			c0.7,0.8,1.3,1.7,2,2.5c0.1,0.1,0.1,0.1,0.2,0.2c0,0,0,0,0.1,0c0-0.1,0-0.2,0-0.3c0-4.8,0-9.6,0-14.4c0-0.4,0-0.4,0.4-0.4
			c1,0,2.1,0,3.1,0c0.2,0,0.3,0.1,0.3,0.3c0,7.2,0,14.3,0,21.5c0,0.2-0.1,0.3-0.2,0.3c-0.9,0-1.8,0-2.7,0c-0.2,0-0.3-0.1-0.4-0.2
			c-1.2-1.5-2.3-3-3.5-4.5c-0.7-0.9-1.4-1.8-2.1-2.7c-0.9-1.2-1.8-2.3-2.7-3.5c-0.8-1-1.5-2-2.3-3c-0.4-0.5-0.8-1.1-1.3-1.6
			C233.2,103.9,233.2,103.9,233.1,103.8z"/>
		<path class="st1" d="M127.7,108.5c0-3.5,0-7.1,0-10.6c0-0.3,0-0.3,0.3-0.3c5.2,0,10.4,0,15.6,0c0.3,0,0.3,0,0.3,0.3
			c0,0.9,0,1.8,0,2.7c0,0.4,0,0.4-0.4,0.4c-3.9,0-7.8,0-11.7,0c-0.5,0-0.4,0-0.4,0.4c0,1.7,0,3.4,0,5c0,0.3,0,0.3,0.3,0.3
			c3.5,0,6.9,0,10.4,0c0.3,0,0.3,0,0.3,0.3c0,0.9,0,1.9,0,2.8c0,0.2-0.1,0.3-0.3,0.3c-3.5,0-7,0-10.4,0c-0.4,0-0.4,0-0.4,0.4
			c0,1.8,0,3.5,0,5.3c0,0.4,0,0.4,0.4,0.4c4,0,8,0,12,0c0.3,0,0.3,0,0.3,0.3c0,0.9,0,1.8,0,2.8c0,0.2-0.1,0.3-0.3,0.3
			c-5.3,0-10.6,0-15.9,0c-0.3,0-0.3,0-0.3-0.3C127.7,115.6,127.7,112,127.7,108.5z"/>
		<path class="st1" d="M202.9,108.5c0-3.5,0-7.1,0-10.6c0-0.3,0-0.3,0.4-0.3c5.2,0,10.4,0,15.6,0c0.3,0,0.3,0,0.3,0.3
			c0,0.9,0,1.8,0,2.7c0,0.3,0,0.3-0.3,0.3c-3.9,0-7.8,0-11.7,0c-0.1,0-0.1,0-0.2,0c-0.3,0-0.3,0-0.3,0.3c0,1.3,0,2.6,0,4
			c0,0.4,0,0.8,0,1.2c0,0.3,0,0.3,0.3,0.3c3.1,0,6.3,0,9.4,0c0.4,0,0.8,0,1.1,0c0.2,0,0.3,0.1,0.3,0.3c0,0.9,0,1.9,0,2.8
			c0,0.2-0.1,0.3-0.3,0.3c-3.4,0-6.9,0-10.3,0c-0.5,0-0.4-0.1-0.4,0.5c0,1.7,0,3.4,0,5.2c0,0.4,0,0.4,0.4,0.4c4,0,7.9,0,11.9,0
			c0.4,0,0.4,0,0.4,0.4c0,0.9,0,1.8,0,2.7c0,0.2-0.1,0.3-0.3,0.3c-5.3,0-10.6,0-15.9,0c-0.3,0-0.3-0.1-0.3-0.3
			C202.9,115.6,202.9,112,202.9,108.5z"/>
		<path class="st1" d="M190.6,102.7c-0.5-0.3-1-0.6-1.5-0.9c-1.1-0.6-2.3-1.1-3.6-1.2c-0.8-0.1-1.6-0.1-2.4,0.1
			c-0.9,0.3-1.6,0.7-1.9,1.6c-0.5,1.2-0.1,2.5,1.2,3.2c1.1,0.6,2.3,0.9,3.5,1.2c1.1,0.3,2.3,0.6,3.4,1c1.1,0.4,2.1,1,2.9,1.9
			c0.6,0.7,1,1.6,1.1,2.5c0.1,0.4,0.1,0.9,0.1,1.3c-0.1,1.4-0.5,2.7-1.4,3.8c-0.8,0.9-1.7,1.5-2.8,1.9c-0.9,0.3-1.8,0.5-2.7,0.6
			c-1.4,0.1-2.7,0-4.1-0.3c-1.7-0.4-3.2-1.1-4.6-2c-0.5-0.3-0.9-0.7-1.4-1.1c0.8-0.9,1.5-1.8,2.3-2.7c0.4,0.3,0.7,0.5,1,0.8
			c1.4,1,2.9,1.7,4.6,1.9c1.1,0.1,2.2,0.2,3.2-0.2c1-0.3,1.8-0.9,2-2c0.2-0.7,0.1-1.4-0.3-2c-0.3-0.5-0.8-0.8-1.4-1
			c-1.4-0.6-2.8-0.9-4.3-1.3c-1.4-0.4-2.8-0.8-4.1-1.7c-1.2-0.8-2-2-2.2-3.5c-0.2-1.1-0.1-2.1,0.2-3.1c0.3-0.8,0.7-1.5,1.3-2.2
			c1.2-1.3,2.7-1.9,4.4-2.2c0.6-0.1,1.3-0.2,1.9-0.1c2,0.1,3.9,0.5,5.7,1.5c0.6,0.3,1.1,0.7,1.7,1.1c0.1,0.1,0.2,0.2,0.1,0.4
			c-0.6,0.8-1.1,1.6-1.7,2.4C190.7,102.6,190.7,102.7,190.6,102.7z"/>
		<path class="st1" d="M98.2,97.5c0.1,0,0.2,0,0.3,0c1.2,0,2.4,0,3.7,0c0.2,0,0.3,0.1,0.4,0.3c0.4,1.2,0.9,2.3,1.4,3.5
			c0.8,2.1,1.6,4.1,2.4,6.2c0.6,1.5,1.2,3,1.8,4.5c0.3,0.8,0.6,1.5,0.9,2.3c0,0.1,0.1,0.1,0.2,0.2c0-0.1,0.1-0.1,0.1-0.2
			c0.6-1.6,1.2-3.1,1.8-4.7c0.8-2,1.6-4,2.3-6c0.6-1.5,1.2-3.1,1.8-4.6c0.1-0.4,0.3-0.8,0.4-1.1c0.1-0.1,0.1-0.2,0.3-0.2
			c1.2,0,2.5,0,3.7,0c0.1,0,0.1,0,0.2,0c-0.1,0.2-0.2,0.5-0.3,0.7c-0.7,1.8-1.5,3.6-2.2,5.4c-1,2.3-1.9,4.7-2.9,7
			c-0.7,1.8-1.5,3.6-2.2,5.4c-0.5,1.1-0.9,2.3-1.4,3.4c-0.1,0.2-0.2,0.2-0.4,0.2c-1,0-1.9,0-2.9,0c-0.2,0-0.3-0.1-0.4-0.3
			c-0.8-1.9-1.6-3.8-2.4-5.7c-0.8-1.8-1.5-3.7-2.3-5.5c-0.9-2.3-1.9-4.6-2.8-6.8C99.3,100.1,98.8,98.8,98.2,97.5z"/>
		<path class="st1" d="M155.2,108.5c0-3.5,0-7.1,0-10.6c0-0.3,0-0.3,0.3-0.3c1.1,0,2.1,0,3.2,0c0.3,0,0.3,0,0.3,0.3
			c0,5.9,0,11.9,0,17.8c0,0.4,0,0.4,0.4,0.4c3.2,0,6.4,0,9.7,0c0.4,0,0.4,0,0.4,0.4c0,0.9,0,1.9,0,2.8c0,0.2-0.1,0.3-0.3,0.3
			c-4.6,0-9.1,0-13.7,0c-0.2,0-0.3-0.1-0.3-0.3C155.2,115.6,155.2,112,155.2,108.5z"/>
	</g>
</g>
</svg>
