{
  "openapi": "3.0.3",
  "servers": [
    {
      "url": "https://{zaaksysteem_hostname}:443",
      "variables": {
        "zaaksysteem_hostname": {
          "default": "development.zaaksysteem.nl",
          "description": "Hostname of the Zaaksysteem instance"
        }
      }
    }
  ],
  "info": {
    "title": "Document API",
    "description": "Commands and queries to manage documents in Zaaksysteem.",
    "version": "v2",
    "contact": {
      "name": "Zaaksysteem Development Team"
    },
    "x-package-name": "zsnl_document_http",
    "x-url-base": [
      "/api/v2/document/"
    ]
  },
  "tags": [
    {
      "name": "Document",
      "description": "API endpoints relating to document objects. Documents are files with extra metadata, that can be related to a case."
    },
    {
      "name": "File",
      "description": "API endpoints relating to file objects."
    }
  ],
  "paths": {
    "/api/v2/document/get_document": {
      "get": {
        "x-view": "views",
        "tags": [
          "Document"
        ],
        "operationId": "get_document",
        "summary": "Retrieve a document based on the document's uuid",
        "description": "Retrieve a document based on the document's uuid",
        "parameters": [
          {
            "name": "document_uuid",
            "in": "query",
            "description": "Document to retrieve data of.",
            "required": true,
            "schema": {
              "type": "string",
              "format": "uuid"
            }
          },
          {
            "name": "integrity",
            "in": "query",
            "description": "Parameter to verify the integrity of document.",
            "required": false,
            "schema": {
              "type": "string",
              "enum": [
                "0",
                "1"
              ]
            }
          }
        ],
        "responses": {
          "200": {
            "description": "Document entity",
            "content": {
              "application/json": {
                "schema": {
                  "$ref": "#/components/schemas/DocumentEntity"
                }
              }
            }
          },
          "404": {
            "description": "A referenced object could not be found",
            "content": {
              "application/json": {
                "schema": {
                  "$ref": "#/components/schemas/Error"
                }
              }
            }
          }
        }
      }
    },
    "/api/v2/document/create_document": {
      "post": {
        "x-view": "views",
        "tags": [
          "Document"
        ],
        "operationId": "create_document",
        "summary": "Create a document using an uploaded file.",
        "description": "Create a document using an uploaded file.",
        "requestBody": {
          "required": true,
          "content": {
            "multipart/form-data": {
              "schema": {
                "type": "object",
                "properties": {
                  "document_file": {
                    "type": "string",
                    "format": "binary"
                  },
                  "case_uuid": {
                    "type": "string",
                    "format": "uuid"
                  },
                  "document_uuid": {
                    "type": "string",
                    "format": "uuid"
                  },
                  "directory_uuid": {
                    "type": "string",
                    "format": "uuid"
                  },
                  "magic_string": {
                    "type": "array",
                    "uniqueItems": true,
                    "items": {
                      "type": "string"
                    }
                  },
                  "replaces": {
                    "type": "string",
                    "format": "uuid"
                  }
                },
                "required": [
                  "document_file",
                  "case_uuid"
                ]
              }
            }
          }
        },
        "responses": {
          "200": {
            "description": "Document created",
            "content": {
              "application/json": {
                "schema": {
                  "$ref": "#/components/schemas/Success"
                }
              }
            }
          },
          "400": {
            "description": "Bad request",
            "content": {
              "application/json": {
                "schema": {
                  "$ref": "#/components/schemas/Error"
                }
              }
            }
          },
          "403": {
            "description": "Permission denied",
            "content": {
              "application/json": {
                "schema": {
                  "$ref": "#/components/schemas/Error"
                }
              }
            }
          },
          "404": {
            "description": "A referenced object could not be found",
            "content": {
              "application/json": {
                "schema": {
                  "$ref": "#/components/schemas/Error"
                }
              }
            }
          },
          "409": {
            "description": "The current state does not match command expectations",
            "content": {
              "application/json": {
                "schema": {
                  "$ref": "#/components/schemas/Error"
                }
              }
            }
          }
        }
      }
    },
    "/api/v2/file/create_file": {
      "post": {
        "x-view": "views",
        "tags": [
          "File"
        ],
        "operationId": "create_file",
        "summary": "Create a file record using an uploaded file.",
        "description": "Create a file record using an uploaded file.",
        "requestBody": {
          "required": true,
          "content": {
            "multipart/form-data": {
              "schema": {
                "type": "object",
                "properties": {
                  "file": {
                    "type": "string",
                    "format": "binary"
                  },
                  "file_uuid": {
                    "type": "string",
                    "format": "uuid"
                  }
                },
                "required": [
                  "file"
                ]
              }
            }
          }
        },
        "responses": {
          "200": {
            "description": "File created",
            "content": {
              "application/json": {
                "schema": {
                  "$ref": "#/components/schemas/FileSuccess"
                }
              }
            }
          },
          "400": {
            "description": "Bad request",
            "content": {
              "application/json": {
                "schema": {
                  "$ref": "#/components/schemas/Error"
                }
              }
            }
          },
          "403": {
            "description": "Permission denied",
            "content": {
              "application/json": {
                "schema": {
                  "$ref": "#/components/schemas/Error"
                }
              }
            }
          },
          "409": {
            "description": "The current state does not match command expectations",
            "content": {
              "application/json": {
                "schema": {
                  "$ref": "#/components/schemas/Error"
                }
              }
            }
          }
        }
      }
    },
    "/api/v2/document/create_document_from_attachment": {
      "post": {
        "x-view": "views",
        "tags": [
          "Document"
        ],
        "operationId": "create_document_from_attachment",
        "summary": "Create a document from an uploaded attachment in message.",
        "description": "Create a document from an uploaded attachment in message.",
        "requestBody": {
          "required": true,
          "content": {
            "application/json": {
              "schema": {
                "type": "object",
                "properties": {
                  "attachment_uuid": {
                    "type": "string",
                    "format": "uuid"
                  }
                },
                "additionalProperties": false,
                "required": [
                  "attachment_uuid"
                ]
              }
            }
          }
        },
        "responses": {
          "200": {
            "description": "Document created",
            "content": {
              "application/json": {
                "schema": {
                  "$ref": "#/components/schemas/Success"
                }
              }
            }
          },
          "400": {
            "description": "Bad request",
            "content": {
              "application/json": {
                "schema": {
                  "$ref": "#/components/schemas/Error"
                }
              }
            }
          },
          "403": {
            "description": "Permission denied",
            "content": {
              "application/json": {
                "schema": {
                  "$ref": "#/components/schemas/Error"
                }
              }
            }
          },
          "404": {
            "description": "A referenced object could not be found",
            "content": {
              "application/json": {
                "schema": {
                  "$ref": "#/components/schemas/Error"
                }
              }
            }
          },
          "409": {
            "description": "The current state does not match command expectations",
            "content": {
              "application/json": {
                "schema": {
                  "$ref": "#/components/schemas/Error"
                }
              }
            }
          }
        }
      }
    },
    "/api/v2/document/create_document_from_message": {
      "post": {
        "x-view": "views",
        "tags": [
          "Document"
        ],
        "operationId": "create_document_from_message",
        "summary": "Create a document from an message.",
        "description": "Create a document from an message.",
        "requestBody": {
          "required": true,
          "content": {
            "application/json": {
              "schema": {
                "type": "object",
                "properties": {
                  "message_uuid": {
                    "description": "The message UUID.",
                    "type": "string",
                    "format": "uuid"
                  },
                  "output_format": {
                    "description": "The output format of the document, original or pdf",
                    "type": "string",
                    "enum": [
                      "original",
                      "pdf"
                    ]
                  }
                },
                "additionalProperties": false,
                "required": [
                  "message_uuid"
                ]
              }
            }
          }
        },
        "responses": {
          "200": {
            "description": "Document created",
            "content": {
              "application/json": {
                "schema": {
                  "$ref": "#/components/schemas/Success"
                }
              }
            }
          },
          "400": {
            "description": "Bad request",
            "content": {
              "application/json": {
                "schema": {
                  "$ref": "#/components/schemas/Error"
                }
              }
            }
          },
          "403": {
            "description": "Permission denied",
            "content": {
              "application/json": {
                "schema": {
                  "$ref": "#/components/schemas/Error"
                }
              }
            }
          },
          "404": {
            "description": "A referenced object could not be found",
            "content": {
              "application/json": {
                "schema": {
                  "$ref": "#/components/schemas/Error"
                }
              }
            }
          },
          "409": {
            "description": "The current state does not match command expectations",
            "content": {
              "application/json": {
                "schema": {
                  "$ref": "#/components/schemas/Error"
                }
              }
            }
          }
        }
      }
    },
    "/api/v2/document/search_document": {
      "get": {
        "x-view": "views",
        "tags": [
          "Document"
        ],
        "operationId": "search_document",
        "summary": "Search document.",
        "description": "Search document by case_uuid or keyword or both",
        "parameters": [
          {
            "name": "case_uuid",
            "in": "query",
            "description": "case_uuid to search documents.",
            "required": false,
            "schema": {
              "type": "string",
              "format": "uuid"
            }
          },
          {
            "name": "keyword",
            "in": "query",
            "description": "keyword to search documents.",
            "required": false,
            "schema": {
              "type": "string"
            }
          }
        ],
        "responses": {
          "200": {
            "description": "List of document entities as the search result.",
            "content": {
              "application/json": {
                "schema": {
                  "$ref": "#/components/schemas/DocumentEntityMultiple"
                }
              }
            }
          },
          "404": {
            "description": "A referenced object could not be found",
            "content": {
              "application/json": {
                "schema": {
                  "$ref": "#/components/schemas/Error"
                }
              }
            }
          }
        }
      }
    },
    "/api/v2/document/get_directory_entries_for_case": {
      "get": {
        "x-view": "views",
        "tags": [
          "Document"
        ],
        "operationId": "get_directory_entries_for_case",
        "summary": "Get the list documents and directories for a specific case.",
        "description": "Get the list documents and directories for a specific case. Also has an option to filter the results based on parent_directory",
        "parameters": [
          {
            "name": "case_uuid",
            "in": "query",
            "description": "UUID of the case.",
            "required": true,
            "schema": {
              "type": "string",
              "format": "uuid"
            }
          },
          {
            "name": "filter",
            "in": "query",
            "description": "Filter the results based on parent_directory.",
            "required": false,
            "schema": {
              "type": "object",
              "properties": {
                "relationships.parent.id": {
                  "oneOf": [
                    {
                      "type": "string",
                      "format": "uuid",
                      "nullable": true
                    },
                    {
                      "type": "string",
                      "example": "%00"
                    }
                  ]
                },
                "fulltext": {
                  "type": "string"
                }
              }
            }
          },
          {
            "name": "no_empty_folders",
            "in": "query",
            "description": "Parameter used to filter out empty folders.",
            "required": false,
            "schema": {
              "type": "string",
              "enum": [
                "0",
                "1"
              ]
            }
          }
        ],
        "responses": {
          "200": {
            "description": "List of documents and directories for a case.",
            "content": {
              "application/json": {
                "schema": {
                  "$ref": "#/components/schemas/DirectoryEntryEntityMultiple"
                }
              }
            }
          },
          "404": {
            "description": "A referenced object could not be found",
            "content": {
              "application/json": {
                "schema": {
                  "$ref": "#/components/schemas/Error"
                }
              }
            }
          }
        }
      }
    },
    "/api/v2/document/create_document_from_file": {
      "post": {
        "x-view": "views",
        "tags": [
          "Document"
        ],
        "operationId": "create_document_from_file",
        "summary": "Create a document from a file.",
        "description": "Create a document from a file.",
        "requestBody": {
          "required": true,
          "content": {
            "application/json": {
              "schema": {
                "type": "object",
                "properties": {
                  "file_uuid": {
                    "description": "UUID of the filestore to which the document is linked.",
                    "type": "string",
                    "format": "uuid"
                  },
                  "case_uuid": {
                    "description": "UUID of the case to which the document is linked.",
                    "type": "string",
                    "format": "uuid"
                  },
                  "skip_intake": {
                    "description": "Indicates whether the generated document should show up on the intake",
                    "type": "boolean"
                  },
                  "document_uuid": {
                    "description": "UUID of the document to be created",
                    "type": "string",
                    "format": "uuid"
                  },
                  "directory_uuid": {
                    "description": "UUID of the directory in which the document is created.",
                    "type": "string",
                    "format": "uuid"
                  },
                  "magic_string": {
                    "description": "Magic strings associated with document.",
                    "type": "array",
                    "items": {
                      "type": "string"
                    }
                  }
                },
                "additionalProperties": false,
                "required": [
                  "file_uuid"
                ]
              }
            }
          }
        },
        "responses": {
          "200": {
            "description": "Document created",
            "content": {
              "application/json": {
                "schema": {
                  "$ref": "#/components/schemas/Success"
                }
              }
            }
          },
          "400": {
            "description": "Bad request",
            "content": {
              "application/json": {
                "schema": {
                  "$ref": "#/components/schemas/Error"
                }
              }
            }
          },
          "403": {
            "description": "Permission denied",
            "content": {
              "application/json": {
                "schema": {
                  "$ref": "#/components/schemas/Error"
                }
              }
            }
          },
          "404": {
            "description": "A referenced object could not be found",
            "content": {
              "application/json": {
                "schema": {
                  "$ref": "#/components/schemas/Error"
                }
              }
            }
          },
          "409": {
            "description": "The current state does not match command expectations",
            "content": {
              "application/json": {
                "schema": {
                  "$ref": "#/components/schemas/Error"
                }
              }
            }
          }
        }
      }
    },
    "/api/v2/document/download_document": {
      "get": {
        "x-view": "views",
        "tags": [
          "Document"
        ],
        "operationId": "download_document",
        "summary": "Generates a download link for requestor and re-directs requestor to it.",
        "description": "Generates a download link for requestor and re-directs requestor to it.",
        "parameters": [
          {
            "name": "id",
            "in": "query",
            "description": "UUID of document to download",
            "required": true,
            "schema": {
              "type": "string"
            }
          }
        ],
        "responses": {
          "302": {
            "description": "Redirect to file to download",
            "headers": {
              "Location": {
                "schema": {
                  "type": "string"
                },
                "description": "File download link."
              }
            }
          },
          "404": {
            "description": "File Not Found",
            "content": {
              "application/json": {
                "schema": {
                  "$ref": "#/components/schemas/Error"
                }
              }
            }
          },
          "400": {
            "description": "Bad request",
            "content": {
              "application/json": {
                "schema": {
                  "$ref": "#/components/schemas/Error"
                }
              }
            }
          }
        }
      }
    },
    "/api/v2/document/get_directory_entries_for_intake": {
      "get": {
        "x-view": "views",
        "tags": [
          "Document"
        ],
        "operationId": "get_directory_entries_for_intake",
        "summary": "Get the list documents as directory entires for document intake.",
        "description": "Get the list documents as directory entires for document intake.",
        "parameters": [
          {
            "name": "filter[fulltext]",
            "in": "query",
            "description": "Filter the results based on full text search.",
            "required": false,
            "schema": {
              "type": "string"
            }
          },
          {
            "name": "filter[attributes.assignment.is_set]",
            "in": "query",
            "description": "Filter the results based assignment. Returns all assingd document if 'true', all unasinged documents if 'false'. If not present all documents are returned",
            "required": false,
            "schema": {
              "type": "boolean"
            }
          },
          {
            "name": "filter[attributes.assignment.is_self]",
            "in": "query",
            "description": "Filter the results based assignment. Returns all assinged documents to the user if 'true'",
            "required": false,
            "schema": {
              "type": "boolean"
            }
          },
          {
            "name": "sort",
            "in": "query",
            "description": "Sort by the specified field. Sorts in descending order if the field name starts with `-`",
            "required": false,
            "schema": {
              "type": "string",
              "enum": [
                "attributes.name",
                "attributes.extension",
                "attributes.description",
                "attributes.last_modified_date_time",
                "-attributes.name",
                "-attributes.extension",
                "-attributes.description",
                "-attributes.last_modified_date_time"
              ]
            }
          },
          {
            "name": "page",
            "in": "query",
            "description": "Page number of results to retrieve",
            "required": false,
            "schema": {
              "type": "integer",
              "minimum": 1
            }
          },
          {
            "name": "page_size",
            "in": "query",
            "description": "Page size of results to retrieve",
            "required": false,
            "schema": {
              "type": "integer",
              "minimum": 1,
              "maximum": 100
            }
          }
        ],
        "responses": {
          "200": {
            "description": "List of documents as directory entries for intake.",
            "content": {
              "application/json": {
                "schema": {
                  "$ref": "#/components/schemas/DirectoryEntryEntityMultiple"
                }
              }
            }
          },
          "404": {
            "description": "A referenced object could not be found",
            "content": {
              "application/json": {
                "schema": {
                  "$ref": "#/components/schemas/Error"
                }
              }
            }
          }
        }
      }
    },
    "/api/v2/document/preview_document": {
      "get": {
        "x-view": "views",
        "tags": [
          "Document"
        ],
        "operationId": "preview_document",
        "summary": "Generates a preview link for requestor and re-directs requestor to it.",
        "description": "Generates a preview link for requestor and re-directs requestor to it.",
        "parameters": [
          {
            "name": "id",
            "in": "query",
            "description": "UUID of document to see preview",
            "required": true,
            "schema": {
              "type": "string"
            }
          }
        ],
        "responses": {
          "302": {
            "description": "Redirect to preview of the file",
            "headers": {
              "Location": {
                "schema": {
                  "type": "string"
                },
                "description": "File preview link."
              }
            }
          },
          "404": {
            "description": "File Not Found",
            "content": {
              "application/json": {
                "schema": {
                  "$ref": "#/components/schemas/Error"
                }
              }
            }
          },
          "400": {
            "description": "Bad request",
            "content": {
              "application/json": {
                "schema": {
                  "$ref": "#/components/schemas/Error"
                }
              }
            }
          }
        }
      }
    },
    "/api/v2/document/get_document_labels": {
      "get": {
        "x-view": "document_label",
        "x-view-class": "DocumentLabelViews",
        "tags": [
          "Document"
        ],
        "operationId": "get_document_labels",
        "summary": "Get document labels for a case by case_uuid",
        "description": "Get document labels for a case by case_uuid",
        "parameters": [
          {
            "name": "case_uuid",
            "in": "query",
            "description": "UUID of the case.",
            "required": true,
            "schema": {
              "type": "string"
            }
          }
        ],
        "responses": {
          "200": {
            "description": "DocumentLabel Entity",
            "content": {
              "application/json": {
                "schema": {
                  "$ref": "#/components/schemas/DocumentLabelEntityMultiple"
                }
              }
            }
          },
          "404": {
            "description": "Not Found",
            "content": {
              "application/json": {
                "schema": {
                  "$ref": "#/components/schemas/Error"
                }
              }
            }
          }
        }
      }
    },
    "/api/v2/document/add_document_to_case": {
      "post": {
        "x-view": "document",
        "x-view-class": "DocumentViews",
        "tags": [
          "Document"
        ],
        "operationId": "add_document_to_case",
        "summary": "Add document to a case.",
        "description": "Add document to a case.",
        "requestBody": {
          "required": true,
          "content": {
            "application/json": {
              "schema": {
                "type": "object",
                "properties": {
                  "document_uuid": {
                    "title": "Internal identifier of the document",
                    "type": "string",
                    "format": "uuid"
                  },
                  "case_uuid": {
                    "title": "Internal identifier the case to which the document is attached.",
                    "type": "string",
                    "format": "uuid"
                  },
                  "document_label_uuids": {
                    "title": "List of internal identifiers of document_labels/magic_strings used to label the document.",
                    "default": [],
                    "type": "array",
                    "items": {
                      "type": "string",
                      "format": "uuid"
                    }
                  }
                },
                "required": [
                  "case_uuid",
                  "document_uuid"
                ],
                "additionalProperties": false
              }
            }
          }
        },
        "responses": {
          "200": {
            "description": "Successful response",
            "content": {
              "application/json": {
                "schema": {
                  "$ref": "#/components/schemas/JSONAPICommandSuccess"
                }
              }
            }
          },
          "404": {
            "description": "Not Found",
            "content": {
              "application/json": {
                "schema": {
                  "$ref": "#/components/schemas/ResponseError"
                }
              }
            }
          }
        }
      }
    },
    "/api/v2/document/update_document": {
      "post": {
        "x-view": "document",
        "x-view-class": "DocumentViews",
        "tags": [
          "Document"
        ],
        "operationId": "update_document",
        "summary": "Update document by uuid",
        "description": "Update document by uuid",
        "requestBody": {
          "required": true,
          "content": {
            "application/json": {
              "schema": {
                "type": "object",
                "properties": {
                  "document_uuid": {
                    "title": "Internal identifier of the document",
                    "type": "string",
                    "format": "uuid"
                  },
                  "basename": {
                    "title": "New basename for the document",
                    "type": "string",
                    "nullable": true
                  },
                  "description": {
                    "title": "New description for the document.",
                    "type": "string",
                    "nullable": true
                  },
                  "document_category": {
                    "allOf": [
                      {
                        "title": "New category for the document",
                        "nullable": true
                      },
                      {
                        "$ref": "entities.json#/components/schemas/DocumentCategory"
                      }
                    ]
                  },
                  "origin": {
                    "title": "New origin/direction for the document",
                    "type": "string",
                    "enum": [
                      "Uitgaand",
                      "Intern",
                      "Inkomend"
                    ],
                    "nullable": true
                  },
                  "origin_date": {
                    "title": "New origin date for the document.",
                    "type": "string",
                    "format": "date",
                    "nullable": true
                  },
                  "confidentiality": {
                    "allOf": [
                      {
                        "title": "New confidentiality for the document",
                        "nullable": true
                      },
                      {
                        "$ref": "entities.json#/components/schemas/DocumentConfidentiality"
                      }
                    ]
                  }
                },
                "required": [
                  "document_uuid"
                ],
                "additionalProperties": false
              }
            }
          }
        },
        "responses": {
          "200": {
            "description": "Successful response",
            "content": {
              "application/json": {
                "schema": {
                  "$ref": "#/components/schemas/JSONAPICommandSuccess"
                }
              }
            }
          },
          "404": {
            "description": "Not Found",
            "content": {
              "application/json": {
                "schema": {
                  "$ref": "#/components/schemas/ResponseError"
                }
              }
            }
          }
        }
      }
    },
    "/api/v2/document/delete_document": {
      "post": {
        "x-view": "views",
        "tags": [
          "Document"
        ],
        "operationId": "delete_document",
        "summary": "Delete a document",
        "description": "Delete a document",
        "requestBody": {
          "required": true,
          "content": {
            "application/json": {
              "schema": {
                "type": "object",
                "properties": {
                  "document_uuid": {
                    "title": "Internal identifier of the document",
                    "type": "string",
                    "format": "uuid"
                  },
                  "reason": {
                    "title": "Optional human readable reason for deletion",
                    "type": "string"
                  }
                },
                "required": [
                  "document_uuid"
                ],
                "additionalProperties": false
              }
            }
          }
        },
        "responses": {
          "200": {
            "description": "Successful response",
            "content": {
              "application/json": {
                "schema": {
                  "$ref": "#/components/schemas/Success"
                }
              }
            }
          },
          "400": {
            "description": "Bad Request",
            "content": {
              "application/json": {
                "schema": {
                  "$ref": "#/components/schemas/Error"
                }
              }
            }
          },
          "403": {
            "description": "Permission Denied",
            "content": {
              "application/json": {
                "schema": {
                  "$ref": "#/components/schemas/Error"
                }
              }
            }
          },
          "404": {
            "description": "Not Found",
            "content": {
              "application/json": {
                "schema": {
                  "$ref": "#/components/schemas/ResponseError"
                }
              }
            }
          }
        }
      }
    },
    "/api/v2/document/reject_assigned_document": {
      "post": {
        "x-view": "document",
        "x-view-class": "DocumentViews",
        "tags": [
          "Document"
        ],
        "operationId": "reject_assigned_document",
        "summary": "Reject an assigned document and move it back to the general document intake",
        "description": "Reject an assigned document and move it back to the general document intake",
        "requestBody": {
          "required": true,
          "content": {
            "application/json": {
              "schema": {
                "type": "object",
                "properties": {
                  "document_uuid": {
                    "title": "Internal identifier of the document",
                    "type": "string",
                    "format": "uuid"
                  },
                  "rejection_reason": {
                    "title": "User-specified reason for rejecting the document",
                    "type": "string"
                  }
                },
                "required": [
                  "document_uuid",
                  "rejection_reason"
                ],
                "additionalProperties": false
              }
            }
          }
        },
        "responses": {
          "200": {
            "description": "Successful response",
            "content": {
              "application/json": {
                "schema": {
                  "$ref": "#/components/schemas/JSONAPICommandSuccess"
                }
              }
            }
          },
          "404": {
            "description": "Not Found",
            "content": {
              "application/json": {
                "schema": {
                  "$ref": "#/components/schemas/ResponseError"
                }
              }
            }
          }
        }
      }
    },
    "/api/v2/document/assign_document_to_user": {
      "post": {
        "x-view": "document",
        "x-view-class": "DocumentViews",
        "tags": [
          "Document"
        ],
        "operationId": "assign_document_to_user",
        "summary": "Assign document to a user",
        "description": "Assign document to a user",
        "requestBody": {
          "required": true,
          "content": {
            "application/json": {
              "schema": {
                "type": "object",
                "properties": {
                  "document_uuid": {
                    "title": "Internal identifier of the document",
                    "type": "string",
                    "format": "uuid"
                  },
                  "user_uuid": {
                    "title": "Internal identifier of the user",
                    "type": "string",
                    "format": "uuid"
                  }
                },
                "required": [
                  "document_uuid",
                  "user_uuid"
                ],
                "additionalProperties": false
              }
            }
          }
        },
        "responses": {
          "200": {
            "description": "Successful response",
            "content": {
              "application/json": {
                "schema": {
                  "$ref": "#/components/schemas/JSONAPICommandSuccess"
                }
              }
            }
          },
          "404": {
            "description": "Not Found",
            "content": {
              "application/json": {
                "schema": {
                  "$ref": "#/components/schemas/ResponseError"
                }
              }
            }
          }
        }
      }
    },
    "/api/v2/document/assign_document_to_role": {
      "post": {
        "x-view": "document",
        "x-view-class": "DocumentViews",
        "tags": [
          "Document"
        ],
        "operationId": "assign_document_to_role",
        "summary": "Assign document to group and role.",
        "description": "Assign document to group and role.",
        "requestBody": {
          "required": true,
          "content": {
            "application/json": {
              "schema": {
                "type": "object",
                "properties": {
                  "document_uuid": {
                    "title": "Internal identifier of the document",
                    "type": "string",
                    "format": "uuid"
                  },
                  "group_uuid": {
                    "title": "Internal identifier of the group",
                    "type": "string",
                    "format": "uuid"
                  },
                  "role_uuid": {
                    "title": "Internal identifier of the role",
                    "type": "string",
                    "format": "uuid"
                  }
                },
                "required": [
                  "document_uuid",
                  "group_uuid",
                  "role_uuid"
                ],
                "additionalProperties": false
              }
            }
          }
        },
        "responses": {
          "200": {
            "description": "Successful response",
            "content": {
              "application/json": {
                "schema": {
                  "$ref": "#/components/schemas/JSONAPICommandSuccess"
                }
              }
            }
          },
          "404": {
            "description": "Not Found",
            "content": {
              "application/json": {
                "schema": {
                  "$ref": "#/components/schemas/ResponseError"
                }
              }
            }
          }
        }
      }
    },
    "/api/v2/document/edit_document_online": {
      "get": {
        "x-view": "views",
        "tags": [
          "Document"
        ],
        "operationId": "edit_document_online",
        "summary": "Edit document online",
        "description": "Edit document online with one of the online editors",
        "parameters": [
          {
            "name": "id",
            "in": "query",
            "description": "UUID of document to edit",
            "required": true,
            "schema": {
              "type": "string"
            }
          },
          {
            "name": "editor_type",
            "in": "query",
            "description": "Type of editor",
            "required": false,
            "schema": {
              "type": "string",
              "default": "zoho",
              "enum": [
                "zoho",
                "msonline"
              ]
            }
          },
          {
            "name": "close_url",
            "in": "query",
            "description": "A URI to a web page that the WOPI client should navigate to when the application closes. Applicable only when editor_type is msonline.",
            "required": false,
            "schema": {
              "type": "string"
            }
          },
          {
            "name": "host_edit_url",
            "in": "query",
            "description": "A URI of Front-end host page where the wopi action loads",
            "required": false,
            "schema": {
              "type": "string"
            }
          }
        ],
        "responses": {
          "302": {
            "description": "Redirect to file to editing with zoho",
            "headers": {
              "Location": {
                "schema": {
                  "type": "string"
                },
                "description": "File edit link."
              }
            }
          },
          "200": {
            "description": "JSON containing Microsoft WOPI configuration",
            "content": {
              "application/json": {
                "schema": {
                  "$ref": "#/components/schemas/WopiJSON"
                }
              }
            }
          },
          "404": {
            "description": "File Not Found",
            "content": {
              "application/json": {
                "schema": {
                  "$ref": "#/components/schemas/Error"
                }
              }
            }
          },
          "400": {
            "description": "Bad request",
            "content": {
              "application/json": {
                "schema": {
                  "$ref": "#/components/schemas/Error"
                }
              }
            }
          }
        }
      }
    },
    "/api/v2/document/update_document_from_external_editor": {
      "post": {
        "x-view": "views",
        "tags": [
          "Document"
        ],
        "operationId": "update_document_from_external_editor",
        "summary": "Update document.",
        "description": "Update document.",
        "requestBody": {
          "required": true,
          "content": {
            "multipart/form-data": {
              "schema": {
                "type": "object",
                "properties": {
                  "document_uuid": {
                    "type": "string",
                    "format": "string"
                  },
                  "content": {
                    "type": "string",
                    "format": "binary"
                  },
                  "zoho_authentication_token": {
                    "type": "string",
                    "format": "bytes"
                  }
                },
                "required": [
                  "document_uuid",
                  "content",
                  "zoho_authentication_token"
                ]
              }
            }
          }
        },
        "responses": {
          "200": {
            "description": "Document created",
            "content": {
              "application/json": {
                "schema": {
                  "$ref": "#/components/schemas/Success"
                }
              }
            }
          },
          "400": {
            "description": "Bad request",
            "content": {
              "application/json": {
                "schema": {
                  "$ref": "#/components/schemas/Error"
                }
              }
            }
          },
          "403": {
            "description": "Permission denied",
            "content": {
              "application/json": {
                "schema": {
                  "$ref": "#/components/schemas/Error"
                }
              }
            }
          },
          "404": {
            "description": "A referenced object could not be found",
            "content": {
              "application/json": {
                "schema": {
                  "$ref": "#/components/schemas/Error"
                }
              }
            }
          },
          "409": {
            "description": "The current state does not match command expectations",
            "content": {
              "application/json": {
                "schema": {
                  "$ref": "#/components/schemas/Error"
                }
              }
            }
          }
        }
      }
    },
    "/api/v2/document/create_directory": {
      "post": {
        "x-view": "views",
        "tags": [
          "Document"
        ],
        "operationId": "create_directory",
        "summary": "Create a directory in the root or as a subdirectory.",
        "description": "Create a directory in the root or as a subdirectory.",
        "requestBody": {
          "required": true,
          "content": {
            "application/json": {
              "schema": {
                "type": "object",
                "properties": {
                  "case_uuid": {
                    "title": "The Case UUID",
                    "type": "string",
                    "format": "uuid"
                  },
                  "name": {
                    "title": "The name of the new directory.",
                    "type": "string"
                  },
                  "parent_uuid": {
                    "title": "Optional UUID of the parent directory.",
                    "type": "string",
                    "format": "uuid"
                  },
                  "directory_uuid": {
                    "title": "Optional UUID of the directory to be created.",
                    "type": "string",
                    "format": "uuid"
                  }
                },
                "required": [
                  "case_uuid",
                  "name"
                ]
              }
            }
          }
        },
        "responses": {
          "200": {
            "description": "Directory created",
            "content": {
              "application/json": {
                "schema": {
                  "$ref": "#/components/schemas/DirectorySuccess"
                }
              }
            }
          },
          "400": {
            "description": "Bad request",
            "content": {
              "application/json": {
                "schema": {
                  "$ref": "#/components/schemas/Error"
                }
              }
            }
          },
          "403": {
            "description": "Permission denied",
            "content": {
              "application/json": {
                "schema": {
                  "$ref": "#/components/schemas/Error"
                }
              }
            }
          }
        }
      }
    },
    "/api/v2/document/thumbnail_document": {
      "get": {
        "x-view": "views",
        "tags": [
          "Document"
        ],
        "operationId": "thumbnail_document",
        "summary": "Generates a thumbnail link for requestor and re-directs requestor to it.",
        "description": "Generates a thumbnail link for requestor and re-directs requestor to it.",
        "parameters": [
          {
            "name": "id",
            "in": "query",
            "description": "UUID of document to see thumbnail",
            "required": true,
            "schema": {
              "type": "string"
            }
          }
        ],
        "responses": {
          "302": {
            "description": "Redirect to thumbnail of the file",
            "headers": {
              "Location": {
                "schema": {
                  "type": "string"
                },
                "description": "File thumnail link."
              }
            }
          },
          "404": {
            "description": "File Not Found",
            "content": {
              "application/json": {
                "schema": {
                  "$ref": "#/components/schemas/Error"
                }
              }
            }
          },
          "400": {
            "description": "Bad request",
            "content": {
              "application/json": {
                "schema": {
                  "$ref": "#/components/schemas/Error"
                }
              }
            }
          }
        }
      }
    },
    "/api/v2/document/apply_labels": {
      "post": {
        "x-view": "document",
        "x-view-class": "DocumentViews",
        "tags": [
          "Document"
        ],
        "operationId": "apply_labels_to_document",
        "summary": "Apply labels to document.",
        "description": "Apply labels to document.",
        "requestBody": {
          "required": true,
          "content": {
            "application/json": {
              "schema": {
                "type": "object",
                "properties": {
                  "document_uuids": {
                    "description": "UUID's of documents you want to apply labels.",
                    "type": "array",
                    "uniqueItems": true,
                    "items": {
                      "type": "string",
                      "format": "uuid"
                    }
                  },
                  "document_label_uuids": {
                    "description": "UUID's of document_labels(uuid of zaaktype_kenmerk).",
                    "type": "array",
                    "uniqueItems": true,
                    "items": {
                      "type": "string",
                      "format": "uuid"
                    }
                  }
                },
                "additionalProperties": false,
                "required": [
                  "document_uuids",
                  "document_label_uuids"
                ]
              }
            }
          }
        },
        "responses": {
          "200": {
            "description": "Successful response",
            "content": {
              "application/json": {
                "schema": {
                  "$ref": "#/components/schemas/JSONAPICommandSuccess"
                }
              }
            }
          },
          "404": {
            "description": "Not Found",
            "content": {
              "application/json": {
                "schema": {
                  "$ref": "#/components/schemas/ResponseError"
                }
              }
            }
          }
        }
      }
    },
    "/api/v2/document/remove_labels": {
      "post": {
        "x-view": "document",
        "x-view-class": "DocumentViews",
        "tags": [
          "Document"
        ],
        "operationId": "remove_labels_from_document",
        "summary": "Remove labels from document.",
        "description": "Remove labels from document.",
        "requestBody": {
          "required": true,
          "content": {
            "application/json": {
              "schema": {
                "type": "object",
                "properties": {
                  "document_uuids": {
                    "description": "UUID's of documents you want to remove labels.",
                    "type": "array",
                    "items": {
                      "type": "string",
                      "format": "uuid"
                    }
                  },
                  "document_label_uuids": {
                    "description": "UUID's of document_labels(uuid of zaaktype_kenmerk).",
                    "type": "array",
                    "items": {
                      "type": "string",
                      "format": "uuid"
                    }
                  }
                },
                "required": [
                  "document_uuids",
                  "document_label_uuids"
                ],
                "additionalProperties": false
              }
            }
          }
        },
        "responses": {
          "200": {
            "description": "Successful response",
            "content": {
              "application/json": {
                "schema": {
                  "$ref": "#/components/schemas/JSONAPICommandSuccess"
                }
              }
            }
          },
          "404": {
            "description": "Not Found",
            "content": {
              "application/json": {
                "schema": {
                  "$ref": "#/components/schemas/ResponseError"
                }
              }
            }
          }
        }
      }
    },
    "/api/v2/document/move_to_directory": {
      "post": {
        "x-view": "document",
        "x-view-class": "DocumentViews",
        "tags": [
          "Document"
        ],
        "operationId": "move_to_directory",
        "summary": "Move documents and directories to another directory",
        "description": "Move documents and directories to another directory",
        "requestBody": {
          "required": true,
          "content": {
            "application/json": {
              "schema": {
                "type": "object",
                "properties": {
                  "source_documents": {
                    "description": "UUID's of documents to be moved.",
                    "type": "array",
                    "items": {
                      "type": "string",
                      "format": "uuid"
                    }
                  },
                  "source_directories": {
                    "description": "UUID's of directories to be moved.",
                    "type": "array",
                    "items": {
                      "type": "string",
                      "format": "uuid"
                    }
                  },
                  "destination_directory_uuid": {
                    "description": "UUID of destination directory",
                    "type": "array",
                    "items": {
                      "type": "string",
                      "format": "uuid"
                    }
                  }
                }
              }
            }
          }
        },
        "responses": {
          "200": {
            "description": "Successful response",
            "content": {
              "application/json": {
                "schema": {
                  "$ref": "#/components/schemas/JSONAPICommandSuccess"
                }
              }
            }
          },
          "404": {
            "description": "Not Found",
            "content": {
              "application/json": {
                "schema": {
                  "$ref": "#/components/schemas/ResponseError"
                }
              }
            }
          }
        }
      }
    },
    "/api/v2/document/accept_document": {
      "post": {
        "x-view": "document",
        "x-view-class": "DocumentViews",
        "tags": [
          "Document"
        ],
        "operationId": "accept_document",
        "summary": "Accept the document.",
        "description": "Accept the document.",
        "requestBody": {
          "required": true,
          "content": {
            "application/json": {
              "schema": {
                "type": "object",
                "properties": {
                  "document_uuid": {
                    "type": "string",
                    "format": "uuid"
                  }
                },
                "required": [
                  "document_uuid"
                ]
              }
            }
          }
        },
        "responses": {
          "200": {
            "description": "Document Accepted",
            "content": {
              "application/json": {
                "schema": {
                  "$ref": "#/components/schemas/Success"
                }
              }
            }
          },
          "400": {
            "description": "Bad request",
            "content": {
              "application/json": {
                "schema": {
                  "$ref": "#/components/schemas/Error"
                }
              }
            }
          },
          "403": {
            "description": "Permission denied",
            "content": {
              "application/json": {
                "schema": {
                  "$ref": "#/components/schemas/Error"
                }
              }
            }
          },
          "409": {
            "description": "The current state does not match command expectations",
            "content": {
              "application/json": {
                "schema": {
                  "$ref": "#/components/schemas/Error"
                }
              }
            }
          }
        }
      }
    }
  },
  "components": {
    "schemas": {
      "DocumentEntity": {
        "allOf": [
          {
            "$ref": "#/components/schemas/DefaultSuccess"
          }
        ],
        "type": "object",
        "properties": {
          "data": {
            "allOf": [
              {
                "$ref": "./entities.json#/components/schemas/DocumentEntity"
              }
            ]
          }
        }
      },
      "DocumentEntityMultiple": {
        "allOf": [
          {
            "$ref": "#/components/schemas/DefaultSuccessMultiple"
          }
        ],
        "type": "object",
        "properties": {
          "data": {
            "type": "array",
            "items": {
              "allOf": [
                {
                  "$ref": "./entities.json#/components/schemas/DocumentEntity"
                }
              ]
            }
          }
        },
        "required": [
          "data"
        ]
      },
      "FileSuccess": {
        "properties": {
          "data": {
            "type": "object",
            "properties": {
              "type": {
                "type": "string",
                "enum": [
                  "file"
                ]
              },
              "id": {
                "type": "string",
                "format": "uuid"
              }
            }
          }
        }
      },
      "DirectorySuccess": {
        "properties": {
          "data": {
            "type": "object",
            "properties": {
              "directory_uuid": {
                "type": "string"
              }
            }
          }
        }
      },
      "DefaultSuccess": {
        "type": "object",
        "properties": {
          "meta": {
            "type": "object",
            "properties": {
              "api_version": {
                "type": "integer",
                "example": 2
              }
            }
          }
        }
      },
      "DefaultSuccessMultiple": {
        "allOf": [
          {
            "$ref": "#/components/schemas/DefaultSuccess"
          }
        ],
        "type": "object",
        "properties": {
          "links": {
            "type": "object",
            "properties": {
              "self": {
                "type": "string",
                "example": "http://example.zs.nl/?page=2"
              },
              "prev": {
                "type": "string",
                "example": "http://example.zs.nl/?page=1"
              },
              "next": {
                "type": "string",
                "example": "http://example.zs.nl/?page=3"
              }
            }
          }
        }
      },
      "Success": {
        "properties": {
          "data": {
            "type": "object",
            "properties": {
              "success": {
                "type": "boolean"
              }
            }
          }
        }
      },
      "JSONAPICommandSuccess": {
        "properties": {
          "data": {
            "type": "object",
            "properties": {
              "type": {
                "type": "string"
              },
              "id": {
                "type": "string",
                "format": "uuid"
              },
              "links": {
                "type": "object",
                "properties": {
                  "self": {
                    "type": "string",
                    "example": "http://example.zs.nl/?uuid=39da57ba-7c8e-4638-be09-be66cdd32149"
                  }
                }
              }
            }
          }
        }
      },
      "Error": {
        "required": [
          "error"
        ],
        "properties": {
          "error": {
            "type": "string"
          }
        }
      },
      "DirectoryEntryEntityMultiple": {
        "allOf": [
          {
            "$ref": "#/components/schemas/DefaultSuccessMultiple"
          }
        ],
        "type": "object",
        "properties": {
          "data": {
            "type": "array",
            "items": {
              "allOf": [
                {
                  "$ref": "./entities.json#/components/schemas/DirectoryEntryEntity"
                }
              ]
            }
          },
          "included": {
            "type": "array",
            "items": {
              "allOf": [
                {
                  "$ref": "./entities.json#/components/schemas/DirectoryEntity"
                }
              ]
            }
          }
        }
      },
      "DocumentLabelEntityMultiple": {
        "allOf": [
          {
            "$ref": "#/components/schemas/DefaultSuccessMultiple"
          }
        ],
        "type": "object",
        "properties": {
          "data": {
            "type": "array",
            "items": {
              "allOf": [
                {
                  "$ref": "./entities.json#/components/schemas/DocumentLabelEntity"
                }
              ]
            }
          }
        }
      },
      "ResponseError": {
        "required": [
          "errors"
        ],
        "properties": {
          "errors": {
            "type": "array",
            "items": {
              "type": "object",
              "properties": {
                "title": {
                  "type": "string"
                }
              }
            }
          }
        }
      },
      "WopiJSON": {
        "required": [
          "access_token",
          "access_token_ttl",
          "wopi_action_url",
          "fav_icon_url"
        ],
        "properties": {
          "data": {
            "type": "object",
            "properties": {
              "fav_icon_url": {
                "type": "string",
                "description": "fav_icon_url of the file"
              },
              "action_url": {
                "type": "string",
                "description": "WOPI Action url of the file"
              },
              "access_token": {
                "type": "string",
                "description": "An access token that the WOPI host will use to determine whether the request is authorized."
              },
              "access_token_ttl": {
                "type": "string",
                "description": "Number of milliseconds the access token will be valid"
              }
            }
          }
        }
      }
    }
  }
}
