{
  "domains": {
    "Document": {
      "baseUrl": "/api/v2/document/openapi/",
      "paths": "openapi30.json",
      "entities": "entities.json"
    },
    "Communication": {
      "baseUrl": "/api/v2/communication/openapi/",
      "paths": "openapi30.json",
      "entities": "entities.json"
    }
  }
}
