// Jest Snapshot v1, https://goo.gl/fbAQLP

exports[`The \`Breadcrumbs\` component renders correctly 1`] = `
<WithStyles(ForwardRef(Breadcrumbs))
  classes={Object {}}
  separator={
    <Separator
      classes={
        Object {
          "item": "makeStyles-item-1",
          "last": "makeStyles-last-4",
          "link": "makeStyles-link-3",
          "separator": "makeStyles-separator-2",
        }
      }
    />
  }
>
  <a
    className="makeStyles-link-3"
    href="/"
    key="0"
    onClick={[Function]}
  >
    Home
  </a>
  <a
    className="makeStyles-link-3"
    href="/level/level"
    key="1"
    onClick={[Function]}
  >
    ...
  </a>
  <a
    className="makeStyles-link-3"
    href="/level/level/level"
    key="2"
    onClick={[Function]}
  >
    Level 3
  </a>
  <a
    aria-current="page"
    className="makeStyles-last-4"
    href="/level/level/level/level"
    key="3"
    onClick={[Function]}
  >
    Level 4
  </a>
</WithStyles(ForwardRef(Breadcrumbs))>
`;
