<svg xmlns="http://www.w3.org/2000/svg" version="1.1" xmlns:xlink="http://www.w3.org/1999/xlink" xmlns:svgjs="http://svgjs.com/svgjs" width="1000" height="1000"><rect width="1000" height="1000" rx="500" ry="500" fill="#ffffff"></rect><g transform="matrix(0.6563834330420778,0,0,0.6563834330420778,100.00001469464661,214.5950260874626)"><svg xmlns="http://www.w3.org/2000/svg" version="1.1" xmlns:xlink="http://www.w3.org/1999/xlink" xmlns:svgjs="http://svgjs.com/svgjs" width="1218.7998047" height="869.6287842"><svg version="1.1" id="Layer_1" xmlns="http://www.w3.org/2000/svg" xmlns:xlink="http://www.w3.org/1999/xlink" x="0px" y="0px" viewBox="0 0 1218.7998047 869.6287842" style="enable-background:new 0 0 1218.7998047 869.6287842;" xml:space="preserve">
<style type="text/css">
	.st0{fill:#E41B4A;}
	.st1{fill:#6CC3C5;}
</style>
<g>
	<path class="st0" d="M527.7999878,449.7999878C512.499939,468,486.8999634,463,480.7999878,438.5999756
		c-2.6999512-10.6000061,0.8000488-25,6.5-34.7999878c6.5999756-11.2999878,18.5999756-6.2000122,28.1999512-0.2000122
		C529.5999146,416.2999878,532.7999878,432,527.7999878,449.7999878z"></path>
	<path class="st1" d="M999.8999634,540.0999756c-17.4000244,0-26.8000488-7.2000122-26.6999512-20.7999878
		c0.0999756-17.5,14.4000244-33.2000122,30.3000488-33.2999878c16.5999756-0.1000061,31.7999878,11.3999939,32.1000366,24.2999878
		C1035.8999023,525.7000122,1018.7000122,540.0999756,999.8999634,540.0999756z"></path>
	<path class="st0" d="M456.8999634,730.7999878c0,15.7999878-7.8000488,24.9000244-21.1999512,24.7999878
		c-17.3000488-0.2000122-34-12.7000122-34.3000488-25.7000122c-0.4000244-14.9000244,16.1999512-33.5999756,29.4000244-33.0999756
		C444.3999634,697.0999756,456.8999634,713.4000244,456.8999634,730.7999878z"></path>
	<path class="st1" d="M868.3999634,97.9000015c16.1999512-0.0999985,25.5999756,7.3000031,25.6999512,20.2999954
		c0.0999756,17.5-13.0999756,35.6999969-26.0999756,35.8000031c-14.0999756,0.1000061-31.4000244-17.6000061-31.1999512-31.8000031
		C837.2000122,108.4000015,850.5999146,98.0999985,868.3999634,97.9000015z"></path>
	<path class="st0" d="M417.7999878,167.1999969c18,0,29.1999512,10,29,26
		c-0.1999512,14.3999939-12.4000244,27.6999969-25.5999756,27.8999939c-14.5999756,0.1999969-26.8000488-13.3000031-26.8000488-29.5
		C394.5999146,175.6999969,402.7000122,167.1999969,417.7999878,167.1999969z"></path>
	<path class="st1" d="M997.499939,171.6999969c-0.6999512,16.3000031-12.5,28.8999939-26.3000488,28.1000061
		C956.5999146,199,943.499939,183.6999969,944.0999146,168.1999969c0.5999756-14.6999969,11.0999756-25.8999939,23.8000488-25.5
		C983.999939,143.1999969,998.0999146,157,997.499939,171.6999969z"></path>
	<path class="st1" d="M669.2999878,123.4000015c-16.5999756,0-26.1999512-6.5999985-26.4000244-18.0999985
		c-0.1999512-16.9000015,15.3000488-36.9000015,28.3000488-36.4000015c12.5999756,0.5,28.5,19.2000046,28.3000488,33.5
		C699.2999878,116.0999985,688.7999878,123.4000015,669.2999878,123.4000015z"></path>
	<path class="st0" d="M571.7999878,342.3999939c-13.5999756,10.2000122-26,9.3999939-41.5-2.7000122
		c-1.5999756-6-3.1999512-12-4.8000488-18c4.8000488-23.6000061,12.5999756-30.6000061,31.9000244-28.6000061
		C570.7000122,307.1000061,583.7000122,321.1000061,571.7999878,342.3999939z"></path>
	<path class="st0" d="M382.0999146,318.7000122c-5.1999512,1.7000122-10.3000488,4.2999878-15.5999756,5
		c-17.0999756,2-27.4000244-4.2000122-28.4000244-16.2999878c-1.1999512-14.7000122,11.9000244-30.1000061,26.5-31.1000061
		c1.4000244-0.1000061,2.8000488-0.1000061,4.0999756-0.2000122c4.0999756,0.6000061,8.3000488,0.6000061,12.1999512,1.8999939
		c20.1999512,6.5,22.8000488,19,7.4000244,33.6000061C385.999939,313.6000061,384.0999146,316.2999878,382.0999146,318.7000122z"></path>
	<path class="st1" d="M618.7999878,139.3000031C618.6000366,156,612.2000122,162,600.2000122,161.5
		c-12.9000244-0.5-30.3000488-13.3999939-32.9000244-24.3000031c-2.5-10.3000031,6.3000488-25.5,18-32
		c8.1999512-4.5,16.1999512-3.8000031,20.5999756,4.0999985
		C611.8999634,120.1999969,615.7999878,132.1000061,618.7999878,139.3000031z"></path>
	<path class="st0" d="M452.7000122,830.9000244c-7.5-5.9000244-18-10.2000122-21.8000488-17.9000244
		c-5-10.4000244,5.6999512-17,13.3000488-23.0999756c1.0999756-0.9000244,2.4000244-1.4000244,3.5999756-2
		c11.9000244-5.7999878,24.6999512-12.0999756,35.6999512-0.7999878c4.3000488,4.4000244,6.0999756,14.4000244,4.5,20.7000122
		C484.5999146,821,469.999939,828.5999756,452.7000122,830.9000244z"></path>
	<path class="st0" d="M545.999939,264.7000122c-8.5999756,10.2000122-19.4000244,10.7000122-30,5.1000061
		c-11.3000488-5.8999939-18.5999756-15.1000061-16.5-29.1999969c1.9000244-12.8000031,6.6999512-23.1000061,20.8000488-25.8999939
		l1.0999756,0.5l1.1999512-0.3999939c1.5,0.1000061,3.0999756,0.3000031,4.5999756,0.3999939
		C546.0999146,226.8999939,549.3999634,244.5,545.999939,264.7000122z"></path>
	<path class="st0" d="M310.0999146,339.8999939c-0.4000244,15.6000061-5.4000244,21.5-16.0999756,21.8999939
		c-12.1999512,0.5-30.1999512-11.1000061-33.1999512-21.3999939c-3.0999756-10.7999878,3.9000244-25.5,15.8000488-32.7999878
		c8.4000244-5.2000122,16.5999756-5,21.4000244,4C303.499939,322,307.2999878,333.2999878,310.0999146,339.8999939z"></path>
	<path class="st0" d="M685.8999634,656.7000122c-5,2.0999756-9.9000244,5.2999878-15.0999756,6.0999756
		c-15.8000488,2.2000122-29.0999756-7.7000122-30-21.4000244c-1.0999756-16.9000244,11-31.2000122,26.8000488-31.7999878
		c2.3000488-0.0999756,4.5999756-0.2000122,6.9000244-0.4000244c1.8000488,2.5,3.3000488,5.2999878,5.5,7.5999756
		C694.3999634,632,695.3999634,638.2000122,685.8999634,656.7000122z"></path>
	<path class="st0" d="M654.5999146,576.4000244c-17.3000488,9.5-32.5,7.0999756-45.5-8.0999756l0,0
		c2.5999756-9.5,3.9000244-19.7000122,8.0999756-28.4000244c7.1999512-14.9000244,16.4000244-16.5,30.0999756-7.2000122
		C656.2999878,546.2000122,668.3999634,559.0999756,654.5999146,576.4000244z"></path>
	<path class="st1" d="M911.7000122,212.5c0,12.3000031-7,20.1999969-17.6999512,20
		c-16.8000488-0.3999939-34.5-13.8000031-34.8000488-26.1000061c-0.1999512-13,16.3000488-28.3000031,30.8000488-28.6000061
		C902.7999878,177.6000061,911.7999878,192,911.7000122,212.5z"></path>
	<path class="st0" d="M504.8999634,635.4000244c-14.5999756,11.7000122-26.1999512,13-40.0999756,4.4000244
		c-16.0999756-10-15.9000244-23.5999756,0.5999756-32.5999756c3.5999756-2,7.5-3.2999878,11.3000488-5
		c0.9000244,0,1.8000488-0.0999756,2.6999512,0c10.3000488,0.7999878,20.6999512,1.5999756,31,2.5
		C508.7000122,614.9000244,506.7999878,625.0999756,504.8999634,635.4000244z"></path>
	<path class="st1" d="M896.2000122,494.2999878c-17.6999512-1-31.4000244-11.7999878-30.6999512-24.1000061
		c0.8000488-12.5,21.0999756-29.2000122,34-28c11.0999756,1,21.6999512,17.7999878,20.5999756,32.6000061
		C919.2000122,487.3999939,909.7999878,495.1000061,896.2000122,494.2999878z"></path>
	<path class="st0" d="M310.2999878,431.2999878c-15.5999756,0.2000122-22.8000488-5.8999939-23-19.1000061
		c-0.1999512-15.6000061,13-34.7000122,24-34.7999878c10-0.1000061,25.5,23,25.3000488,37.7999878
		C336.5999146,425.1000061,326.7000122,431.1000061,310.2999878,431.2999878z"></path>
	<path class="st1" d="M898.0999146,659.2999878c-0.0999756,16.4000244-5.1999512,22.4000244-19.0999756,22.4000244
		c-16.8000488,0.0999756-33.4000244-12.4000244-33.3000488-25C845.7998657,644.7000122,863.8998413,630,878.3998413,630
		C891.499939,630.0999756,898.2000122,640.0999756,898.0999146,659.2999878z"></path>
	<path class="st1" d="M525.499939,321.7000122c1.5999756,6,3.1999512,12,4.8000488,18
		c-1.8000488,5.7000122-2.9000244,11.7000122-5.3000488,17.2000122
		c-8.8000488,19.8999939-20.0999756,22.7000122-37.0999756,9.6000061c-2.8000488-14.5-5.5-28.8999939-8.3000488-43.3999939
		c9.0999756-10.2999878,20.1999512-8.7999878,31.6999512-5.3999939
		C515.999939,319.2000122,520.7999878,320.3999939,525.499939,321.7000122z"></path>
	<path class="st1" d="M842.2999878,225.5c-0.0999756,14.3999939-15.9000244,29.8999939-30.9000244,30
		c-13.3000488,0.1000061-26.5-11.6999969-26.1999512-23.6999969c0.3000488-12.3000031,19.5999756-25,37.4000244-24.6000061
		C834.999939,207.3999939,842.2999878,214.1999969,842.2999878,225.5z"></path>
	<path class="st0" d="M611.0999146,765.7999878C599.2998657,766,591.499939,758.7000122,591.3999634,747.5
		c0-14,14.0999756-28.0999756,28.5999756-28.4000244c14.5-0.2999878,27.5999756,9.7999878,27.5,21.2999878
		C647.3999634,752.5999756,628.8999634,765.5,611.0999146,765.7999878z"></path>
	<path class="st0" d="M149.1999512,723.4000244c-0.0999756-16.7999878,7.0999756-23.5,18.7999878-21.5999756
		c14.9000244,2.4000244,27.4000244,18.2000122,25.5999756,33.2000122c-1.3000488,11.5-7,20.7999878-18.7999878,23
		c-11.5999756,2.2000122-15.9000244-7.7000122-19.7000122-16.0999756
		C151.8999634,734.9000244,150.2999878,727.2000122,149.1999512,723.4000244z"></path>
	<path class="st0" d="M533.7999878,711.5999756c-12,16.5-25.8000488,16.9000244-36.8000488,0.0999756
		c-4.0999756-6.2000122-6.6999512-14.2999878-7.3000488-21.7000122
		c-1.5999756-18.7000122,8.4000244-26.0999756,28.8000488-22.9000244C528.999939,680,535.2999878,694.5,533.7999878,711.5999756z"></path>
	<path class="st0" d="M445.7999878,473.7999878c-14.9000244,17.3999939-28.8000488,19.7999878-45.1999512,7.8999939
		c-13.0999756-9.5-13.1999512-20.7999878,0.3000488-29.7999878c5.3000488-3.5,11.4000244-5.8999939,17.0999756-8.7999878
		c2.6999512,0.2999878,5.4000244,0.7000122,8.0999756,0.7999878c18.5999756,0.7000122,21,3.2999878,20.0999756,21.7000122
		C446.0999146,468.3999939,445.999939,471.1000061,445.7999878,473.7999878z"></path>
	<path class="st1" d="M922.0999146,568.7000122c-15.0999756-0.2999878-27.4000244-9.2999878-27.4000244-20.2000122
		c0.0999756-13.2000122,17.3000488-30.5999756,30-30.2999878C935.5999146,518.5,947.7998657,536,947.2998657,550.7999878
		C946.999939,561.7999878,936.8999634,569,922.0999146,568.7000122z"></path>
	<path class="st0" d="M361.8999634,237.3999939c-3.5,5.6999969-5.5,13.3000031-10,15.1999969
		c-4.8000488,2.1000061-12.6999512,0.5-17.8000488-2.1999969c-13.8000488-7.1000061-21.1999512-22.5-16.8000488-37.3000031
		c1.9000244-6.5,8.5999756-14.6999969,14.4000244-16c5.3000488-1.1999969,14.8000488,4.3999939,18.3000488,9.8000031
		C355.5999146,215.3999939,357.7000122,226.1000061,361.8999634,237.3999939z"></path>
	<path class="st1" d="M682.499939,161.5c10.5999756-2.5,21.4000244-7.6000061,31.6999512-6.8000031
		c7.6999512,0.6000061,18.0999756,7.3000031,21,14c2,4.6999969-5,16.3999939-11,20.6000061
		c-8.6999512,6.1000061-20.0999756,8.3999939-30.4000244,12.3000031c-19.4000244-9.1000061-21.4000244-15-12.0999756-34.8999939
		C682.499939,165.1000061,682.2999878,163.1999969,682.499939,161.5z"></path>
	<path class="st0" d="M529.3999634,600.5999756c2-22,18.6999512-27.5999756,36-32.5999756
		c17.5999756,7.9000244,20.5,14.9000244,15.5,37.4000244c-11.3000488,12-28,13.4000244-42,3.2000122
		c-3.3000488-2.4000244-6.3000488-5.4000244-9.4000244-8.0999756
		C529.5999146,600.5,529.3999634,600.5999756,529.3999634,600.5999756z"></path>
	<path class="st0" d="M394.2000122,590.0999756C385.8999634,601,377.1000366,599,368.2999878,590.8999634
		c-11.9000244-11-15.5-25-13.0999756-40.4000244c2.0999756-13.7000122,13.5-17.2999878,27.1999512-9.0999756
		C391.0999146,556.5,399.7000122,571.5999756,394.2000122,590.0999756z"></path>
	<path class="st0" d="M719.999939,734c-9.6999512,16.5999756-21.9000244,18.2999878-33,2.9000244
		c-5.4000244-7.5-9.5999756-17.5-9.9000244-26.4000244c-0.1999512-7.4000244,4.5-17.2000122,10.3000488-21.7999878
		c3.1999512-2.5,13.0999756,3.7000122,20,5.9000244C711.7000122,707.7000122,715.7999878,720.9000244,719.999939,734z"></path>
	<path class="st0" d="M204.2000122,647.9000244c-5.5-3.9000244-15-7.2999878-17.0999756-13.2000122
		c-1.9000244-5.2999878,3.0999756-14.5,7.5999756-20c4.4000244-5.4000244,11.5-9.4000244,18.0999756-12
		c11.1999512-4.4000244,21.5,0.5,26.4000244,11.0999756c5,10.7999878,1.9000244,20.9000244-9.6999512,26.5
		C222.5999146,643.7000122,214.7000122,644.9000244,204.2000122,647.9000244z"></path>
	<path class="st0" d="M554.3999634,524c-4.0999756,17.2000122-16.0999756,21.9000244-30.5,11.9000244
		c-13.5-9.4000244-19.1999512-22.2000122-15.0999756-34c4.3000488-12.6000061,14.9000244-18.2000122,29.4000244-15.8999939
		C543.5999146,498.7000122,548.999939,511.2999878,554.3999634,524z"></path>
	<path class="st0" d="M649.7000122,314.2999878c-11.1999512,6.8999939-23.6999512,8.8999939-32.6999512-1
		c-5.5999756-6.1000061-9-17.1000061-8.0999756-25.3999939c1.1999512-12.1000061,10-20.2000122,23.6999512-20.2999878
		C653.999939,280.8999939,657.499939,290.6000061,649.7000122,314.2999878z"></path>
	<path class="st0" d="M813.8999634,521.2000122c-10.9000244,6.7999878-22.5,8.2000122-34.0999756,2.5999756
		c-14.0999756-6.7000122-16.5999756-20.2999878-4.0999756-29.3999939
		C785.000061,487.6999817,797.000061,484.6999817,807.7999878,480C825.7000122,497,826.2000122,500.7000122,813.8999634,521.2000122
		z"></path>
	<path class="st1" d="M821.3999634,286.3999939C834.999939,272.5,863.2999878,276.5,869.5999146,294.6000061
		c2.0999756,6.1000061-0.9000244,17-5.5999756,21.7999878c-6.3000488,6.5-16.5,9.2000122-25,13.5
		C825.499939,319,819.8999634,305,821.8999634,287.7999878C821.999939,287.2000122,821.5999146,286.7999878,821.3999634,286.3999939
		z"></path>
	<path class="st0" d="M782.7000122,435.6000061c-9.6999512,2.7000122-19.4000244,7.2000122-29.0999756,7.2999878
		c-5.3000488,0-13.8000488-6.5-15.4000244-11.7999878c-4.9000244-15.7999878,14.3000488-37.2000122,31.4000244-36.7999878
		c3.1999512,3.7999878,6.9000244,7.2000122,9.5,11.2999878C785.0999146,414.8999939,790.499939,424.5,782.7000122,435.6000061z"></path>
	<path class="st1" d="M822.499939,680.9000244c1.0999756,13.5-6.6999512,21.7000122-17.4000244,25
		c-11.9000244,3.5999756-17-6.7000122-20.8000488-15.7000122c-2.5999756-6.2999878-5.1999512-13.2000122-5.1999512-19.7999878
		c0-5.7000122,2.3000488-14.4000244,6.3000488-16.4000244c5.5999756-2.9000244,15-3.2000122,20.5-0.2999878
		C816.2999878,659,824.2999878,667.9000244,822.499939,680.9000244z"></path>
	<path class="st1" d="M926.8999634,251c8.8000488,8.1000061,18.0999756,13.2000122,20.9000244,20.6000061
		c1.5,4-6.5999756,14.5-12.5999756,18c-8.9000244,5-19.6999512,7.6000061-30,8.7999878
		c-4.6999512,0.5-12.1999512-3.6000061-14.5-7.7999878c-2.1999512-4.1000061-1.4000244-13.2999878,1.8000488-16
		C902.0999146,266.2000122,913.499939,259.7999878,926.8999634,251z"></path>
	<path class="st1" d="M496.2999878,135.5c10.0999756-14.0999985,27.4000244-14.5999985,44.0999756-1.3000031
		c14.1999512,11.3999939,15,22,2.8000488,36.3000031c-11.4000244,13.3000031-22.4000244,16.1999969-39.1999512,10.3999939
		c19.0999756-15.6000061,19.8000488-25.8000031,2.5-38.3000031C502.999939,140.1999969,499.5999146,137.8999939,496.2999878,135.5z"></path>
	<path class="st0" d="M841.2999878,599.2000122c-10,4-20,7.5999756-29.6999512-0.9000244
		c-9.6999512-8.5999756-9.5-19.7000122-7-30.7000122c2.3000488-9.7999878,9.0999756-15.7999878,19.9000244-16
		C852.7000122,567.4000244,855.2999878,574.7000122,841.2999878,599.2000122z"></path>
	<path class="st0" d="M415.999939,400.6000061c-15.8000488,11.5-22.0999756,10.2999878-31.0999756-6.3999939
		C382.0999146,389,378.7999878,383.1000061,378.7000122,377.5c-0.0999756-7.7000122,0.5-17.5,5-22.2999878
		c3.4000244-3.6000061,13.5999756-0.7999878,20.8000488-0.7999878
		C416.5999146,367.7999878,422.8999634,382.6000061,415.999939,400.6000061z"></path>
	<path class="st0" d="M235.8999634,369.7000122c-5.0999756,7-8.6999512,17-14.4000244,18.3999939
		c-5.8000488,1.3999939-15.8000488-4-20.1999512-9.5c-5.4000244-6.7999878-8.9000244-16.5-9.3000488-25.2000122
		c-0.1999512-5.7000122,5.4000244-15.1000061,10.5-16.7000122c5.9000244-1.8999939,16.4000244,0.6000061,20.5,5.2000122
		C228.999939,348.5,231.0999146,358.7000122,235.8999634,369.7000122z"></path>
	<path class="st0" d="M733.0999146,547.2000122c-8,1.5-16,4.4000244-24,4.2000122
		C693.3999634,551.2000122,686.2998657,536,695.1998901,522.8000488c8.3000488-12.1000061,20.0999756-17,34.5999756-15.7000122
		c19.0999756,16.5,19.5,19.2999878,5.1999512,36.5C734.2000122,544.7000122,733.7000122,546,733.0999146,547.2000122z"></path>
	<path class="st0" d="M528.7000122,792.9000244C518.000061,793.6000366,511.8999634,788.3000488,511.6000366,777
		c-0.4000244-13.9000244,13.3000488-29.2999878,26-29.4000244c11-0.0999756,24.4000244,14,24.5999756,25.7999878
		C562.0999146,782.9000244,545.8999634,792.5999756,528.7000122,792.9000244z"></path>
	<path class="st0" d="M605.3999634,685.0999756c-10.4000244,7.5999756-22.3000488,8.5-31.4000244,0.4000244
		c-5.4000244-4.7999878-9.3000488-15.2999878-8.1999512-22.4000244c1.5999756-11.4000244,10.6999512-18.7000122,23.0999756-20
		c1.8000488-0.2000122,3.5999756-0.7000122,5.4000244-1C614.3999634,657.7999878,616.5999146,666,605.3999634,685.0999756z"></path>
	<path class="st1" d="M781.5999146,70c-0.1999512,13.8000031-13,25.5999985-27.5999756,25.5
		c-12.8000488-0.0999985-22.4000244-10.0999985-22.4000244-23.0999985
		C731.6998901,59.1000023,744.6998901,48.5,760.499939,48.8000031C772.3999634,49,781.7000122,58.5,781.5999146,70z"></path>
	<path class="st0" d="M349.499939,682.9000244c-5.9000244,6.5999756-9.6999512,14.7000122-15,15.7999878
		c-5.5,1.2000122-15.3000488-2.7000122-18.0999756-7.4000244c-5.5-9.2000122-8.9000244-20.4000244-10.3000488-31.0999756
		C305.3999634,655.4000244,310.2998657,647,314.7998657,645c4.1999512-1.7999878,13.5,1,16.4000244,4.9000244
		C338.2000122,659.2000122,342.7000122,670.2999878,349.499939,682.9000244z"></path>
	<path class="st1" d="M736.2000122,326.8999939c1.6999512-19.5,6-24.2999878,20.9000244-23.2000122
		c16.8000488,1.2000122,33.4000244,15.1000061,33.0999756,27.7999878c-0.3000488,15-16.1999512,28.3999939-33.0999756,27.7999878
		C758.999939,334.8999939,755.3999634,329.2999878,736.2000122,326.8999939z"></path>
	<path class="st0" d="M375.2000122,756.7000122c0,11.7000122-8.4000244,20.0999756-19.9000244,20.2000122
		C342.8999634,777,332.3999634,764.7000122,332.6000366,750.3000488c0.1999512-12.2000122,9-21,21-21.0999756
		C365.499939,729.0999756,375.2000122,741.5,375.2000122,756.7000122z"></path>
	<path class="st1" d="M754.2000122,584.5c2.4000244-1.4000244,4.5999756-3.2000122,7.0999756-4.2000122
		c15.3000488-6.4000244,31.9000244-1.5,37,10.7000122c5.3000488,12.5999756-3.4000244,38.7999878-16.0999756,41.5
		c-8.3000488,1.7000122-18-3.4000244-27.0999756-5.5c18-15.5,18.1999512-20.0999756,2.5-38.2000122
		C756.3999634,587.5,755.3999634,586,754.2000122,584.5z"></path>
	<path class="st1" d="M782.7000122,435.6000061c7.8000488-11,2.3000488-20.6000061-3.5999756-29.8999939
		c-2.5999756-4.1000061-6.3000488-7.6000061-9.5-11.2999878c12.5-14.5,26.5-14.8999939,42.9000244-0.7999878
		c3.8000488,3.2999878,7.0999756,7.2000122,10.5999756,10.8999939c0.5999756,0.6000061,0.5999756,1.2000122,0,1.8999939
		C818.0999146,426.5,803.7999878,436.8999939,782.7000122,435.6000061z"></path>
	<path class="st0" d="M236.999939,721.2999878c-12,0.2000122-16.3000488-6.9000244-16.5-17.5999756
		c-0.3000488-14.0999756,10.4000244-27.0999756,22.3000488-27.2999878c10-0.0999756,23,15.7999878,22.5999756,27.7000122
		C265.0999146,713.4000244,252.2999878,721.0999756,236.999939,721.2999878z"></path>
	<path class="st1" d="M394.2000122,590.0999756c5.5-18.5-3.0999756-33.7000122-11.8000488-48.7999878
		C383.7000122,540.8999634,385.0999146,540.5,386.2999878,540c16.8000488-7.7999878,33.6999512-5.9000244,40.5,4.5999756
		c6.3000488,9.7000122,0.9000244,32.2999878-11.6999512,41
		C409.7000122,589.4000244,401.2999878,588.7999878,394.2000122,590.0999756z"></path>
	<path class="st0" d="M481.7999878,545.9000244c-3.1999512,2.5999756-6.4000244,5.2000122-9.5999756,7.7999878
		c-14.8000488,11.5-25,8.7999878-32.3000488-8.5999756c-6.6999512-16-2.1999512-25,14.5-28.5
		c3.5999756-0.7999878,7.4000244-0.7999878,11-1.2000122C485.2999878,523.2999878,485.7999878,524.2999878,481.7999878,545.9000244z
		"></path>
	<path class="st0" d="M318.999939,599.7000122c0.0999756,12.4000244-7.4000244,22.0999756-17.5999756,22.5999756
		c-10.5,0.5-24.0999756-15.7999878-24.5-29.4000244c-0.3000488-10.0999756,9.4000244-19,21.0999756-19.0999756
		C310.2000122,573.7000122,318.7999878,584.2999878,318.999939,599.7000122z"></path>
	<path class="st0" d="M428.499939,649.0999756c-0.1999512,13.2999878-8.8000488,23-20.5999756,23.0999756
		c-10.9000244,0.0999756-24.0999756-14.0999756-24.3000488-26c-0.1999512-10.2999878,12.8000488-19.2000122,27.8000488-19
		C422.499939,627.2999878,428.7000122,635.2000122,428.499939,649.0999756z"></path>
	<path class="st0" d="M618.499939,232.8000031c-14.5,9.1000061-27.8000488,7-40.0999756-4.3000031
		c-0.1999512-3.1999969-0.3000488-6.5-0.5-9.6999969c0.4000244-15.6000061,13.3000488-19.8000031,24-25.8999939
		C626.7999878,203.3999939,630.7999878,213,618.499939,232.8000031z"></path>
	<path class="st1" d="M577.7999878,218.8000031c0.1999512,3.1999969,0.3000488,6.5,0.5,9.6999969
		c-2.3000488,25.6000061-12.5999756,37.2000122-32.4000244,36.2000122
		c3.4000244-20.1999969,0.0999756-37.8000031-18.8000488-49.6000061c12.0999756-11.6000061,24.8000488-9.8000031,38-2.1999969
		C569.2000122,215.3000031,573.5999146,216.8999939,577.7999878,218.8000031z"></path>
	<path class="st0" d="M736.2000122,326.8999939c19.1999512,2.3999939,22.8000488,7.8999939,20.9000244,32.3999939
		C744.4000854,371.1999817,731.4000854,373,720.4000854,364.3999939c-13.6999512-10.7000122-13-22.7000122,2-31.3999939
		C726.7000122,330.5,731.5999146,328.8999939,736.2000122,326.8999939z"></path>
	<path class="st0" d="M496.2999878,135.5c3.4000244,2.3999939,6.6999512,4.6999969,10.0999756,7.1000061
		c17.3000488,12.5,16.6999512,22.6999969-2.5,38.3000031c-18.8000488,4.3999939-25.3000488,0.8999939-28.0999756-15.3000031
		C472.5999146,147.3999939,478.999939,138,496.2999878,135.5z"></path>
	<path class="st0" d="M707.2000122,464.2000122c-1.3000488,0.5-2.5999756,1.2999878-3.9000244,1.2999878
		c-8.0999756,0.1000061-20.6999512,3.1000061-23.4000244-0.7000122c-5.0999756-7.2999878-8-19.5-5.5999756-28
		c3.0999756-11.3999939,15.5999756-10.8999939,26.0999756-9.3999939c1.4000244,0.2000122,2.8000488,0.2000122,4.0999756,0.2999878
		c1.8000488,2,3.5,4.1000061,5.5,5.8999939c8.5999756,7.3999939,11.9000244,15,1.6999512,23.8999939
		C709.7999878,459.2000122,708.7000122,461.8999939,707.2000122,464.2000122z"></path>
	<path class="st0" d="M679.8999634,387.7999878c-7.9000244,4.6000061-15.3000488,12.5-25.3000488,4.2999878
		c-8-6.6000061-14.4000244-29.7999878-10.0999756-38.1000061c4.9000244-9.5,13-10.5,22.1999512-7.2999878
		C677.999939,358.2000122,688.8999634,369.7999878,679.8999634,387.7999878z"></path>
	<path class="st0" d="M466.2999878,284.5c-5.3000488,10.7000122-14,14.6000061-25.1999512,10.7999878
		C429.7000122,291.3999939,422.9000854,274.5999756,426.500061,261c3.6999512-13.8999939,14.5-13.5,25.5999756-12.3999939
		C456.7999878,260.6000061,461.5999146,272.5,466.2999878,284.5z"></path>
	<path class="st1" d="M329.499939,482c11.5-5.1000061,22.5-12.3999939,34.5-14.2999878
		c6.3000488-1,16.3000488,5.8999939,20.4000244,12c2,2.8999939-4.0999756,15.3999939-9.3000488,18.2999878
		c-10.5,5.7999878-23,7.8999939-34.6999512,11.5C344.8999634,496.6000061,341.499939,488.2000122,329.499939,482z"></path>
	<path class="st1" d="M998.8999634,227c11.3000488,0.1999969,22.0999756,13.1000061,21.6999512,26.1999969
		c-0.3000488,11.0000153-11,20.4000092-22.5999756,19.8000031c-10.4000244-0.5-20.3000488-14.2000122-20.0999756-28
		C978.0999146,235.1000061,987.7000122,226.8000031,998.8999634,227z"></path>
	<path class="st0" d="M821.3999634,286.3999939c0.1999512,0.3999939,0.5,0.8999939,0.5,1.2999878
		c-2,17.2000122,3.5999756,31.2000122,17.0999756,42.1000061c-13.6999512,12-27.5,13.2000122-38.3000488,3.2999878
		c-9.9000244-9.2000122-11.3000488-26.1000061-0.5999756-37.6000061
		C804.8999634,290.2999878,814.2000122,289.2999878,821.3999634,286.3999939z"></path>
	<path class="st1" d="M1029,139.1999969c0.1999512-12.1999969,7.5-19,20.5-18.9000015
		c12.1999512,0.0999985,21.0998535,10.4000015,21.0998535,24.4000015c0,11.1999969-11.3000488,21.6000061-23,21.3000031
		C1036.8999023,165.8000031,1028.8000488,154.1000061,1029,139.1999969z"></path>
	<path class="st1" d="M649.7000122,314.2999878C657.500061,290.5,654.000061,280.8999939,632.500061,267.5999756
		c7.8000488-17.1000061,20.8000488-19.3999939,30.5-3.8999939c6.5999756,10.6000061,11,23.2999878,13.3000488,35.7000122
		c1,5.5-4.3000488,14.2999878-9.4000244,18C663.5999146,319.7999878,655.5999146,315.6000061,649.7000122,314.2999878z"></path>
	<path class="st0" d="M754.2000122,584.5c1.1999512,1.4000244,2.1999512,2.9000244,3.5,4.2999878
		c15.8000488,18.0999756,15.5,22.7000122-2.5,38.2000122c-7.8000488,3-17,5.0999756-20.5999756-4
		c-3.5999756-9.2000122-6.0999756-20.7000122-3.6999512-29.9000244
		C733.2999878,583.9000244,743.999939,581.2999878,754.2000122,584.5z"></path>
	<path class="st0" d="M629.3999634,494.8999939c-10,3.1000061-19.9000244,12-30.0999756,0.5
		C586.499939,481,590.2000122,469,610.2000122,460c7.4000244,2.7999878,16.5999756,3.6000061,21.9000244,8.7000122
		C640.5999146,476.8999939,632.7999878,486.2999878,629.3999634,494.8999939z"></path>
	<path class="st0" d="M600.0999146,415.2999878c-6.6999512,1.5-13.4000244,3.8999939-20.1999512,4.2999878
		c-17.4000244,0.8999939-24.6999512-10.5-17.3000488-26.1000061c7.9000244-16.7000122,19.5-23.3999939,37.5999756-21.6000061
		c-1.0999756,3.6000061-1.5999756,7.7000122-3.5,10.7999878c-4.6999512,7.5-7.5,14.5-0.8000488,22.6000061
		C598.0999146,408,598.7999878,411.8999939,600.0999146,415.2999878z"></path>
	<path class="st1" d="M841.2999878,599.2000122c14-24.5,11.4000244-31.7999878-16.8000488-47.5999756
		c11.5999756-15,24.1999512-15.7999878,36-1c5,6.2999878,8.9000244,14.2999878,10.5,22.2000122
		C875.2999878,594.2000122,862.7000122,604.7999878,841.2999878,599.2000122z"></path>
	<path class="st1" d="M605.3999634,685.0999756C616.5999146,666,614.499939,657.6999512,594.2999878,642
		c9.4000244-10.7000122,20.9000244-12.5,31.1999512-4.7000122c12.0999756,9.0999756,15.4000244,29.7999878,6.9000244,43.7000122
		C624.999939,693.2000122,615.5999146,691.7999878,605.3999634,685.0999756z"></path>
	<path class="st1" d="M685.8999634,656.7000122c9.5-18.5,8.5-24.7000122-5.9000244-39.9000244
		c-2.0999756-2.2000122-3.6999512-5-5.5-7.5999756c8-11.5,18.5999756-8.2999878,28.3000488-3.7999878
		c10.8000488,5,17.8000488,13.7999878,15.4000244,26.5c-2.4000244,12.5-8.8000488,22.4000244-22.6999512,24.7000122
		C692.3999634,657.2000122,689.0999146,656.7000122,685.8999634,656.7000122z"></path>
	<path class="st1" d="M781.499939,167.8999939c-10.5-0.1999969-19.0999756-13.8000031-18.3000488-29.5
		c0.5-9.3999939,4.9000244-15.5999985,15.4000244-15.5999985c11,0,23.5,15.4999924,23.8000488,29.7000046
		C802.5999146,160.8999939,792.7999878,168.1000061,781.499939,167.8999939z"></path>
	<path class="st0" d="M479.5999146,323.1000061c2.8000488,14.5,5.5,28.8999939,8.3000488,43.3999939
		c-23,9.7000122-36.4000244,0.7000122-34.8000488-23.3999939
		C454.2000122,326.7999878,463.0999146,320.1000061,479.5999146,323.1000061z"></path>
	<path class="st0" d="M727.2000122,280.7000122c-15.9000244,8.7999878-26.1999512,8.2000122-33-1.7000122
		c-9.9000244-14.2999878-4.0999756-25.6999969,16.6999512-33.1999969
		C729.2000122,250.6000061,734.3999634,261.7999878,727.2000122,280.7000122z"></path>
	<path class="st0" d="M823.0999146,406.2000122c0.5999756-0.7000122,0.5999756-1.2999878,0-1.8999939
		c0-18.7999878,9.6999512-28.3999939,28.4000244-28.2999878c4.5999756,11.1000061,9.3000488,22.2000122,14,33.2999878
		C858.0999146,423.7999878,837.2999878,423.2000122,823.0999146,406.2000122z"></path>
	<path class="st1" d="M600.0999146,415.2999878c-1.3000488-3.3999939-2-7.3999939-4.1999512-10
		c-6.6999512-8-3.9000244-15,0.8000488-22.6000061c1.9000244-3.1000061,2.4000244-7.2000122,3.5-10.7999878
		c23.1999512,0.5,23.8000488,0.8999939,29.0999756,20c4.3000488,15.3999939-0.9000244,22.7000122-16.9000244,23.3999939
		C608.3999634,415.5,604.2000122,415.2999878,600.0999146,415.2999878z"></path>
	<path class="st1" d="M727.2000122,280.7000122c7.1999512-18.8999939,1.9000244-30.1999969-16.3000488-35
		c5.3000488-10.8000031,12.1999512-19.1999969,25.8000488-15.3000031c13.3000488,3.8000031,21.8000488,17.5,20,31.3000031
		C755.2000122,274.2000122,746.999939,279.5,727.2000122,280.7000122z"></path>
	<path class="st1" d="M618.499939,232.8000031C630.7999878,213,626.7999878,203.4000092,601.7999878,192.8999939
		c6.0999756-5.5,11.6999512-14.6999969,18.3000488-15.5c5.5999756-0.6000061,12.5,8.3000031,18.5,13.3999939
		c2,1.6999969,2.9000244,4.6000061,4.0999756,7.1000061C653.2000122,221.3999939,644.2999878,234.1999969,618.499939,232.8000031z"></path>
	<path class="st1" d="M529.3999634,600.5999756L529.5999146,600.5c3.1999512,19.7000122-8.0999756,34.4000244-24.6999512,34.9000244
		c1.9000244-10.2000122,3.6999512-20.5,5.5999756-30.7999878c-10.3000488-0.7999878-20.6999512-1.7000122-31-2.5
		c-0.9000244-0.0999756-1.8000488,0-2.6999512,0c2.6999512-11.7000122,9-20.2999878,21.5-22
		C514.2000122,577.9000244,522.3999634,588.5,529.3999634,600.5999756z"></path>
	<path class="st1" d="M813.8999634,521.2000122c12.3000488-20.3999939,11.8000488-24.1000061-6.0999756-41.1000061
		c6.6999512-2.5,13.5-7.1000061,20.1999512-7.1000061c6.9000244,0,17.9000244,2.7999878,19.9000244,7.3999939
		c2.6999512,6.6000061,0.9000244,17-2.5999756,23.8999939C839.2000122,516.0999756,826.7000122,519.9000244,813.8999634,521.2000122
		z"></path>
	<path class="st1" d="M719.999939,734c-4.1999512-13.0999756-8.4000244-26.2999878-12.5-39.4000244
		c1.3000488-0.5,2.5-1.4000244,3.8000488-1.5c9.0999756-0.5,19.0999756-3.2000122,26.9000244-0.0999756
		c4.4000244,1.7000122,7.9000244,13.2999878,7,19.7999878c-1.5,10.7999878-8.9000244,18.9000244-21.0999756,20.4000244
		C722.7000122,733.2999878,721.2999878,733.7000122,719.999939,734z"></path>
	<path class="st1" d="M733.0999146,547.2000122c0.6999512-1.2000122,1.0999756-2.5,2-3.5999756
		c14.1999512-17.2000122,13.9000244-20-5.1999512-36.5c14.3000488-8.3999939,25.0999756-7.2999878,31.3000488,3.2000122
		c7.5999756,12.7000122,4.4000244,35.4000244-5.8000488,42
		C746.2000122,558.2999878,739.8999634,551.4000244,733.0999146,547.2000122z"></path>
	<path class="st1" d="M554.3999634,524c-5.4000244-12.7000122-10.8000488-25.2999878-16.1999512-38
		c3.6999512-1.7999878,7.1999512-4.2000122,11-5.5c12.0999756-4,24.3000488,0.8999939,28.0999756,10.7000122
		c4.8000488,12.6000061-0.8000488,25.7000122-13.5,30.7000122C560.8999634,523.2000122,557.499939,523.4000244,554.3999634,524z"></path>
	<path class="st1" d="M571.7999878,342.3999939c11.9000244-21.2999878-1.0999756-35.2999878-14.3000488-49.2000122
		c9.6999512-6.1000061,19.5-8.7000122,29.3000488-0.1000061c9,7.8999939,14.0999756,25.3999939,10,35.7000122
		C592.2000122,340.1000061,582.7000122,342.7000122,571.7999878,342.3999939z"></path>
	<path class="st1" d="M527.7999878,449.7999878c5-17.7999878,1.8000488-33.5-12.3000488-46.2999878
		c0.9000244-0.2000122,1.8000488-0.2000122,2.6999512-0.5c21.1999512-6.2999878,34.5-1.8999939,37.5,12.3999939
		C558.7999878,430.3999939,545.7999878,446.5,527.7999878,449.7999878z"></path>
	<path class="st1" d="M445.7999878,473.7999878c0.0999756-2.7000122,0.3000488-5.3999939,0.4000244-8.1000061
		c0.9000244-18.2999878-1.5-21-20.0999756-21.7000122c-2.6999512-0.1000061-5.4000244-0.6000061-8.0999756-0.7999878
		c6.9000244-15.3999939,15.6999512-20.2000122,30.3000488-16.3999939c11.3000488,2.8999939,19.3000488,13.7000122,18.4000244,26
		C465.8999634,465.5,458.999939,472.8999939,445.7999878,473.7999878z"></path>
	<path class="st1" d="M580.999939,605.4000244c5-22.5,2.0999756-29.5-15.5-37.4000244
		c14.1999512-13.7000122,21.5-13.5999756,43.5999756,0.2999878l0,0c-0.4000244,4.4000244-0.6999512,8.9000244-1.0999756,13.2999878
		C606.3999634,598,594.0999146,602.2000122,580.999939,605.4000244z"></path>
	<path class="st1" d="M382.0999146,318.7000122c2.0999756-2.3999939,3.9000244-5.1000061,6.1999512-7.2999878
		c15.4000244-14.6000061,12.8000488-27.1000061-7.4000244-33.6000061
		c-3.9000244-1.2000122-8.0999756-1.2999878-12.1999512-1.8999939c5.0999756-2.7999878,9.9000244-6.8999939,15.3000488-8
		c12-2.2999878,24.6999512-0.2999878,29.9000244,11.6000061c3.1999512,7.2999878,2.9000244,18.5-0.4000244,25.8999939
		C407.999939,318.2999878,395.999939,322.3999939,382.0999146,318.7000122z"></path>
	<path class="st1" d="M466.2999878,284.5c-4.6999512-11.8999939-9.5-23.8999939-14.1999512-35.8000031
		c6.3000488-10.6999969,17.0999756-11,25.0999756-6.1000061c6.5999756,4.1000061,12,13.4999847,13.8000488,21.4999847
		c2.3000488,10.1000061-6.6999512,15-15.3000488,18.2000122C472.7000122,283.2999878,469.3999634,283.7000122,466.2999878,284.5z"></path>
	<path class="st1" d="M629.3999634,494.8999939c3.5-8.6000061,11.1999512-18,2.5999756-26.2999878
		c-5.1999512-5-14.4000244-5.8999939-21.9000244-8.7000122c6.0999756-11.5,14.8000488-17.6000061,28.0999756-12.7000122
		c9.9000244,3.7000122,18.4000244,21.2000122,16.4000244,32.3999939
		C652.5999146,490.5,643.7000122,495.8999939,629.3999634,494.8999939z"></path>
	<path class="st1" d="M533.7999878,711.5999756C535.2999878,694.3999634,528.999939,680,518.3999634,667
		c6.5-1.5,13.9000244-5.7000122,19.3000488-3.9000244c11.4000244,3.7000122,18,14,16.9000244,25.9000244
		c-0.5999756,6.7000122-6.0999756,13.2999878-10.5999756,19.0999756
		C542.2000122,710.5,537.2999878,710.5999756,533.7999878,711.5999756z"></path>
	<path class="st1" d="M654.5999146,576.4000244c13.8000488-17.2999878,1.6999512-30.2000122-7.3000488-43.7000122
		c1.4000244,0.2000122,2.8000488,0.7999878,4.0999756,0.5c20.8000488-4.2000122,29.5999756,0.2000122,32.0999756,16
		c2.6999512,17.2000122-5.9000244,25.5999756-27.5,27.0999756
		C655.499939,576.2999878,654.999939,576.4000244,654.5999146,576.4000244z"></path>
	<path class="st1" d="M865.3999634,409.2999878c-4.6999512-11.1000061-9.3000488-22.2000122-14-33.2999878
		c5.5-2,11.0999756-5.7999878,16.4000244-5.5c6.6999512,0.5,16,2.7000122,18.9000244,7.3999939
		c2.5999756,4.2999878-0.0999756,14.2000122-3.6999512,19.2999878
		C879.2000122,402.7000122,871.499939,405.3999939,865.3999634,409.2999878z"></path>
	<path class="st1" d="M415.999939,400.6000061c6.9000244-18.1000061,0.5999756-32.7999878-11.5-46.2000122
		c15.3000488-8,22.8000488-5.5,28.6999512,10.1000061c2.1999512,5.8999939,4.0999756,12.2999878,4.5999756,18.5
		C439.0999146,398.8999939,431.8999634,404.2999878,415.999939,400.6000061z"></path>
	<path class="st1" d="M848.5999146,42.7000008c0.1999512,10.7000008-4.8000488,16.3999977-15.8000488,16.1000023
		c-8.8000488-0.2000008-17-1.9000015-18-12.7000008c-0.8000488-8.7000008,9.0999756-20.8999996,16.5-21.2000008
		C840.3999634,24.5,848.3999634,32.7000008,848.5999146,42.7000008z"></path>
	<path class="st1" d="M1077,239.6000061c-8.1000977-2.1000061-17-3.8000031-16.9001465-15.6999969
		c0.1000977-9.6999969,8-17.1000061,18-16.8999939c10.1000977,0.1999969,16,5.6999969,15.8000488,15.3999939
		C1093.5998535,232.1000061,1088.5,238.8999939,1077,239.6000061z"></path>
	<path class="st0" d="M682.499939,161.5c-0.1999512,1.6999969-0.0999756,3.6999969-0.8000488,5.1999969
		c-9.3000488,19.8999939-7.3000488,25.8000031,12.0999756,34.9000092c-9.5-0.1000061-20.5999756,2.6999969-27.8000488-1.5
		c-4.5-2.6000061-6.3000488-16.8999939-3.5-23.3999939C665.499939,170,675.5999146,166.3999939,682.499939,161.5z"></path>
	<path class="st1" d="M679.8999634,387.7999878c9-18-1.8000488-29.6000061-13.1999512-41.1000061
		c1.8000488-0.1000061,3.6999512,0.1000061,5.4000244-0.2999878c19.0999756-4.8999939,32,5.2999878,30.5999756,25.1000061
		C701.7999878,385.5,690.7999878,387,679.8999634,387.7999878z"></path>
	<path class="st0" d="M138.8999634,666.0999756c-11.9000244-2.7999878-14.7999878-8.2999878-14.7000122-16.4000244
		c0.2000122-9.2000122,4.5-17,13.7000122-14.7999878c6.7000122,1.5999756,11.9000244,9.2000122,17.7999878,14.2000122
		C150.0999756,654.7000122,144.499939,660.4000244,138.8999634,666.0999756z"></path>
	<path class="st0" d="M81.999939,776c-5.2000122-7.2000122-11.2999878-12.7000122-10.2999878-14.7999878
		c3.4000244-7.2999878,9.2999878-13.2999878,14.2999878-19.9000244c4.7000122,6.2000122,11.7999878,11.9000244,13,18.5999756
		C99.5999756,763.5,89.8999634,768.9000244,81.999939,776z"></path>
	<path class="st0" d="M403.3999634,833.2000122C395.2999878,841,390.5999146,845.5,385.8999634,850
		c-5.1999512-5.7999878-13-10.9000244-14.9000244-17.5999756c-2.5-8.7000122,5.9000244-14,13.6999512-12.7000122
		C390.0999146,820.7000122,394.7999878,826.7999878,403.3999634,833.2000122z"></path>
	<path class="st1" d="M1065.0998535,482.6000061C1074,476,1080.1999512,468.3999939,1084,469.3999939
		c6.5998535,1.7999878,15.3000488,8.2000122,16.5998535,14.1000061c2.3000488,10.5-9,13.8999939-16.5998535,13.7000122
		C1078.8999023,497,1074,489.7999878,1065.0998535,482.6000061z"></path>
	<path class="st1" d="M968.0999146,617.5c-0.5999756,14.9000244-7,17.2000122-16,17.2999878
		c-8.9000244,0.0999756-12.6999512-4.2000122-12.1999512-12.5999756c0.5-8.5999756,2.4000244-18.5,13.1999512-16.5999756
		C959.3999634,606.7000122,964.5999146,614.5,968.0999146,617.5z"></path>
	<path class="st1" d="M707.2000122,464.2000122c1.5-2.2000122,2.5999756-5,4.5999756-6.7000122
		c10.3000488-8.7999878,6.9000244-16.3999939-1.6999512-23.8999939c-2-1.7000122-3.6999512-3.8999939-5.5-5.8999939
		c8.1999512-3.7999878,17.5999756-7.5,23.1999512,2c3.8000488,6.3999939,6.4000244,16.2000122,4.1999512,22.6000061
		C728.499939,462.6000061,718.499939,466.6000061,707.2000122,464.2000122z"></path>
	<path class="st1" d="M926.499939,88.3000031c5.5-3.3000031,11.5-9.6999969,16.3000488-8.9000015
		c5.6999512,0.9000015,10.3000488,8.1999969,15.4000244,12.6999969C952.500061,97.1999969,947.500061,104.5,940.8999634,106.5
		c-3.4000244,1-9.5999756-7.6999969-14.5-12C926.2999878,92.4000015,926.3999634,90.4000015,926.499939,88.3000031z"></path>
	<path class="st0" d="M133.8999634,370.7999878c3.7999878,5.2999878,10.7000122,10.7000122,10.5999756,15.7999878
		c-0.0999756,4.2000122-8.5999756,8.2000122-13.4000244,12.3999939c-3.7000122-4.3999939-9.7000122-8.5-10.5-13.2999878
		c-0.7000122-4.2999878,4.5-9.5,7.0999756-14.2999878C129.7999878,371.2000122,131.7999878,371,133.8999634,370.7999878z"></path>
	<path class="st1" d="M481.7999878,545.9000244c4.0999756-21.5999756,3.5999756-22.5-16.4000244-30.5
		c7.5-6.5,16.4000244-10.5,24.5999756-3.4000244c4.9000244,4.2000122,9.3000488,11.9000244,9.5,18.2000122
		C499.8999634,540.4000244,491.0999146,544.4000244,481.7999878,545.9000244z"></path>
	<path class="st0" d="M329.499939,482c12,6.1000061,15.3000488,14.5,10.9000244,27.5
		c-11,4.7999878-15.5-2.6000061-17.6999512-10.7999878C321.2000122,492.6000061,317.499939,483.6000061,329.499939,482z"></path>
	<path class="st1" d="M1141.8000488,112.3000031c-1,11.8000031-5.3000488,18-13.3000488,16.1999969
		c-5-1.1999969-10.1999512-8.0999985-11.8000488-13.5999985C1116,112.5999985,1123.8999023,105.3000031,1128.5998535,104.5
		C1132.3999023,103.8000031,1137.3000488,109.4000015,1141.8000488,112.3000031z"></path>
	<path class="st1" d="M915.3999634,0c3.3000488,5.3000002,8.5999756,10.3999996,9.0999756,15.8999996
		c0.3000488,3.5-6.3000488,10.1999989-10.5,10.8999996c-7.3000488,1.1000004-14.1999512-3.3999996-12.5-12.1999998
		c1-5.1999998,5.5-9.6999998,8.5-14.5C911.7000122,0,913.5999146,0,915.3999634,0z"></path>
	<path class="st0" d="M72.8999634,681.9000244c-5.7999878,4.2999878-10.2999878,9.5999756-12.7000122,8.7999878
		c-4.5-1.5-10.7999878-6.5999756-10.7000122-10.0999756c0.0999756-4.2999878,6-8.4000244,9.4000244-12.5999756
		C62.7999878,671.9000244,66.6999512,675.7999878,72.8999634,681.9000244z"></path>
	<path class="st0" d="M320.2999878,858c-7.8000488,6-12.3000488,12.0999756-16.0999756,11.5999756
		c-4.0999756-0.5-9.5-6.5-10.5999756-11.0999756c-0.6999512-2.5999756,5.8000488-9.7999878,9.3000488-10
		C307.3999634,848.4000244,311.999939,853.2000122,320.2999878,858z"></path>
	<path class="st0" d="M274.8999634,760.5c5,9.7000122,9.4000244,15,10,20.7999878
		C285.2000122,784,277.999939,787.3999634,274.2000122,790.5c-3.5-4.7000122-8.6999512-9-9.8000488-14.0999756
		C263.7999878,773,269.3999634,768.5,274.8999634,760.5z"></path>
	<path class="st1" d="M1172.1999512,195.6999969c-7.8000488,5.1000061-13.8000488,10.6999969-15.3000488,9.6999969
		c-4.5998535-3.1999969-8.5-8.5-10.1999512-13.8000031c-0.5998535-1.8999939,6.9001465-9.1999969,9-8.6000061
		C1160.5998535,184.6000061,1164.5,189.3999939,1172.1999512,195.6999969z"></path>
	<path class="st1" d="M1163.5998535,440.8999939c6.1999512,7.6000061,12.6999512,12.2000122,12.1000977,15.7000122
		c-0.6000977,4.2000122-6.9001465,8.8999939-11.6000977,10.2999878c-2.1999512,0.7000122-9.0998535-5.7000122-9.3000488-9.1000061
		C1154.5998535,453.6000061,1159.0998535,449.1000061,1163.5998535,440.8999939z"></path>
	<path class="st0" d="M258.999939,233.8000031c7.6999512,7.3999939,11.8000488,11.3000031,15.9000244,15.1999969
		c-5.1999512,4.3999939-10.0999756,9.3999939-16,12.7000122c-0.9000244,0.5-8.5-6.6999969-8.8000488-10.5
		C249.8999634,246.8000031,254.499939,242.1000061,258.999939,233.8000031z"></path>
	<path class="st1" d="M1218.7998047,85.5c-5.1000977,2.9000015-9.8999023,6.8000031-15.3000488,8.4000015
		c-2.3000488,0.6999969-6-3.5-9.0998535-5.5c3.8000488-4.4000015,6.8999023-10.1999969,11.6999512-12.6999969
		c2.5-1.3000031,8,3.4000015,12.1000977,5.4000015C1218.3999023,82.5999985,1218.5998535,84,1218.7998047,85.5z"></path>
	<path class="st0" d="M23.2999878,792.0999756c-6.2999878,3.2999878-11,7.5-13,6.5
		C6.0999756,796.5,3.3999634,791.5999756,0,787.8999634c3.5999756-2.9000244,7.7999878-8.5,10.7999878-7.9000244
		C14.7999878,780.7999878,17.7999878,786.4000244,23.2999878,792.0999756z"></path>
	<path class="st0" d="M285.2000122,515c-8.9000244,4.5-13.6999512,8.0999756-18.9000244,8.9000244
		c-2.0999756,0.2999878-7.9000244-6.7000122-7.1999512-8.2999878c1.8000488-4.2000122,6-9.7999878,9.6999512-10.1000061
		C272.5999146,505.1000061,277.0999146,510,285.2000122,515z"></path>
	<path class="st1" d="M959.7999878,360.7000122c-4.6999512,4.5-8.6999512,10-10.1999512,9.3999939
		c-4.5-1.8999939-8.0999756-6.1000061-12.0999756-9.5c3.5-3.5,6.5-8.6000061,10.6999512-10
		C950.2999878,349.8999939,954.5999146,356,959.7999878,360.7000122z"></path>
	<path class="st1" d="M1046.5998535,594.5c-3.8999023,2.2999878-7.6999512,6.0999756-11.5998535,6.2999878
		c-3.1000977,0.0999756-6.4001465-4.2000122-9.6999512-6.5999756c3-3.4000244,5.5998535-8.7999878,9.0998535-9.5
		s7.9001465,3.2999878,12,5.2999878C1046.3999023,591.5,1046.5,593,1046.5998535,594.5z"></path>
	<path class="st0" d="M208.3999634,811.2000122c-5,3.7000122-9,8.0999756-10.4000244,7.4000244
		c-4-2-8.5999756-5.5999756-9.8000488-9.5999756c-0.6999512-2.2000122,4.5-6.4000244,7.0999756-9.7000122
		C198.999939,802.7000122,202.7000122,806,208.3999634,811.2000122z"></path>
	<path class="st1" d="M1018.999939,51.0999985c4.5999756,7.2999992,9.2000122,11.5,8.8001099,14.9000015
		c-0.5,3.3000031-6.000061,7.3000031-9.9000854,8.0999985c-2.3000488,0.4000015-8.4000244-5.3000031-8-7.4000015
		C1010.5999146,62.2000008,1014.499939,58.2999992,1018.999939,51.0999985z"></path>
	<path class="st0" d="M63.8999634,417.8999939c-4.5,3.7000122-7.2999878,5.8999939-10,8.2000122
		c-2.9000244-3.7000122-6.7999878-7-8.2000122-11.2000122c-0.5999756-1.7999878,4.2000122-5.2999878,6.5999756-8
		C55.5999756,410,58.8999634,413.1000061,63.8999634,417.8999939z"></path>
	<path class="st0" d="M181.499939,267c3.6999512,6.1000061,7.3000488,9.5,7.4000244,13.1000061
		c0.0999756,2.2999878-5,4.7000122-7.6999512,7.1000061c-2.2999878-3.3999939-5.5-6.6000061-6.4000244-10.3999939
		C174.2999878,274.8999939,177.8999634,271.8999939,181.499939,267z"></path>
	<path class="st1" d="M522.5999146,214.8000031l-1.1999512,0.3999939c0,0-1.1999512-0.5-1.0999756-0.5
		C520.999939,213.8999939,521.7999878,214,522.5999146,214.8000031z"></path>
</g>
</svg></svg></g></svg>