{
  "whitelistMain": [
    "https://zaaksysteem.nl/",
    "https://*.bus.koppel.app",
    "https://www.gstatic.com/recaptcha/",
    "https://www.google.com/recaptcha/",
    "https://service.pdok.nl"
  ],
  "whitelistStyles": [
    "https://fonts.googleapis.com/css"
  ],
  "whitelistImages": [
    "https://service.pdok.nl",
    "https://geodata.nationaalgeoregister.nl",
    "https://c1-powerpoint-15.cdn.office.net",
    "https://c1-excel-15.cdn.office.net",
    "https://c1-word-view-15.cdn.office.net"
  ],
  "whitelistFrames": [
    "https://*.bus.koppel.app",
    "https://www.google.com/recaptcha/",
    "https://login.live.com/",
    "https://*.officeapps.live.com/"
  ],
  "whitelistConnect": [
    "https://service.pdok.nl",
    "https://geodata.nationaalgeoregister.nl",
    "https://api.pdok.nl"
  ]
}