<svg xmlns="http://www.w3.org/2000/svg" viewBox="0 0 722.9 566.9">
    <defs>
        <style>
            .a{fill:#fd0;}.b{fill:#fff;}.c{fill:#e40046;}
        </style>
    </defs>
    <title>
        Gemeente Schiedam logo
    </title>
    <path d="M237.7,188.8s-49-8.8-113.6-8.8c-63.7,0-113.6,8.8-113.6,8.8v180a113.6,113.6,0,0,0,227.2,0Z" class="a"/>
    <path d="M227,280v-8.6l-6-7.4h-7.3l7.5-6.2V246.7l5.6-4.7H202.5l-.1,6.2-8.8,7.4v-7.1l-3.7-4.3-7.9,6.6,2.6,3.1v18.3l-5.7,4.8v21.5l37,44.1v17.9l-6.1,5.1h-7.2l-50.9-60.7-.3-13.9,25.2-21.1L167,258.4V211.9h-7.7V194H156l-8.5,7.1h-7.1l-3.4-4H119.4l-4.6,3.9h-5.9l-7,5.8,2.2,2.7v9.7h0l3.1,3.7,4.4-3.7H124V225H97.1v-7.1h-5l-6,5,7.4,8.8h30.7v5.8H111.4l-3.7-4.4-5.2,4.4v7.9h18.1l-12.3,10.3h-13L67.4,222.5l8.3-7v-7.6L68.3,199,56.4,209.3l-7.8-9.2-9.9,8.2L35.5,211v19l47.1,56.3L70,296.8,50.2,313.5l-7.1-8.4L27.4,318.2v14.3L37.1,344l12.8-10.7,9.2,10.9L73,332.7l15.9-13.5,12.6-10.6,18.9,22.5-12.6,10.6L78,366.8v16.7H58L38,400.3V413H49.5v-6.7h4.3l5.6,6.7h9l8-6.7h27.2V383.5h22.9V364.2l18.9,22.5V406l9.4,11.2-11.1,9.2h-9.8l-4.9,4.2v13.9h14l10.4,12.3,14.7-12.3h15.1V431.7l3.2-2.7-.1-38.2,3.2-2.7-.1-25.8,9.8,11.7h13.9l10.7-8.9V339.7l-37-44.1V280.8l12-9.8h7l6.8,8.1v13.1ZM124.1,213.1l-4.8-5.7h11.6Z"/>
    <rect width="32.9" height="29.4" x="19.06" y="215.31" class="b" transform="translate(-139.55 76.64) rotate(-40)"/>
    <rect width="32.9" height="29.4" x="37.88" y="237.75" class="c" transform="translate(-149.57 93.99) rotate(-40)"/>
    <rect width="32.9" height="29.4" x="56.76" y="260.27" class="b" transform="translate(-159.63 111.4) rotate(-40)"/>
    <rect width="32.9" height="29.4" x="75.64" y="282.79" class="c" transform="translate(-169.68 128.8) rotate(-40)"/>
    <rect width="32.9" height="29.4" x="94.46" y="305.23" class="b" transform="translate(-179.71 146.15) rotate(-40)"/>
    <rect width="32.9" height="29.4" x="113.34" y="327.75" class="c" transform="translate(-189.76 163.56) rotate(-40)"/>
    <rect width="32.9" height="29.4" x="132.23" y="350.27" class="b" transform="translate(-199.82 180.97) rotate(-40)"/>
    <rect width="32.9" height="29.4" x="169.93" y="395.23" class="b" transform="translate(-219.9 215.72) rotate(-40)"/>
    <rect width="32.9" height="29.4" x="151.11" y="372.78" class="c" transform="translate(-209.88 198.37) rotate(-40)"/>
    <path fill="white" d="M344.1,302.4a12.79,12.79,0,0,0,1.9-7.1,14.47,14.47,0,0,0-1.7-7.2,12.67,12.67,0,0,0-5.1-4.6,28.44,28.44,0,0,0-7.6-2.3,70.41,70.41,0,0,0-9.8-.7h-.3a22.85,22.85,0,0,1-5.4-.7c-2.4-.7-3.3-2.2-3-3.3a3,3,0,0,1,1.3-1.7c.8.2,1.7.3,2.8.5a19.4,19.4,0,0,0,3.4.2,26.63,26.63,0,0,0,7.5-1,22.78,22.78,0,0,0,6.5-3,13.87,13.87,0,0,0,4.5-5.1,14.74,14.74,0,0,0,1.7-7.2,13.37,13.37,0,0,0-1-5.2,12.88,12.88,0,0,0-2.7-4.5l6.4-6.8-6.7-5.5-7.1,7.4a32.59,32.59,0,0,0-4.5-1.4,22.83,22.83,0,0,0-4.8-.5,26.63,26.63,0,0,0-7.5,1,20,20,0,0,0-6.4,3.1,15.65,15.65,0,0,0-4.5,5.1,14.74,14.74,0,0,0-1.7,7.2,13.82,13.82,0,0,0,1.6,6.7,16.64,16.64,0,0,0,4.3,5.2,12.78,12.78,0,0,0-3.7,3.2,7.36,7.36,0,0,0-1.4,4.3,8.2,8.2,0,0,0,1,3.7,16,16,0,0,0,2.8,3.5l-.4.3a12.52,12.52,0,0,0-4.9,10.3c0,5.2,2.2,9.1,6.7,11.5,4.1,2.3,9.8,3.4,17,3.4a32,32,0,0,0,8.3-1,21.62,21.62,0,0,0,7.1-2.9A12.34,12.34,0,0,0,344.1,302.4Zm-29.7-48.6a9.22,9.22,0,0,1,6.3-2.1,9.67,9.67,0,0,1,6.4,2.1,6.89,6.89,0,0,1,2.5,5.6,6.38,6.38,0,0,1-2.5,5.4,10.14,10.14,0,0,1-6.4,1.9,9.66,9.66,0,0,1-6.3-1.9,6.57,6.57,0,0,1-2.4-5.4A7,7,0,0,1,314.4,253.8ZM333,300.3a19.15,19.15,0,0,1-9.3,2,36.36,36.36,0,0,1-6-.5,18.3,18.3,0,0,1-4.5-1.4,8,8,0,0,1-2.6-2.1,4.46,4.46,0,0,1-.8-2.6,6.13,6.13,0,0,1,1.1-3.8,8.68,8.68,0,0,1,2.7-2.3c1.7.2,4.3.4,8,.5h0a72.51,72.51,0,0,1,7.7.5,17.94,17.94,0,0,1,4.5,1.2,3.47,3.47,0,0,1,1.8,1.5,5.68,5.68,0,0,1,.5,2.4A5.56,5.56,0,0,1,333,300.3Z"/>
    <path fill="white" d="M390,278.3l-8.8-5.4c-1.8,2.5-3.6,4.2-5.3,4.9a13.19,13.19,0,0,1-5.7,1.1,10.33,10.33,0,0,1-6.6-2.4c-2-1.6-3.1-4.3-3.4-8h29.9c-.1-8.7-2-15.1-5.8-19.4a18.53,18.53,0,0,0-14.7-6.4,22.51,22.51,0,0,0-8.2,1.5A19.59,19.59,0,0,0,350,255.8a26.8,26.8,0,0,0-1.7,9.8,28.67,28.67,0,0,0,1.7,10.2,19.6,19.6,0,0,0,4.7,7.1,18.87,18.87,0,0,0,6.9,4.2,25.37,25.37,0,0,0,8.3,1.4,27.11,27.11,0,0,0,11.5-2.3C384.6,284.8,387.5,282.1,390,278.3Zm-30.1-17.9a11.3,11.3,0,0,1,1.2-3.8,10.91,10.91,0,0,1,2.3-2.9,10,10,0,0,1,2.9-1.8,9.6,9.6,0,0,1,3.3-.6,9.35,9.35,0,0,1,5.9,2.3,10.22,10.22,0,0,1,3.2,6.9l.1.6h-19Z"/>
    <path fill="white" d="M438.7,287.6V261.2a26.61,26.61,0,0,0-.2-3,15,15,0,0,0-.4-2.4c.4-.3.9-.6,1.5-1a15.05,15.05,0,0,1,2.2-1.1,20,20,0,0,1,2.6-1,8.42,8.42,0,0,1,2.7-.4c3.1,0,5.2.9,6.4,2.7a13.18,13.18,0,0,1,1.7,7v25.7H467V261.5a31.22,31.22,0,0,0-.9-7.9,14,14,0,0,0-3-5.8,12.94,12.94,0,0,0-5.6-3.6,28.52,28.52,0,0,0-16.7-.1,35.94,35.94,0,0,0-6.9,3,14.82,14.82,0,0,0-6-3.3,24.32,24.32,0,0,0-6.4-1,15.81,15.81,0,0,0-6.3,1.3,17.49,17.49,0,0,0-5.2,3.1l-.5-3.3H398.6v43.7h11.9V256.5a18.79,18.79,0,0,1,4-2.9,10.3,10.3,0,0,1,5.1-1.4,7.24,7.24,0,0,1,3.5.8,5.56,5.56,0,0,1,2.2,2.1,12.52,12.52,0,0,1,1.2,3.1,22.15,22.15,0,0,1,.4,3.8v25.7h11.8Z"/>
    <path fill="white" d="M497.4,288.6a27.11,27.11,0,0,0,11.5-2.3c3.3-1.5,6.1-4.2,8.6-8l-8.8-5.4c-1.8,2.5-3.6,4.2-5.3,4.9a13.19,13.19,0,0,1-5.7,1.1,10.33,10.33,0,0,1-6.6-2.4c-2-1.6-3.1-4.3-3.4-8h29.9c-.1-8.7-2-15.1-5.8-19.4a18.53,18.53,0,0,0-14.7-6.4,22.51,22.51,0,0,0-8.2,1.5,19.59,19.59,0,0,0-11.4,11.6,26.8,26.8,0,0,0-1.7,9.8,28.67,28.67,0,0,0,1.7,10.2,19.6,19.6,0,0,0,4.7,7.1,18.87,18.87,0,0,0,6.9,4.2A21.42,21.42,0,0,0,497.4,288.6Zm-9.9-28.2a11.3,11.3,0,0,1,1.2-3.8,10.91,10.91,0,0,1,2.3-2.9,10,10,0,0,1,2.9-1.8,9.6,9.6,0,0,1,3.3-.6,9.35,9.35,0,0,1,5.9,2.3,10.22,10.22,0,0,1,3.2,6.9l.1.6H487.5Z"/>
    <path fill="white" d="M530,283.1a18.87,18.87,0,0,0,6.9,4.2,25.37,25.37,0,0,0,8.3,1.4,27.11,27.11,0,0,0,11.5-2.3c3.3-1.5,6.1-4.2,8.6-8l-8.8-5.4c-1.8,2.5-3.6,4.2-5.3,4.9a13.19,13.19,0,0,1-5.7,1.1,10.33,10.33,0,0,1-6.6-2.4c-2-1.6-3.1-4.3-3.4-8h29.9c-.1-8.7-2-15.1-5.8-19.4s-8.6-6.4-14.7-6.4a22.51,22.51,0,0,0-8.2,1.5,19.59,19.59,0,0,0-11.4,11.6,26.8,26.8,0,0,0-1.7,9.8,28.67,28.67,0,0,0,1.7,10.2A20,20,0,0,0,530,283.1Zm5.1-22.7a11.3,11.3,0,0,1,1.2-3.8,10.91,10.91,0,0,1,2.3-2.9,10,10,0,0,1,2.9-1.8,9.6,9.6,0,0,1,3.3-.6,9.35,9.35,0,0,1,5.9,2.3,10.22,10.22,0,0,1,3.2,6.9l.1.6H535Z"/>
    <path fill="white" d="M615.1,287.6V261.7a27.69,27.69,0,0,0-1.2-8.7,16.09,16.09,0,0,0-3.4-5.9,13.58,13.58,0,0,0-5.2-3.3,20.48,20.48,0,0,0-6.7-1,22.05,22.05,0,0,0-7.1,1.2,20.17,20.17,0,0,0-6.3,3.4l-.5-3.4H573.9v43.7h11.9v-31a18.89,18.89,0,0,1,4.1-3,10.3,10.3,0,0,1,5.1-1.4,7.48,7.48,0,0,1,6.1,2.7c1.5,1.8,2.2,4.4,2.2,7.7v25h11.8Z"/>
    <path fill="white" d="M646.7,278a7.59,7.59,0,0,1-3.5.9,3.4,3.4,0,0,1-1.9-.8,3.72,3.72,0,0,1-1-2.9V253H651v-9.1H640.4V231.4H628.6v12.5h-6.4V253h6.4v24a12.71,12.71,0,0,0,1,5.4,10,10,0,0,0,2.7,3.6,10.32,10.32,0,0,0,3.9,2,16.66,16.66,0,0,0,4.4.6,20.19,20.19,0,0,0,7-1.2,31.13,31.13,0,0,0,6.3-3.2l-4.3-8.1A11.2,11.2,0,0,1,646.7,278Z"/>
    <path fill="white" d="M663.7,283.1a18.87,18.87,0,0,0,6.9,4.2,25.37,25.37,0,0,0,8.3,1.4,27.11,27.11,0,0,0,11.5-2.3c3.3-1.5,6.1-4.2,8.6-8l-8.8-5.4c-1.8,2.5-3.6,4.2-5.3,4.9a13.19,13.19,0,0,1-5.7,1.1,10.33,10.33,0,0,1-6.6-2.4c-2-1.6-3.1-4.3-3.4-8h29.9c-.1-8.7-2-15.1-5.8-19.4a18.53,18.53,0,0,0-14.7-6.4,22.51,22.51,0,0,0-8.2,1.5A19.59,19.59,0,0,0,659,255.9a26.8,26.8,0,0,0-1.7,9.8,28.67,28.67,0,0,0,1.7,10.2A23,23,0,0,0,663.7,283.1Zm5.2-22.7a11.3,11.3,0,0,1,1.2-3.8,10.91,10.91,0,0,1,2.3-2.9,10,10,0,0,1,2.9-1.8,9.6,9.6,0,0,1,3.3-.6,9.35,9.35,0,0,1,5.9,2.3,10.22,10.22,0,0,1,3.2,6.9l.1.6h-19Z"/>
    <path fill="white" d="M375.8,351.9a24.55,24.55,0,0,0-5.9-4.1,52,52,0,0,0-8.1-3.4,46,46,0,0,1-9.3-4.3,6,6,0,0,1-3.1-5.2,5,5,0,0,1,2.4-4.3c1.6-1.1,3.9-1.6,7-1.6a13.52,13.52,0,0,1,7.7,1.9,18.26,18.26,0,0,1,4.8,4.8l8.8-6.3a29.52,29.52,0,0,0-3.2-4,18.45,18.45,0,0,0-4.3-3.4,22.69,22.69,0,0,0-5.9-2.3,31,31,0,0,0-7.8-.9,31.82,31.82,0,0,0-9.3,1.2,18.52,18.52,0,0,0-6.7,3.5,14.14,14.14,0,0,0-4,5.4,18.59,18.59,0,0,0-.1,13.4,14.91,14.91,0,0,0,3.4,4.9,21.2,21.2,0,0,0,5.4,3.6,67.38,67.38,0,0,0,7,2.9q4.2,1.5,6.9,2.7a18.77,18.77,0,0,1,4.3,2.5,7.72,7.72,0,0,1,2.2,2.7,9,9,0,0,1,.6,3.4,5.41,5.41,0,0,1-2.8,4.8,13.28,13.28,0,0,1-7.4,1.8,17.44,17.44,0,0,1-8-1.8,13.37,13.37,0,0,1-5.6-5.2l-9.3,6.2c4.4,7.4,12.1,11.2,23.1,11.2a32.4,32.4,0,0,0,8.2-1.1,19.71,19.71,0,0,0,7-3.3,17.21,17.21,0,0,0,4.9-5.5,16.07,16.07,0,0,0,1.9-7.8,19.19,19.19,0,0,0-1.2-7.1A17.75,17.75,0,0,0,375.8,351.9Z"/>
    <path fill="white" d="M414,370.2a9.1,9.1,0,0,1-5.6,1.7,8.64,8.64,0,0,1-7.2-3.4c-1.8-2.3-2.8-5.5-2.8-9.7a21.49,21.49,0,0,1,.8-6.1,11.82,11.82,0,0,1,2.1-4.2,9,9,0,0,1,2.9-2.4,8.08,8.08,0,0,1,3.4-.8,8.22,8.22,0,0,1,5.2,1.8,14,14,0,0,1,3.9,6.1l9.3-4.6a19.18,19.18,0,0,0-2.3-4.5,18.36,18.36,0,0,0-3.8-4.1,18.61,18.61,0,0,0-5.4-2.9,20,20,0,0,0-7.1-1.1,22.33,22.33,0,0,0-7.7,1.4,18,18,0,0,0-6.6,4.3,22.23,22.23,0,0,0-4.6,7.3,26.61,26.61,0,0,0-1.7,10.2,24.49,24.49,0,0,0,1.8,9.8,22.55,22.55,0,0,0,4.7,7.1,20.16,20.16,0,0,0,6.8,4.3,21.85,21.85,0,0,0,8,1.5,21.3,21.3,0,0,0,11.1-2.8,19.78,19.78,0,0,0,7.6-8.7l-8.9-4.8A22.49,22.49,0,0,1,414,370.2Z"/>
    <path fill="white" d="M470.7,340.9a13.16,13.16,0,0,0-5.1-3.8,18.94,18.94,0,0,0-7.5-1.4,19.93,19.93,0,0,0-7.3,1.2,21.25,21.25,0,0,0-5.2,2.8V318.8H433.7v61.7h11.9V349.4a30.27,30.27,0,0,1,4.2-2.8,11.11,11.11,0,0,1,5.5-1.5,6.84,6.84,0,0,1,5.1,2.4c1.5,1.6,2.2,4.2,2.2,7.8v25.1h11.9v-26a32.1,32.1,0,0,0-.9-7.8A17.08,17.08,0,0,0,470.7,340.9Z"/>
    <rect fill="white" width="11.8" height="43.7" x="486" y="336.9"/>
    <path fill="white" d="M542.9,342.2c-3.7-4.3-8.6-6.4-14.7-6.4a22.51,22.51,0,0,0-8.2,1.5,19.59,19.59,0,0,0-11.4,11.6,26.8,26.8,0,0,0-1.7,9.8,28.67,28.67,0,0,0,1.7,10.2,19.6,19.6,0,0,0,4.7,7.1,18.87,18.87,0,0,0,6.9,4.2,25.37,25.37,0,0,0,8.3,1.4,27.11,27.11,0,0,0,11.5-2.3c3.3-1.5,6.1-4.2,8.6-8l-8.8-5.4c-1.8,2.5-3.6,4.2-5.3,4.9a13.19,13.19,0,0,1-5.7,1.1,10.33,10.33,0,0,1-6.6-2.4c-2-1.6-3.1-4.3-3.4-8h29.9C548.5,352.9,546.6,346.4,542.9,342.2Zm-6.3,11.9H518.3l.1-.7a11.3,11.3,0,0,1,1.2-3.8,10.91,10.91,0,0,1,2.3-2.9,10,10,0,0,1,2.9-1.8,9.6,9.6,0,0,1,3.3-.6,9.35,9.35,0,0,1,5.9,2.3,10.22,10.22,0,0,1,3.2,6.9l.1.6Z"/>
    <path fill="white" d="M584.2,337a27.68,27.68,0,0,0-7.8-1.3,21.92,21.92,0,0,0-9.6,2,19.59,19.59,0,0,0-6.8,5.2,21.87,21.87,0,0,0-4.1,7.3,26.29,26.29,0,0,0-1.4,8.3,28.22,28.22,0,0,0,1.3,8.7,21.66,21.66,0,0,0,3.8,7.4,19.29,19.29,0,0,0,6.2,5.1,17.63,17.63,0,0,0,8.4,1.9,13.91,13.91,0,0,0,6.3-1.3,16.27,16.27,0,0,0,4.3-3l.5,3.4H596V319H584.2Zm0,31.2a10.06,10.06,0,0,1-7.7,3.8,9.89,9.89,0,0,1-4.7-1.1,10.24,10.24,0,0,1-3.2-3,13.62,13.62,0,0,1-1.9-4.4,22.42,22.42,0,0,1-.6-5.2,15.94,15.94,0,0,1,.7-4.8,14.09,14.09,0,0,1,2.2-4.2,10.62,10.62,0,0,1,3.7-2.9,12.07,12.07,0,0,1,5.2-1.1,17.39,17.39,0,0,1,6.4,1.3v21.6Z"/>
    <path fill="white" d="M638,339.7a13.4,13.4,0,0,0-5.5-3,25.15,25.15,0,0,0-7-1,31.89,31.89,0,0,0-4.2.3,27.8,27.8,0,0,0-4.6,1.1,17.43,17.43,0,0,0-4.5,2.3,16.72,16.72,0,0,0-3.9,3.6l8.1,5.6a13.5,13.5,0,0,1,4.5-3.1,14.14,14.14,0,0,1,3.9-.8,6.21,6.21,0,0,1,4.3,1.6,5.51,5.51,0,0,1,1.8,4.3v1.5c-1.2.1-2.7.3-4.5.4s-3.5.4-5,.7a37.44,37.44,0,0,0-6.2,1.6,19.82,19.82,0,0,0-5.2,2.8,14.38,14.38,0,0,0-3.6,4.2,12.13,12.13,0,0,0-1.4,5.8,12.78,12.78,0,0,0,1.3,5.9,13.35,13.35,0,0,0,3.4,4.4,13.74,13.74,0,0,0,4.9,2.7,18,18,0,0,0,5.7,1,19.26,19.26,0,0,0,6.5-1.1,14.19,14.19,0,0,0,4.9-3.1l.5,3.3h10.9V352.6a19.17,19.17,0,0,0-1.3-7.6A15,15,0,0,0,638,339.7Zm-7,29.4a13.65,13.65,0,0,1-3.7,2.3,11.17,11.17,0,0,1-4.4.9,7.42,7.42,0,0,1-4.8-1.3,4.18,4.18,0,0,1-1.6-3.5,6,6,0,0,1,1.5-3.9c1-1.2,2.8-2,5.3-2.5q1.8-.3,3.9-.6a26.62,26.62,0,0,1,3.9-.3v8.9Z"/>
    <path fill="white" d="M721.9,346.5a14,14,0,0,0-3-5.8,12.94,12.94,0,0,0-5.6-3.6,28.52,28.52,0,0,0-16.7-.1,35.94,35.94,0,0,0-6.9,3,14.82,14.82,0,0,0-6-3.3,24.32,24.32,0,0,0-6.4-1A15.81,15.81,0,0,0,671,337a17.49,17.49,0,0,0-5.2,3.1l-.5-3.3H654.4v43.7h11.9V349.4a18.79,18.79,0,0,1,4-2.9,10.3,10.3,0,0,1,5.1-1.4,7.24,7.24,0,0,1,3.5.8,5.56,5.56,0,0,1,2.2,2.1,12.52,12.52,0,0,1,1.2,3.1,22.15,22.15,0,0,1,.4,3.8v25.7h11.8V354.2a26.61,26.61,0,0,0-.2-3,15,15,0,0,0-.4-2.4c.4-.3.9-.6,1.5-1a15.05,15.05,0,0,1,2.2-1.1,20,20,0,0,1,2.6-1,8.42,8.42,0,0,1,2.7-.4c3.1,0,5.2.9,6.4,2.7a13.18,13.18,0,0,1,1.7,7v25.7h11.8V354.5A31.49,31.49,0,0,0,721.9,346.5Z"/>
    <path fill="white" d="M492,318.5a6.93,6.93,0,0,0-5.3,2,6.16,6.16,0,0,0,0,8.7,6.78,6.78,0,0,0,5.3,2,6.93,6.93,0,0,0,5.3-2,6.38,6.38,0,0,0,1.8-4.4,6.15,6.15,0,0,0-1.8-4.3A6.93,6.93,0,0,0,492,318.5Z"/>
    <rect width="12.8" height="12.8" x="66.75" y="117.19" transform="translate(-65.97 87.92) rotate(-45)"/>
    <rect width="12.8" height="12.8" x="48.62" y="117.22" transform="translate(-71.3 75.11) rotate(-45)"/>
    <rect width="12.8" height="12.8" x="57.67" y="101.33" transform="translate(-57.41 76.86) rotate(-45)"/>
    <rect width="12.8" height="12.8" x="168.5" y="117.22" transform="translate(-36.19 159.88) rotate(-45)"/>
    <rect width="12.8" height="12.8" x="186.69" y="117.19" transform="translate(-30.84 172.73) rotate(-45)"/>
    <rect width="12.8" height="12.8" x="177.58" y="101.31" transform="translate(-22.28 161.64) rotate(-45)"/>
    <path fill="white" d="M235.1,86.1l-15.6,17.8,6.7,10.6-13.4.2v31.7h-6L184,123.6l-22.9,22.9-30-25.1V108.6l15.8,13.3,15.9-13.4v-18L150.6,80.3,139,83.8h0l3.6-13.3L130.2,60H117.9L105.4,70.5,109,83.8h0L97.4,80.3,85.2,90.5v18l15.9,13.4,15.8-13.3v12.8l-30,25.1L64,123.6,41.1,146.5h-6V114.8l-13.4-.2L28.4,104,13,86.1,0,96.9l24.4,60.9,4.9,17.6s59.7-5.3,94.8-5.4c35.1.1,94.8,5.4,94.8,5.4l4.9-17.6,24.4-60.9Z" class="a"/>
    <path fill="white" d="M10.4,225.7l3,3.5,25.2-21.1-17.7-21c-6.8,1-10.5,1.6-10.5,1.6Z" class="c"/>
    <path fill="white" d="M221.9,426.6h0l-13.5-16-25.2,21.1,17.5,20.9h0A112.87,112.87,0,0,0,221.9,426.6Z" class="c"/>
</svg>