<svg xmlns="http://www.w3.org/2000/svg" width="138.392" height="88" viewBox="0 0 138.392 88" aria-labelledby="site-logo-title site-logo-desc" class="logo__svg" role="img" focusable="false">
        <title id="site-logo-title">Gemeente Amersfoort</title>
        <desc id="site-logo-desc">Logo dat naar de hoofdpagina leidt</desc>
        <path class="logo__svg--path logo__svg--emblem-path" fill="#dadada" d="M46.316,28.4,46.27,37.01a3.185,3.185,0,0,1,1.7.158,3.8,3.8,0,0,1,1.3.97c.983-.4,3-.087,6.995-2.847A10.839,10.839,0,0,0,59.452,32.3a7.4,7.4,0,0,1-7.62-.7c1.845-.178,1.69-1.278,1.331-1.774-.618-.852-3.923-2.061-3.923-2.061A14.737,14.737,0,0,1,46.316,28.4ZM26.987,67.074a.768.768,0,0,1-.139.164c-3.463-3.463-6.187-3.717-11.776-4.187L38.277,22.859,15.222,9.547l-.37-.979-.714-.581a4.395,4.395,0,0,1-.43.686l-2.321-1.34a4.231,4.231,0,0,1-.156-.474c-.279-1.05-.141-2.274.779-2.35.459-.038,1.02.474,1.412.793l.4-.7c-.384-.318-.983-.748-1.12-1.265-.278-1.05.624-1.652,1.544-1.729a2.2,2.2,0,0,1,2.373,1.4A1.985,1.985,0,0,1,16.2,4.4l.74.6c.212-.363.48-.941.936-.979.919-.077,1.685,1.072,1.963,2.122s.141,2.273-.779,2.349c-.457.039-1.016-.473-1.407-.789l-.389.682.749,1.955a26.552,26.552,0,0,1,2.77-.09h4.624V7.322L24.76,6.67c-.358.36-.854.932-1.4.932-1.092,0-1.629-1.234-1.628-2.326s.536-2.325,1.628-2.325c.546,0,1.04.57,1.4.927l.682-.682c-.349-.356-.912-.844-.912-1.382C24.525.722,25.758.185,26.85.185l.164.005.164-.005C28.27.185,29.5.722,29.5,1.814c0,.538-.563,1.026-.911,1.382l.681.682c.358-.357.851-.927,1.4-.927,1.092,0,1.629,1.233,1.629,2.325S31.762,7.6,30.67,7.6c-.548,0-1.044-.572-1.4-.932l-.652.652V10.25H33.24a26.549,26.549,0,0,1,2.77.09l.749-1.955L36.371,7.7c-.392.316-.951.828-1.408.789-.92-.076-1.058-1.3-.779-2.349s1.044-2.2,1.964-2.122c.455.038.723.616.935.979l.741-.6a1.975,1.975,0,0,1-.414-1.389,2.2,2.2,0,0,1,2.372-1.4c.92.077,1.822.679,1.544,1.729-.137.517-.736.947-1.12,1.265l.4.7c.392-.319.953-.831,1.413-.793.919.076,1.057,1.3.778,2.35s-1.044,2.2-1.963,2.122c-.462-.039-.734-.623-.943-.994l-.715.581L38.4,10.617a24.512,24.512,0,0,1,5.933,1.64l1.515-2.065-.171-.53a4.955,4.955,0,0,1-1.828.614c-.77-.06-.6-1.011-.112-1.827S45.154,6.741,45.923,6.8c.381.03.475.479.569.761l.777-.468a1.243,1.243,0,0,1-.026-1.08,3.016,3.016,0,0,1,2.393-1.162,5.4,5.4,0,0,1,1.582.243l-4.924,8.3-.024,7.72a9.495,9.495,0,0,1,1.643.274c1.145.324,2.41,1.724,3.071,2.235A6.981,6.981,0,0,0,54.5,25.651c1.706.259,3.231-1.232,5.23-1.066,0,0-.685.95.141,1.4.458.249,2.439-.072,3.565-.441a5.3,5.3,0,0,0,2.911-1.825c.221-.394.007-1.118-.99-1.3a9.677,9.677,0,0,0-2.083-.091c-.165-.01-1-.091-1.177-.815A6.3,6.3,0,0,1,62,19.792a7.4,7.4,0,0,0,1.448.362,9.365,9.365,0,0,0,2.264-.272,12.2,12.2,0,0,0-4.3-.461,12.654,12.654,0,0,1-4.324.488,1.991,1.991,0,0,1-.929-3.576,6.486,6.486,0,0,0,2.466,1.912,8.949,8.949,0,0,0,3.54.083,10.177,10.177,0,0,1,1.637-.018c.544.022,1.12.033,1.7.069.478.03.958.054,1.437.076,0,0-.857-2.023-1.158-1.986a3.674,3.674,0,0,0-1.146.381c-.071.029-1.272.527-1.888.7s-.863.026-.887-.039a8.648,8.648,0,0,1-.5-1.614c0-.091-.7-.7-.7-1.427s2.122-1.294,2.122-1.294a6.241,6.241,0,0,0,1.246-.487,1.5,1.5,0,0,1,.954-1.44c.475-.206,2.81-1.013,2.81-1.013a6.249,6.249,0,0,1,3.274-2.474A9.478,9.478,0,0,1,75.7,7.275a5.157,5.157,0,0,0-1.568,2.477A5.675,5.675,0,0,1,80.5,10.943a4.317,4.317,0,0,0-3,1.562,5.373,5.373,0,0,1,2.462.751,4.09,4.09,0,0,1,1.683,2.884,7.422,7.422,0,0,0-3.443-.122A4.263,4.263,0,0,1,80.9,19.843a7.219,7.219,0,0,0-3.973-.252,4.447,4.447,0,0,1,2.891,4.127,5.141,5.141,0,0,0-3.41-.335,3.613,3.613,0,0,1,1.368,2.978A2.535,2.535,0,0,0,75.916,26c-.236,3.061-1.565,7.9.384,13.373,1.852,2.613,1.565,4.35,2.019,4.712s3.488,2.229,5.317,2.317a4.074,4.074,0,0,0,4.039-2.856,12.012,12.012,0,0,0,.274-3.713,9.165,9.165,0,0,1-.881-.428A6.389,6.389,0,0,1,83.51,33.22c0-.011-.009.526.936.939s2.189.177,3.017,1.36a25.638,25.638,0,0,0-2.306-5.028,11.265,11.265,0,0,1-1.444-7.4,25.884,25.884,0,0,1,2.407-6.306c.607-1.159.814-2.711-.259-3.57-.984-.787-2.281-.068-2.462-.068a3.838,3.838,0,0,1,4.519-1.353,2.835,2.835,0,0,1,1.067,4.51s3.106-1.36,3.928.8a3.2,3.2,0,0,1-.065,3.16s-.108-2.572-3.016-2.106c-1.582.254-3.017,1.713-3.8,3.868a9.664,9.664,0,0,0,.292,7.111c1.221,2.586,2.025,2.9,2.263,3.906a3.163,3.163,0,0,0,.629-2.331,4,4,0,0,1,1.736,2.272c.3.945,1.064,3.489-.59,4.909l-.889.709a11,11,0,0,1,.314,2.078c-.156,5.272-2.919,7.749-6.062,7.768A12.711,12.711,0,0,1,78.2,46.529c1.315,1.025,1.374,5.269,1.374,5.269a4.87,4.87,0,0,1,2.562.96c1,1.149,1.2,1.9,1.965,2.032.843-.1,1.047-.624,1.579-1.581a6.766,6.766,0,0,1,.656,2.075c-.043.669-.527,1.089-1.237,1.344a6.288,6.288,0,0,0,.044,2.385c.3.818,2.062,2.19,1.28,3.139-1.284,1.057-2.6-.076-4.3.142-1.568.138-1.961,1.143-3.594.762a4.138,4.138,0,0,0-3.243-.11,2.719,2.719,0,0,1,1.251-1.429,5.313,5.313,0,0,0-2.651.536,2.675,2.675,0,0,1,1.34-1.46,3.073,3.073,0,0,0-2.084.208c.863-1.756,2.066-1.883,3.655-1.835,1.527.019,2.44,1.422,4.4.714.3-.117.588-.492.232-1.261a4.106,4.106,0,0,0-.808-1.193,6.746,6.746,0,0,1-3.345-1.263c-2.716-2.616-2.8-.03-2.8-.03-3.557-3.152-2.5-5.412-4.985-6.661-.587.872-1.828,2.641-3.713,3.06.379-1.232-.34-1.766-.85-1.6a2.987,2.987,0,0,0-1.616,1.03c-.453.554-.117,1.158-.788,3a3.126,3.126,0,0,1,.489,2.925c-.907-1.361-1.4-.374-1.563-.039a2.587,2.587,0,0,0-.251,1.11c.041,1.154,1.237,1.938.98,3.134-1.043,1.261-4.482.107-5.755.107s-2.512,1.1-3.725.948c-.665.015-1.806-.659-2.87.05a2.765,2.765,0,0,1,1.539-1.586,4.384,4.384,0,0,0-2.3.351c.355-1.014.951-1.189,1.671-1.508a6.832,6.832,0,0,0-2.008.09,3.305,3.305,0,0,1,3.344-1.795c1.185.125,3.135,1.547,4.992.311.817-.818.119-3.985.119-3.985a1.451,1.451,0,0,1-1.026.12c-.841-.252-.852-1.543-.852-1.543s1.7.584,1.333-1.45c-.547-2.477-.738-3.339,1.46-4.686a1.484,1.484,0,0,1-.618-1.048,2.185,2.185,0,0,1,.589-1.7c.992,1.8,2.813.362,4.21-.36a25.411,25.411,0,0,1,4.345-1.832.77.77,0,0,0,.339-1.3c-1.128-1.129-2.764-1.129-4.794-4.2a8.263,8.263,0,0,1-.494,2.933c-.364.968-2,1.815-2,1.815a1.311,1.311,0,0,0,.213-.7,1.01,1.01,0,0,0-.787-1.151c-.663-.221-2.22.9-3.061,1.351a30.952,30.952,0,0,1-3.8,1.608c-1.47.528-5.841.446-5.894.411L46.316,55.14s.22,7.264-6.281,7.82c-6.331.542-9.176.6-12.855,4.278C27.125,67.182,27.015,67.128,26.987,67.074Z"></path>
        <path class="logo__svg--path logo__svg--text-path" fill="#1d1d1b" d="M49.679,43.184H46.343l1.313-6.848c.222-1.112.044-1.534-.445-1.534-1.023,0-2.89,2.579-3.4,5.358l-.557,3.024H39.94l1.312-6.848c.223-1.112.044-1.534-.445-1.534-1.044,0-2.89,2.579-3.4,5.358l-.556,3.024H33.515L34.627,37.4c.267-1.356.733-3.935.933-5.269h3.224a14.786,14.786,0,0,1-.844,2.823h.044c1.022-1.712,2.357-3.09,4.313-3.09a2.044,2.044,0,0,1,2.268,2.179,3.575,3.575,0,0,1-.2,1l.022.021c1.023-1.845,2.4-3.2,4.358-3.2,2.179,0,2.8,1.557,2.4,3.624Zm7.514-4.269a5.273,5.273,0,0,0-.022.578c0,.956.378,1.289,1.778,1.289a9.144,9.144,0,0,0,3.269-.666v2.578a13.21,13.21,0,0,1-4.336.734c-3,0-4.046-1.444-4.046-3.846,0-4.847,3.091-7.692,6.358-7.692,3.024,0,3.8,1.489,3.8,2.823C64,37.536,61.284,38.8,57.193,38.915Zm2.646-4.536c-1.222,0-1.979,1.18-2.312,2.357,2.023-.045,3.223-.489,3.223-1.578C60.75,34.668,60.417,34.379,59.839,34.379Zm13.762.779c-1.38-.49-3.246,1.533-4,5.691l-.424,2.335H65.841L66.953,37.4c.267-1.356.733-3.935.933-5.269h3.2a20.7,20.7,0,0,1-.822,2.846h.044c1.111-2.112,2.246-3.335,4-3.09Zm8.537-.578a4.75,4.75,0,0,0-1.356-.2c-.956,0-1.4.356-1.4.911,0,1.091,2.579,1.869,2.579,4.247,0,1.869-1.624,3.891-5.247,3.891a9.985,9.985,0,0,1-1.956-.178l.577-2.8a5.122,5.122,0,0,0,1.624.312c.933,0,1.466-.334,1.466-.912,0-1.289-2.511-1.646-2.511-4.224,0-2.112,1.622-3.735,4.98-3.735a12.082,12.082,0,0,1,1.868.133Zm11.694-4.914a5.384,5.384,0,0,0-1.177-.178c-1.091,0-1.557.489-1.825,1.935l-.132.711h2.2l-.51,2.6H90.165l-1.58,8.528c-.006-.014-3.3.011-3.3,0l1.569-8.528H85.184l.533-2.6h1.645l.157-.845c.51-2.912,2-4.536,5.291-4.536a7.749,7.749,0,0,1,1.756.178Zm4.383,13.762c-3.291,0-4.492-1.511-4.492-4,0-4.758,3.29-7.536,6.825-7.536,3.29,0,4.469,1.711,4.469,4.068C105.017,40.494,101.771,43.428,98.215,43.428Zm1.8-8.626c-1.824,0-2.8,2.313-2.8,4.113,0,.934.357,1.579,1.423,1.579,1.823,0,2.868-2.134,2.868-4.113C101.505,35.357,101.106,34.8,100.016,34.8Zm11.737,8.626c-3.29,0-4.491-1.511-4.491-4,0-4.758,3.291-7.536,6.826-7.536,3.292,0,4.469,1.711,4.469,4.068C118.557,40.494,115.311,43.428,111.753,43.428Zm1.8-8.626c-1.823,0-2.8,2.313-2.8,4.113,0,.934.356,1.579,1.424,1.579,1.823,0,2.868-2.134,2.868-4.113C115.045,35.357,114.644,34.8,113.555,34.8Zm14.785.356c-1.378-.49-3.246,1.533-4,5.691l-.423,2.335h-3.334l1.11-5.781c.268-1.356.734-3.935.935-5.269h3.2a20.557,20.557,0,0,1-.822,2.846h.045c1.111-2.112,2.245-3.335,4-3.09Zm9.541-.423h-2.335l-.846,4.492c-.2,1.066-.021,1.379.757,1.379a5.384,5.384,0,0,0,1.29-.157l-.356,2.668a10.574,10.574,0,0,1-2.4.311c-2.445,0-3.179-1.155-2.667-3.912l.889-4.781h-1.646l.535-2.6h1.622l.623-3.268,3.446-.668-.755,3.936h2.356ZM26.558,43.207H12.706L8.485,50.318h-4.9L20.028,20.677h4.763l3.668,19.234ZM21.441,26.415c-.558,1.327-6.677,12.741-6.677,12.741h8.423Z"></path>
        <polygon class="logo__svg--path logo__svg--emblem-accent-path" fill="#e30613" points="0 0 0 1.368 37.52 23.032 0.009 88 1.38 88 39.139 22.597 0 0"></polygon>
      </svg>