<?xml version="1.0" encoding="utf-8"?>
<!-- Generator: Adobe Illustrator 15.1.0, SVG Export Plug-In  -->
<!DOCTYPE svg PUBLIC "-//W3C//DTD SVG 1.1//EN" "http://www.w3.org/Graphics/SVG/1.1/DTD/svg11.dtd" [
	<!ENTITY ns_flows "http://ns.adobe.com/Flows/1.0/">
]>
<svg version="1.1"
	 xmlns="http://www.w3.org/2000/svg" xmlns:xlink="http://www.w3.org/1999/xlink" xmlns:a="http://ns.adobe.com/AdobeSVGViewerExtensions/3.0/"
	 x="0px" y="0px" width="91px" height="107px" viewBox="0 0 91 107" overflow="visible" enable-background="new 0 0 91 107"
	 xml:space="preserve">
<defs>
</defs>
<rect fill="#0E3E63" width="91" height="107"/>
<path fill="#FFFFFF" d="M78.9,71.4c0,4.5-1.9,8.199-5.7,11L62.7,90.3H51v-13c0-1.5-0.6-2.8-1.7-3.8c-1.1-1.1-2.5-1.6-4-1.6
	s-2.9,0.5-4.1,1.6c-1.1,1.1-1.7,2.3-1.7,3.8v13H27.8L17.3,82.4c-3.8-2.9-5.7-6.601-5.7-11V31.9l10.2-14.8l10.3,14.8v27.5H35V31.9
	l10.3-14.8l10.2,14.8v27.5h2.9V31.9l10.3-14.8l10.2,14.8V71.4z M27.9,36.9H16v11.3l11.9,9.1V36.9z M27.9,85.2V62.4l-11.9-9v18
	c0,3.199,1.3,5.8,4,7.899L27.9,85.2z M27.7,32.8l-5.8-8.3l-5.8,8.3H27.7z M58.4,86.3V63.5H32.2v22.8h3.1V77.4c0-2.601,1-4.9,2.9-6.7
	c1.9-1.8,4.3-2.8,7.1-2.8S50.4,68.8,52.4,70.7c2,1.899,2.899,4.1,2.899,6.7V86.3H58.4z M51.3,59.4V36.9h-12v22.5H51.3z M51,32.8
	l-5.8-8.3l-5.8,8.3H51z M74.6,48.2V36.9h-12v20.4L74.6,48.2z M74.6,71.4v-18L62.7,62.5v22.8l7.899-6C73.2,77.2,74.6,74.6,74.6,71.4z
	 M74.4,32.8L68.6,24.5l-5.8,8.3H74.4z"/>
</svg>
