<?xml version="1.0" encoding="utf-8"?>
<!-- Generator: Adobe Illustrator 27.1.1, SVG Export Plug-In . SVG Version: 6.00 Build 0)  -->
<svg version="1.1" id="Layer_1" xmlns="http://www.w3.org/2000/svg" xmlns:xlink="http://www.w3.org/1999/xlink" x="0px" y="0px"
	 viewBox="0 0 494 157.3" style="enable-background:new 0 0 494 157.3;" xml:space="preserve">
<style type="text/css">
	.st0{fill:#0E296E;}
	.st1{fill:#75F495;}
</style>
<g id="Symbols">
	<g id="assets_x2F_logo">
		<g id="Logo" transform="translate(37.560000, 37.940000)">
			<g id="Tekstbeeld" transform="translate(0.000000, 24.202601)">
				<polygon id="Path" class="st0" points="-37.6,-7.3 -24.4,-7.3 -24.4,94.4 -37.6,94.4 				"/>
				<path id="Shape" class="st0" d="M66,62.5H7.1C8.7,75.2,19,83.7,33.4,83.7c8.5,0,15.6-2.9,21-8.8l7.3,8.5
					C55,91.1,45,95.2,33,95.2c-23.4,0-39-15.5-39-37.1c0-21.5,15.5-37,36.4-37s35.9,15.1,35.9,37.4C66.3,59.6,66.1,61.2,66,62.5z
					 M7.1,53h46.6c-1.4-12.2-10.5-20.8-23.3-20.8C17.8,32.2,8.5,40.7,7.1,53z"/>
				<polygon id="Path_00000106105517688386375590000008984157931583730355_" class="st0" points="128.7,94.4 107.8,66.6 86.5,94.4 
					71.9,94.4 100.5,57.2 73.3,21.8 87.9,21.8 107.9,47.9 127.8,21.8 142.2,21.8 114.8,57.2 143.7,94.4 				"/>
				<path id="Path_00000018944566279536803300000003108610927953152388_" class="st0" d="M148.9,58.1c0-21.6,16-37,38.4-37
					c13,0,23.9,5.3,29.6,15.5l-10,6.4c-4.7-7.1-11.8-10.4-19.7-10.4c-14.2,0-24.9,10-24.9,25.5c0,15.7,10.7,25.6,24.9,25.6
					c7.9,0,15.1-3.3,19.7-10.4l10,6.3c-5.8,10.1-16.6,15.6-29.6,15.6C164.9,95.2,148.9,79.7,148.9,58.1z"/>
				<path id="Shape_00000127031322397224372950000008021741503920475272_" class="st0" d="M298.1,62.5h-58.9
					c1.6,12.7,11.9,21.2,26.3,21.2c8.5,0,15.6-2.9,21-8.8l7.3,8.5c-6.6,7.7-16.6,11.8-28.6,11.8c-23.4,0-39-15.5-39-37.1
					c0-21.5,15.5-37,36.4-37c21,0,35.9,15.1,35.9,37.4C298.3,59.6,298.2,61.2,298.1,62.5z M239.1,53h46.6
					c-1.4-12.2-10.6-20.8-23.3-20.8C249.8,32.2,240.5,40.7,239.1,53z"/>
				<path id="Path_00000031907294809579160340000006686230014966201482_" class="st0" d="M307.4,86.7l5.5-10.4
					c6.2,4.4,16,7.5,25.5,7.5c12.2,0,17.3-3.7,17.3-9.9c0-16.3-45.9-2.2-45.9-31.1c0-13,11.6-21.8,30.3-21.8
					c9.5,0,20.1,2.5,26.4,6.6l-5.6,10.4c-6.6-4.2-13.8-5.8-21-5.8c-11.5,0-17.1,4.2-17.1,10c0,17.1,46,3.2,46,31.4
					c0,13.2-12.1,21.5-31.4,21.5C325.3,95.2,313.4,91.5,307.4,86.7z"/>
			</g>
			<g id="Beeldmerk" transform="translate(153.832566, 0.000000)">
				<circle id="Oval" class="st1" cx="246.4" cy="-28.6" r="9.4"/>
				<circle id="Oval_00000115473406811550532280000014496310739791336359_" class="st1" cx="246.4" cy="13.6" r="18.7"/>
				<circle id="Oval_00000061455012656380921160000012994591782293411763_" class="st1" cx="162" cy="13.6" r="4.7"/>
				<polygon id="Rectangle" class="st1" points="198.6,-28.6 204.2,-34.2 209.8,-28.6 204.2,-23 				"/>
				<polygon id="Path_00000038401202405153338830000002381807814384060588_" class="st1" points="198.6,23.2 209.7,23.2 215.2,13.6 
					209.7,4 198.6,4 193.1,13.6 				"/>
				<polygon id="Rectangle_00000139974138896656593720000006892061544548065212_" class="st1" points="236.5,55.8 246.4,45.9 
					256.2,55.8 246.4,65.6 				"/>
				<polygon id="Rectangle_00000049200995755225260400000017325648552723187105_" class="st1" points="274.5,13.6 288.5,-0.5 
					302.6,13.6 288.5,27.7 				"/>
				<circle id="Oval_00000099656372839776242610000016435914905915818169_" class="st1" cx="288.5" cy="55.8" r="5.6"/>
				<polygon id="Path_00000108268862907542939730000014070972406400137361_" class="st1" points="243.6,102.8 249.2,102.8 252,97.9 
					249.2,93.1 243.6,93.1 240.8,97.9 				"/>
			</g>
		</g>
	</g>
</g>
</svg>
