<svg version="1.1" id="Layer_1" xmlns="http://www.w3.org/2000/svg" xmlns:xlink="http://www.w3.org/1999/xlink" x="0px" y="0px" viewBox="0 0 1704.4 244.9" style="enable-background:new 0 0 1704.4 244.9;" xml:space="preserve">
                    <style type="text/css">
                        .st0{fill:#101111;}
                    </style>
                    <g>
                        <path id="Path_11338" class="st0" d="M541.4,57.3H494l-42,49.8V25.5h-40.6v168.6H452v-43.5l7.8-8.8l35.7,52.3h47.9l-53.3-77.2
                            L541.4,57.3z M747.6,57.3l-26.9,95.3l-26.9-95.3h-43l47.9,136.8l-16.6,50.8h44.5L764.7,132l25.9-74.8L747.6,57.3L747.6,57.3z
                             M618.1,113l-23.9-4.9c-5.9-1.5-9.8-2.9-12.2-4.9c-1.9-1.7-3-4.2-2.9-6.8c0-3.4,1.5-5.9,4.9-7.8c3.4-2.4,8.3-3.4,13.7-3.4
                            c5.9,0,10.8,1.5,14.2,4.4c3.1,2.5,5.4,5.9,6.4,9.8l0.5,1.5l37.1-2.4l-0.5-2c-1.3-12.1-7.7-23.1-17.6-30.3
                            c-9.8-7.3-23.5-11.2-40.6-11.2s-31.3,3.9-42,11.2C544.3,73.9,539,84.6,539,97.8c0,21,13.2,34.7,40.1,40.1l23,4.4
                            c10.3,2,15.6,5.9,15.6,11.2c0,3.4-2,5.9-5.4,8.3s-8.8,3.4-14.7,3.4c-6.4,0-11.2-1.5-15.1-3.9c-3.9-2.5-6.6-6.6-7.3-11.2l-0.5-1.5
                            l-40.1,2l0.5,2c2,13.2,8.3,23.9,19.1,31.3s25.4,11.2,43,11.2c11.7,0,22-2,31.3-5.9s16.6-9.3,21.5-16.1c5.4-6.8,7.8-15.1,7.8-23.9
                            C658.2,131.1,644.5,118.4,618.1,113z M241.4,60.2c-9.1-3.2-18.7-4.8-28.3-4.9c-16.1,0-29.8,3.9-40.1,11.2
                            c-10.1,7-17.1,17.7-19.5,29.8l-0.5,2l37.6,2.9l0.5-1.5c1.1-4.1,3.7-7.6,7.3-9.8c3.4-2.4,8.3-3.9,14.7-3.9c5.9,0,10.3,1.5,13.2,3.9
                            s4.4,6.4,4.4,11.2v0.5c0,2-0.5,5.4-5.9,6.4c-4.9,1.5-13.2,2.4-24.4,3.4c-8.8,1-17.1,2.4-24.9,5.4c-7.4,2.6-14,7.2-19.1,13.2
                            c-4.9,5.9-7.3,14.2-7.3,24.4c0,13.7,4.4,23.9,13.2,31.3c8.8,6.8,19.5,10.3,32.7,10.3c10.3,0,18.6-2,25.4-6.4
                            c5.4-2.9,9.3-7.3,12.7-11.7v15.6h38.6v-91.4c0-10.8-2.9-20-8.3-26.9C257.4,68.5,249.9,63.3,241.4,60.2z M231.1,144.3
                            c0.1,6.2-2.6,12.1-7.3,16.1c-4.9,4.4-11.2,6.4-18.6,6.4c-5.4,0-9.8-1-12.7-3.4c-3.4-2.4-4.9-5.4-4.9-9.8s1.5-7.8,4.9-10.3
                            c4.5-2.7,9.5-4.6,14.7-5.4c2.9-0.5,5.9-1,9.3-1.5c3.3-0.4,6.6-1,9.8-2l4.4-1.5v11.2L231.1,144.3z M370.9,60.2
                            c-9.1-3.2-18.7-4.8-28.3-4.9c-16.1,0-29.8,3.9-40.1,11.2c-10.1,7-17.1,17.7-19.5,29.8l-0.5,2l37.6,2.9l0.5-1.5
                            c1.1-4.1,3.7-7.6,7.3-9.8c3.4-2.4,8.3-3.9,14.7-3.9c5.9,0,10.3,1.5,13.2,3.9s4.4,6.4,4.4,11.2v0.5c0,2-0.5,5.4-5.9,6.4
                            c-4.9,1.5-13.2,2.4-24.4,3.4c-8.8,1-17.1,2.4-24.9,5.4c-7.4,2.6-14,7.2-19.1,13.2c-4.9,5.9-7.3,14.2-7.3,24.4
                            c0,13.7,4.4,23.9,13.2,31.3c8.8,6.8,19.5,10.3,32.7,10.3c10.3,0,18.6-2,25.4-6.4c5.4-2.9,9.3-7.3,12.7-11.7v15.6h38.6v-91.4
                            c0-10.8-2.9-20-8.3-26.9C386.9,68.5,379.4,63.3,370.9,60.2z M360.6,144.3c0.1,6.2-2.6,12.1-7.3,16.1c-4.9,4.4-11.2,6.4-18.6,6.4
                            c-5.4,0-9.8-1-12.7-3.4c-3.4-2.4-4.9-5.4-4.9-9.8s1.5-7.8,4.9-10.3c4.5-2.7,9.5-4.6,14.7-5.4c2.9-0.5,5.9-1,9.3-1.5
                            c3.3-0.4,6.6-1,9.8-2l4.4-1.5v11.2L360.6,144.3z M139.3,38.2L139.3,38.2V12.8H0v34.7h87L0.5,168.7L0,169.2v24.4h139.3v-34.2H52.8
                            L139.3,38.2z M1422.4,55.3c-10.3,0-19.1,2.4-26.4,7.3c-6.4,4.4-11.2,9.8-14.2,16.1c-2.5-6.7-6.9-12.5-12.7-16.6
                            c-6.8-4.9-14.7-7.3-24.4-7.3c-8.6-0.1-17.1,2.2-24.4,6.8c-5.4,3.8-9.7,8.8-12.7,14.7V57.3h-39.1v136.8h40.6V112
                            c0-6.8,2-12.2,5.9-16.6c3.9-3.9,8.3-6.4,14.2-6.4c5.4,0,9.8,1.5,13.2,5.4c3.4,3.4,4.9,8.3,4.9,14.2v85h39.6v-83.1
                            c0-6.4,2-11.7,5.4-15.6s8.3-5.9,14.2-5.9c5-0.2,9.9,1.6,13.7,4.9c3.4,3.4,5.4,8.3,5.4,15.1v84.5h40.6v-90.9
                            c0-14.7-3.9-26.4-12.2-34.7C1445.9,59.7,1435.2,55.3,1422.4,55.3L1422.4,55.3z M1496.2,151.1c-6.1,0-11.9,2.4-16.1,6.8
                            c-4.3,4.1-6.8,9.7-6.8,15.6c0,6.4,2,11.7,6.8,16.1c4.4,4.4,9.8,6.4,16.1,6.4c5.8-0.1,11.4-2.4,15.6-6.4c4.4-4.2,6.9-10,6.8-16.1
                            c0-6.4-2.4-11.2-6.8-15.6C1507.9,153.5,1502.2,150.9,1496.2,151.1L1496.2,151.1z M1604.2,55.3c-10.3,0-19.1,2.4-26.4,7.3
                            c-5.6,3.8-10.3,8.8-13.7,14.7v-20h-39.1v136.8h40.6v-79.2c0-7.8,2.4-14.2,6.4-18.6c4.4-4.4,9.8-6.4,16.6-6.4s12.2,2,16.1,6.4
                            s5.9,10.3,5.9,18.1v79.2h40.6v-86.5c0-16.1-4.4-28.8-13.2-38.1C1630.1,60.2,1618.4,55.3,1604.2,55.3L1604.2,55.3z M1663.8,12.8
                            v180.8h40.6V12.8H1663.8z M1093.6,63.1c-10.1-5.2-21.4-7.8-32.7-7.8c-13.2,0-24.9,2.9-35.2,8.8c-9.9,5.9-17.9,14.6-23,24.9
                            c-5.6,11.4-8.5,23.9-8.3,36.6c0,14.2,2.9,26.9,8.3,37.1c5.1,10.3,13.3,18.9,23.5,24.4c10.3,5.9,22.5,8.8,36.2,8.8
                            c16.6,0,30.8-3.9,41.5-11.2c10.4-7.3,17.8-18.3,20.5-30.8l0.5-2l-37.6-2.4l-0.5,1.5c-1.3,4.6-4.5,8.5-8.8,10.8
                            c-4.4,2.4-9.3,3.4-15.1,3.4c-8.8,0-15.6-2.9-20.5-7.8s-7.3-11.7-7.8-20.5h90.4v-12.2c0-15.1-2.9-28.3-8.3-38.6
                            C1111.5,76.2,1103.5,68.2,1093.6,63.1z M1035,110.1c0.6-6.1,3.3-11.9,7.8-16.1c4.9-4.9,11.2-7.3,19.1-7.3c7.3,0,13.7,2.4,18.1,7.3
                            c4.5,4.3,7,10.4,6.8,16.6h-51.8L1035,110.1z M983.6,161.9L983.6,161.9c-1.6,0.4-3.2,0.6-4.9,0.5c-2.8,0.1-5.6-0.8-7.8-2.4
                            c-2-1.5-2.9-4.4-2.9-8.8V88.6h24.9V57.3H968V25.5h-40.6v31.8h-18.1v31.3h18.1V156c0,13.7,4.4,23.9,12.7,30.8
                            c7.8,5.9,18.1,9.3,30.3,9.3h3.4c4.3,0.1,8.6-0.4,12.7-1.5c3.4-1,5.9-1.5,7.8-2l1.5-0.5l-6.4-30.8L983.6,161.9z M866.9,113
                            l-23.9-4.9c-5.9-1.5-9.8-2.9-12.2-4.9c-1.9-1.7-3-4.2-2.9-6.8c0-3.4,1.5-5.9,4.9-7.8c3.4-2.4,8.3-3.4,13.7-3.4
                            c5.9,0,10.8,1.5,14.2,4.4c3.1,2.5,5.4,5.9,6.4,9.8l0.5,1.5l37.1-2.4l-0.5-2c-1.3-12.1-7.7-23.1-17.6-30.3
                            c-9.8-7.3-23.5-11.2-40.6-11.2c-17.6,0-31.3,3.9-42,11.2c-10.8,7.8-16.1,18.6-16.1,31.8c0,21,13.2,34.7,40.1,40.1l23,4.4
                            c10.3,2,15.6,5.9,15.6,11.2c0,3.4-2,5.9-5.4,8.3s-8.8,3.4-14.7,3.4c-6.4,0-11.2-1.5-15.1-3.9c-3.9-2.5-6.6-6.6-7.3-11.2l-0.5-1.5
                            l-40.1,2l0.5,2c2,13.2,8.3,23.9,19.1,31.3s25.4,11.2,43,11.2c11.7,0,22-2,31.3-5.9s16.6-9.3,22-16.1s7.8-15.1,7.8-23.9
                            C906.4,131.1,893.2,118.4,866.9,113z M1230.9,63.1c-10.1-5.2-21.4-7.8-32.7-7.8c-13.2,0-24.9,2.9-35.2,8.8
                            c-9.9,5.9-17.9,14.6-23,24.9c-5.6,11.4-8.5,23.9-8.3,36.6c0,14.2,2.9,26.9,8.3,37.1c5.1,10.3,13.3,18.9,23.5,24.4
                            c10.3,5.9,22.5,8.8,36.2,8.8c16.6,0,30.8-3.9,41.5-11.2c10.4-7.3,17.8-18.3,20.5-30.8l0.5-2l-37.6-2.4l-0.5,1.5
                            c-1.3,4.6-4.5,8.5-8.8,10.8c-4.4,2.4-9.3,3.4-15.1,3.4c-8.8,0-15.6-2.4-20.5-7.8c-4.9-4.9-7.3-11.7-7.8-20.5h90.4v-12.2
                            c0-15.1-2.9-28.3-8.3-38.6C1248.8,76.2,1240.8,68.2,1230.9,63.1z M1172.3,110.1c0.8-6.1,3.5-11.8,7.8-16.1
                            c4.9-4.9,11.2-7.3,19.1-7.3c7.3,0,13.7,2.4,18.1,7.3c4.5,4.3,7,10.4,6.8,16.6h-51.8L1172.3,110.1z"></path>
                    </g>
                </svg>