{
   "abstract" : "Zaaksysteem",
   "author" : [
      "Xxllnce"
   ],
   "dynamic_config" : 0,
   "generated_by" : "Manually, CPAN::Meta::Converter version 2.150010",
   "license" : [
      "open_source"
   ],
   "meta-spec" : {
      "url" : "http://search.cpan.org/perldoc?CPAN::Meta::Spec",
      "version" : 2
   },
   "name" : "Xxllnce Zaken",
   "release_status" : "stable",
   "version" : "2024"
}
