<svg xmlns="http://www.w3.org/2000/svg" viewBox="0 0 372 98">
  <style>
    .st0{display:none}.st1{display:inline}.st2{fill:#E2E2E2}
  </style>
  <g id="Marges" class="st0">
    <g class="st1">
      <path d="M-383.5-290.1h42.6l34.9 118.6 34.9-118.6h39.5l-53.1 162h-45.9l-52.9-162z" class="st2"/>
    </g>
    <g class="st1">
      <path d="M1073.5-290.1h42.6l34.9 118.6 34.9-118.6h39.5l-53.1 162h-45.9l-52.9-162z" class="st2"/>
    </g>
    <g class="st1">
      <path d="M-215.2 388.1h-42.6l-34.9-118.6-34.9 118.6h-39.5l53.1-162h45.9l52.9 162z" class="st2"/>
    </g>
    <g class="st1">
      <path d="M601.2 388.1h-42.6l-34.9-118.6-34.9 118.6h-39.5l53.1-162h45.9l52.9 162z" class="st2"/>
    </g>
    <g class="st1">
      <path d="M1288.8-164.8v42.6l-118.6 34.9 118.6 34.9v39.5l-162-53.1v-45.9l162-52.9z" class="st2"/>
    </g>
    <g class="st1">
      <path d="M-917.4-138.1v-42.6l118.6-34.9-118.6-34.9V-290l162 53.1v45.9l-162 52.9z" class="st2"/>
    </g>
    <g class="st1">
      <path d="M-231.5 33.6v31h-12.8v-31h12.8z" class="st2"/>
    </g>
    <g class="st1">
      <path d="M515.2 33.6v31h-12.8v-31h12.8z" class="st2"/>
    </g>
  </g>
  <g id="Naam">
    <path d="M93 14h8.4l6.9 23.4 6.9-23.4h7.8l-10.5 32h-9.1L93 14zM126.4 14H148v6.2h-13.6v6.1H147v6.3h-12.6v6.9h14.1V46h-22V14zM153.4 14h8v32h-8V14zM167.9 14h8v25.5h12.4V46H168V14zM192.2 14h8v32h-8V14zM212.3 44.7c-2.2-1.3-3.9-3.2-5.3-5.7-1.3-2.5-2-5.5-2-9s.7-6.5 2.2-9c1.5-2.5 3.4-4.4 5.8-5.7 2.4-1.3 5.1-1.9 7.9-1.9 2.5 0 4.6.4 6.4 1.1 1.8.8 3.1 1.5 3.9 2.2.8.7 1.5 1.4 2.1 2.1l-4.4 4.8c-.6-.6-1.2-1.2-1.8-1.7-.6-.5-1.4-1-2.4-1.4-1-.4-2.1-.6-3.4-.6-1.4 0-2.8.4-4 1.1-1.2.7-2.2 1.8-3 3.3-.8 1.5-1.1 3.3-1.1 5.5s.4 4 1.1 5.5c.7 1.5 1.7 2.6 2.9 3.3 1.2.7 2.6 1.1 4.1 1.1 1.4 0 2.6-.2 3.7-.7 1-.5 1.8-1 2.2-1.5v-3.9h-5.4v-5.8h13V46h-5.2l-.7-3c-.4.5-1 1.1-1.8 1.6s-1.9 1-3.2 1.3c-1.3.4-2.7.5-4.4.5-2.6.3-5-.4-7.2-1.7zM240.5 14h8v12.2h11.8V14h8v32h-8V32.6h-11.8V46h-8V14zM274.7 14h21.5v6.2h-13.6v6.1h12.6v6.3h-12.6v6.9h14.1V46h-22V14zM301.7 14h8v32h-8V14zM316.3 14h11.5c2.5 0 4.8.3 6.7.9 1.9.6 3.7 1.5 5.1 2.8 1.5 1.3 2.8 3 3.7 5.1.9 2.1 1.4 4.4 1.4 7.1 0 2.8-.5 5.2-1.4 7.2-.9 2-2.1 3.7-3.7 5.1-1.4 1.2-3.1 2.2-5.1 2.8-1.9.6-4.2.9-6.8.9h-11.5V14zm11.3 25.5c2.8 0 5-.8 6.5-2.3.8-.8 1.4-1.8 1.9-3 .4-1.2.7-2.7.7-4.3 0-1.7-.2-3.2-.7-4.4-.4-1.2-1.1-2.2-1.9-3-.8-.8-1.7-1.3-2.7-1.7-1.1-.4-2.3-.6-3.7-.6h-3.4v19.3h3.3zM352.4 45.4c-2.2-.8-4.1-1.9-5.5-3.3l3.7-5.7c1.1 1 2.4 1.8 4 2.5s3.1 1.1 4.7 1.1 2.8-.2 3.6-.7c.8-.5 1.2-1.2 1.2-2.2 0-.6-.2-1.1-.5-1.5-.4-.4-.7-.7-1.1-.9-.4-.2-.9-.4-1.5-.7l-3-1.1c-.5-.2-.9-.3-1.3-.5-.4-.1-.7-.2-.9-.3-1.8-.6-3.3-1.4-4.4-2.3-.9-.7-1.7-1.7-2.2-2.7-.5-1.1-.8-2.4-.8-4.1 0-1.7.4-3.1 1.1-4.4.7-1.3 1.6-2.3 2.7-3 1.1-.7 2.3-1.3 3.5-1.7 1.3-.4 3-.6 5-.6 1.4 0 2.8.2 4.3.6 1.4.4 2.8.8 3.9 1.4 1.2.6 2.1 1.2 2.9 1.9l-3.1 5.4c-1-.9-2.2-1.7-3.7-2.2-1.5-.6-2.9-.9-4.3-.9-1.5 0-2.6.2-3.3.7-.7.4-1.1 1.1-1.1 2.1 0 .5.2 1 .6 1.4.4.4.7.7 1.1.9.4.2.9.4 1.6.7.6.2 1.3.5 2 .7.7.2 1.3.5 1.9.7.7.2 1.1.4 1.3.5 1.8.6 3.3 1.4 4.4 2.3.9.7 1.7 1.7 2.2 2.7.5 1.1.8 2.4.8 4.1 0 3.1-1.1 5.6-3.4 7.5-1.1.9-2.4 1.6-3.9 2.2-1.5.5-3.3.8-5.5.8-2.6-.1-4.8-.5-7-1.4zM96.2 52.1h12.6c3.8 0 6.6.7 8.5 2.1 1.1.8 2.1 1.9 2.7 3.2.7 1.3 1 2.8 1 4.5 0 1.8-.4 3.5-1.2 5-1 1.8-2.7 3.2-4.8 4.1l8 13.1h-9l-6.6-11.7h-3.2V84h-8V52.1zm12 14.3c1.4 0 2.5-.3 3.4-.9.5-.4.8-.8 1.1-1.4.3-.6.4-1.2.4-1.9s-.1-1.3-.4-1.9c-.3-.6-.6-1-1.1-1.4-.9-.6-2-.9-3.4-.9h-4.1v8.3h4.1zM126.5 52.1H148v6.2h-13.6v6.1H147v6.3h-12.6v6.9h14.1V84h-22V52.1zM159 82.8c-2.2-1.3-3.9-3.2-5.3-5.7-1.3-2.5-2-5.5-2-9s.7-6.5 2.2-9c1.5-2.5 3.4-4.4 5.8-5.7 2.4-1.3 5.1-1.9 7.9-1.9 2.5 0 4.6.4 6.4 1.1 1.8.8 3.1 1.5 3.9 2.2.8.7 1.5 1.4 2.1 2.1l-4.4 4.8c-.6-.6-1.2-1.2-1.8-1.7-.6-.5-1.4-1-2.4-1.4-1-.4-2.1-.6-3.4-.6-1.4 0-2.8.4-4 1.1-1.2.7-2.2 1.8-3 3.3-.8 1.5-1.1 3.3-1.1 5.5s.4 4 1.1 5.5c.7 1.5 1.7 2.6 2.9 3.3 1.2.7 2.6 1.1 4.1 1.1 1.4 0 2.6-.2 3.7-.7 1-.5 1.8-1 2.2-1.5v-3.9h-5.4V66h13v18.2h-5.2l-.7-3c-.4.5-1 1.1-1.8 1.6s-1.9 1-3.2 1.3c-1.3.4-2.7.5-4.4.5-2.7.1-5-.5-7.2-1.8zM187.1 52.1h8v32h-8v-32zM207.4 82.7c-2.4-1.4-4.3-3.3-5.6-5.8-1.3-2.5-2-5.4-2-8.8 0-3.4.7-6.3 2-8.8 1.3-2.5 3.2-4.4 5.6-5.8 2.4-1.4 5.2-2 8.5-2s6.1.7 8.5 2c2.4 1.4 4.2 3.3 5.5 5.8 1.3 2.5 1.9 5.4 1.9 8.8 0 3.4-.6 6.3-1.9 8.8-1.3 2.5-3.1 4.5-5.6 5.8-2.4 1.4-5.2 2.1-8.5 2.1-3.2-.1-6-.7-8.4-2.1zm12.8-6c1.2-.9 2.1-2 2.6-3.6.6-1.5.9-3.3.9-5.2 0-1.9-.3-3.7-.9-5.2-.6-1.5-1.5-2.7-2.6-3.5-1.2-.9-2.6-1.3-4.3-1.3-1.7 0-3.1.4-4.3 1.3-1.2.9-2.1 2-2.7 3.6-.6 1.5-.9 3.2-.9 5.1 0 1.9.3 3.7.9 5.2.6 1.5 1.5 2.7 2.7 3.6 1.2.9 2.6 1.3 4.3 1.3 1.7 0 3.1-.4 4.3-1.3z"/>
    <g>
      <path d="M240.4 52h5.4c.7 0 1.4.1 2 .2.6.1 1.2.3 1.6.5 1 .6 1.5 1.6 1.5 2.8 0 .7-.2 1.3-.6 1.9-.4.5-1 .9-1.8 1.1.6.1 1.2.3 1.7.6s.8.7 1.1 1.2c.3.5.4 1 .4 1.6 0 1.4-.6 2.5-1.7 3.2-.9.6-2.2.9-4 .9h-5.6V52zm5.2 5.6c.6 0 1-.1 1.3-.3.2-.1.3-.3.4-.5.1-.2.2-.4.2-.7 0-.3-.1-.5-.2-.7-.1-.2-.2-.4-.4-.5-.3-.2-.7-.3-1.3-.3h-1.7v3h1.7zm.2 5.9c.7 0 1.2-.1 1.5-.3.2-.1.4-.3.6-.6.1-.2.2-.5.2-.9 0-.6-.3-1.1-.8-1.4-.4-.2-.9-.3-1.5-.3h-1.9v3.5h1.9zM253.7 52h5.5c1.6 0 2.9.3 3.7.9.5.4.9.8 1.2 1.4.3.6.5 1.2.5 2s-.2 1.5-.5 2.2c-.5.8-1.2 1.4-2.1 1.8l3.5 5.7h-4l-2.9-5.1h-1.4V66h-3.5V52zm5.3 6.3c.6 0 1.1-.1 1.5-.4.2-.2.4-.4.5-.6.1-.3.2-.5.2-.8 0-.3-.1-.6-.2-.8-.1-.3-.3-.5-.5-.6-.4-.3-.9-.4-1.5-.4h-1.8v3.6h1.8zM271 52h4.2l4.7 14h-3.7l-.8-2.7h-4.9l-.8 2.7h-3.4l4.7-14zm3.7 8.7l-1.7-5.4-1.7 5.4h3.4zM281.4 52h5.4c.7 0 1.4.1 2 .2.6.1 1.2.3 1.6.5 1 .6 1.5 1.6 1.5 2.8 0 .7-.2 1.3-.6 1.9-.4.5-1 .9-1.8 1.1.6.1 1.2.3 1.7.6s.8.7 1.1 1.2c.3.5.4 1 .4 1.6 0 1.4-.6 2.5-1.7 3.2-.9.6-2.2.9-4 .9h-5.6V52zm5.2 5.6c.6 0 1-.1 1.3-.3.2-.1.3-.3.4-.5.1-.2.2-.4.2-.7 0-.3-.1-.5-.2-.7s-.2-.4-.4-.5c-.3-.2-.7-.3-1.3-.3h-1.7v3h1.7zm.2 5.9c.7 0 1.2-.1 1.5-.3.2-.1.4-.3.6-.6.1-.2.2-.5.2-.9 0-.6-.3-1.1-.8-1.4-.4-.2-.9-.3-1.5-.3h-1.9v3.5h1.9zM297.9 52h4.2l4.7 14h-3.7l-.8-2.7h-4.9l-.8 2.7h-3.4l4.7-14zm3.7 8.7l-1.7-5.4-1.7 5.4h3.4zM308.3 52h3.6l5.1 8.6V52h3.3v14H317l-5.4-9.1V66h-3.3V52zM325.7 54.8h-3.8V52H333v2.7h-3.8V66h-3.5V54.8zM335.8 57.8h6v2.5h-6v-2.5zM240.4 70h3.6l5.1 8.6V70h3.3v14H249l-5.4-9.1V84h-3.3V70zM257.9 83.3c-1-.6-1.8-1.4-2.4-2.5-.6-1.1-.8-2.4-.8-3.8 0-1.5.3-2.7.8-3.8.6-1.1 1.4-1.9 2.4-2.5 1-.6 2.3-.9 3.7-.9 1.4 0 2.6.3 3.7.9 1 .6 1.8 1.4 2.4 2.5.6 1.1.8 2.4.8 3.8 0 1.5-.3 2.7-.8 3.8-.6 1.1-1.4 1.9-2.4 2.5-1 .6-2.3.9-3.7.9-1.4 0-2.6-.3-3.7-.9zm5.5-2.6c.5-.4.9-.9 1.1-1.5.3-.7.4-1.4.4-2.2 0-.8-.1-1.6-.4-2.2-.3-.6-.6-1.2-1.1-1.5-.5-.4-1.1-.6-1.8-.6s-1.3.2-1.8.6c-.5.4-.9.9-1.2 1.5-.3.7-.4 1.4-.4 2.2 0 .8.1 1.6.4 2.2.3.7.6 1.2 1.2 1.5.5.4 1.1.6 1.8.6s1.3-.2 1.8-.6zM273.1 83.3c-1-.6-1.8-1.4-2.4-2.5-.6-1.1-.8-2.4-.8-3.8 0-1.5.3-2.7.8-3.8.6-1.1 1.4-1.9 2.4-2.5 1-.6 2.3-.9 3.7-.9 1.4 0 2.6.3 3.7.9 1 .6 1.8 1.4 2.4 2.5.6 1.1.8 2.4.8 3.8 0 1.5-.3 2.7-.8 3.8-.6 1.1-1.4 1.9-2.4 2.5-1 .6-2.3.9-3.7.9-1.4 0-2.6-.3-3.7-.9zm5.5-2.6c.5-.4.9-.9 1.1-1.5.3-.7.4-1.4.4-2.2 0-.8-.1-1.6-.4-2.2-.3-.6-.6-1.2-1.1-1.5-.5-.4-1.1-.6-1.8-.6s-1.3.2-1.8.6c-.5.4-.9.9-1.2 1.5-.3.7-.4 1.4-.4 2.2 0 .8.1 1.6.4 2.2.3.7.6 1.2 1.2 1.5.5.4 1.1.6 1.8.6s1.3-.2 1.8-.6zM286.2 70h5.5c1.6 0 2.9.3 3.7.9.5.4.9.8 1.2 1.4.3.6.5 1.2.5 2s-.2 1.5-.5 2.2c-.5.8-1.2 1.4-2.1 1.8L298 84h-4l-2.9-5.1h-1.4V84h-3.5V70zm5.3 6.3c.6 0 1.1-.1 1.5-.4.2-.2.4-.4.5-.6.1-.3.2-.5.2-.8 0-.3-.1-.6-.2-.8-.1-.3-.3-.5-.5-.6-.4-.3-.9-.4-1.5-.4h-1.8v3.6h1.8zM299.5 70h5.1c1.1 0 2.1.1 3 .4.9.3 1.6.7 2.3 1.2.7.6 1.2 1.3 1.6 2.2.4.9.6 1.9.6 3.1 0 1.2-.2 2.3-.6 3.2-.4.9-.9 1.6-1.6 2.2-.6.5-1.4 1-2.2 1.2-.9.3-1.8.4-3 .4h-5.1V70zm5 11.2c1.2 0 2.2-.3 2.8-1 .4-.4.6-.8.8-1.3.2-.5.3-1.2.3-1.9s-.1-1.4-.3-1.9c-.2-.5-.5-1-.8-1.3-.3-.3-.7-.6-1.2-.7-.5-.2-1-.2-1.6-.2H303v8.5h1.5z"/>
    </g>
  </g>
  <g id="Beeldmerk">
    <path fill="#ED8B00" d="M41.9 56H56s-2.8 0-9.1-14-12.5-28-12.5-28C30.9 6.3 21.8 0 14.1 0H0s2.8 0 9.1 14 12.5 28 12.5 28c3.5 7.7 12.6 14 20.3 14z"/>
    <path fill="#FFCD00" d="M42.1 70H28s2.8 0 9.1-14 12.5-28 12.5-28c3.5-7.7 12.6-14 20.3-14H84s-2.8 0-9.1 14-12.5 28-12.5 28c-3.5 7.7-12.6 14-20.3 14z"/>
    <path fill="#002D72" d="M41.9 84H56s-2.8 0-9.1-14-12.5-28-12.5-28c-3.5-7.7-12.6-14-20.3-14H0s2.8 0 9.1 14 12.5 28 12.5 28c3.5 7.7 12.6 14 20.3 14z"/>
    <path fill="#E4002B" d="M42.1 98H28s2.8 0 9.1-14 12.5-28 12.5-28c3.5-7.7 12.6-14 20.3-14H84s-2.8 0-9.1 14-12.5 28-12.5 28c-3.5 7.7-12.6 14-20.3 14z"/>
  </g>
</svg>