{
  "domains": {
    "Admin": {
      "domain": "http-admin",
      "api_docs": "openapi30.json",
      "entities": [
        "entities.json"
      ]
    },
    "CaseManagement": {
      "domain": "http-cm",
      "api_docs": "openapi30.json",
      "entities": [
        "entities.json",
        "generated_entities.json"
      ]
    },
    "Communication": {
      "domain": "http-communication",
      "api_docs": "openapi30.json",
      "entities": [
        "entities.json"
      ]
    },
    "Document": {
      "domain": "http-document",
      "api_docs": "openapi30.json",
      "entities": [
        "entities.json"
      ]
    },
    "Geo": {
      "domain": "http-geo",
      "api_docs": "openapi30.json",
      "entities": [
        "generated_entities.json"
      ]
    },
    "Jobs": {
      "domain": "http-jobs",
      "api_docs": "openapi30.json",
      "entities": [
        "generated_entities.json"
      ]
    }
  }
}