<?xml version="1.0" encoding="UTF-8" standalone="no"?>
<svg width="112px" height="125px" viewBox="0 0 112 125" version="1.1" xmlns="http://www.w3.org/2000/svg" xmlns:xlink="http://www.w3.org/1999/xlink">
    <!-- Generator: Sketch 3.6.1 (26313) - http://www.bohemiancoding.com/sketch -->
    <title>object relateren</title>
    <desc>Created with Sketch.</desc>
    <defs></defs>
    <g id="Page-1" stroke="none" stroke-width="1" fill="none" fill-rule="evenodd">
        <g id="object-mutation-relate" transform="translate(-8.000000, -1.000000)">
            <g id="object-relateren" transform="translate(8.000000, 1.000000)">
                <path d="M111.780822,90.6556462 C111.586757,93.1828288 110.519416,95.0295884 108.578767,96.1959803 L59.3835616,123.606054 C58.4132372,124.383649 57.2488652,124.77244 55.890411,124.77244 C54.5319567,124.77244 53.3675848,124.383649 52.3972603,123.606054 L3.20205479,96.1959803 C1.26140582,95.0295884 0.194064897,93.1828288 0,90.6556462 L0,34.6691123 C0.194064897,32.1419297 1.26140582,30.2951701 3.20205479,29.1287782 L52.3972603,1.71870426 C53.3675848,0.941109622 54.5319567,0.552318135 55.890411,0.552318135 C57.2488652,0.552318135 58.4132372,0.941109622 59.3835616,1.71870426 L108.578767,29.1287782 C110.519416,30.2951701 111.586757,32.1419297 111.780822,34.6691123 L111.780822,90.6556462 Z" id="" fill="#72C4B9"></path>
                <path d="M48.5421358,67.072031 C49.244945,67.8933852 49.5963443,68.802728 49.5963443,69.8000866 C49.5963443,70.7974453 49.2156617,71.6774545 48.4542851,72.4401405 C47.6929085,73.2028266 46.8144103,73.5841639 45.8187639,73.5841639 C44.8231176,73.5841639 43.9739026,73.1734929 43.2710935,72.3521387 C39.5227779,68.5973766 37.6486483,64.1973309 37.6486483,59.1518693 C37.6486483,54.1064078 39.5227779,49.706362 43.2710935,45.9515999 L56.4486994,32.575327 C60.3141498,28.9379012 64.7359244,27.1192156 69.714156,27.1192156 C74.6923876,27.1192156 79.1141622,28.9379012 82.9796126,32.575327 C86.6107933,36.4474253 88.4263564,40.8768048 88.4263564,45.8635981 C88.4263564,50.8503915 86.6107933,55.2797709 82.9796126,59.1518693 L77.3571674,64.7839843 C77.4743023,61.6159038 77.0057699,58.5652054 75.9515561,55.6317975 L77.7085703,53.8717616 C79.9341326,51.5250353 81.0468971,48.8556742 81.0468971,45.8635981 C81.0468971,42.8715221 79.9048493,40.2314946 77.6207195,37.9434365 C75.3365898,35.6553784 72.7010949,34.5113665 69.714156,34.5113665 C66.7272171,34.5113665 64.062439,35.6260447 61.7197417,37.8554347 L48.5421358,51.2317077 C46.3165735,53.4610977 45.203809,56.0717915 45.203809,59.0638675 C45.203809,62.0559435 46.3165735,64.7253047 48.5421358,67.072031 L48.5421358,67.072031 Z M59.0842206,51.2317077 C59.9041646,50.4103535 60.8119461,49.9996825 61.8075925,49.9996825 C62.8032388,49.9996825 63.6524538,50.4103535 64.3552629,51.2317077 C68.1035785,54.9864698 69.9777081,59.3865156 69.9777081,64.4319771 C69.9777081,69.4774386 68.1035785,73.8774844 64.3552629,77.6322465 L51.177657,91.0085195 C47.3122066,94.6459452 42.890432,96.4646308 37.9122004,96.4646308 C32.9339688,96.4646308 28.5121942,94.6459452 24.6467438,91.0085195 C21.0155631,87.1364211 19.2,82.7070416 19.2,77.7202483 C19.2,72.7334549 21.0155631,68.3040755 24.6467438,64.4319771 L30.269189,58.7998621 C30.1520541,61.9679426 30.6205865,65.0186411 31.6748003,67.9520489 L29.9177861,69.7120848 C27.6922238,72.0588111 26.5794593,74.7281722 26.5794593,77.7202483 C26.5794593,80.7123243 27.7215071,83.3523518 30.0056368,85.6404099 C32.2897666,87.928468 34.9252615,89.0724799 37.9122004,89.0724799 C40.8991393,89.0724799 43.5639174,87.9578017 45.9066147,85.7284117 L59.0842206,72.3521387 C61.3097829,70.1227487 62.4225474,67.5120549 62.4225474,64.5199789 C62.4225474,61.5279029 61.3097829,58.8585417 59.0842206,56.5118154 C58.3814114,55.6904612 58.0300121,54.7811184 58.0300121,53.7837598 C58.0300121,52.7864011 58.3814114,51.9357256 59.0842206,51.2317077 L59.0842206,51.2317077 Z" id="-copy" fill="#FFFFFF"></path>
            </g>
        </g>
    </g>
</svg>