<svg xmlns="http://www.w3.org/2000/svg" viewBox="0 0 580 200" fill="#0065BD" role="img">
  <title>Logo Hoogheemraadschap van Rijnland</title>
  <path d="M65.435 131.4v-14.669l-28.304-.008V131.4c0 12.893 8.632 17.055 14.15 17.081h.002c5.52-.026 14.152-4.188 14.152-17.081Zm-1.054-13.615V131.4c0 12.03-7.948 16.002-13.098 16.027-5.149-.025-13.098-3.997-13.098-16.027v-13.623l26.196.008Z"></path>
  <path d="m56.168 151.746 3.445-6.192-1.226-.683-3.446 6.192 1.227.683ZM84.027 114.721c2.143.986 4.549 2.054 12.075 7.124-.265 3.444-.563 6.168-.889 8.036-.207 1.187-.406 2.004-.633 2.396l1.215.704c.21-.363.427-1.012.624-1.933.412-1.935.79-5.185 1.114-9.504l.031-.406-.338-.228c-7.915-5.35-10.403-6.448-12.612-7.464l-.587 1.275ZM79.388 123.844c4.658 4.014 9.302 8.236 13.952 13.74-1.055 5.129-2.038 6.942-3.526 9.919l1.256.628c1.571-3.144 2.596-5.034 3.714-10.601l.067-.331-.217-.259c-4.777-5.694-9.545-10.036-14.33-14.159l-.916 1.063ZM75.568 156.974l3.889 1.676.023.008c.917.322 1.356.758 1.399 1.273.065.785-.664 1.567-1.387 1.812l.45 1.33c1.271-.43 2.45-1.879 2.336-3.258-.076-.925-.678-1.896-2.317-2.476l-3.837-1.655-.556 1.29ZM72.314 158.565l2.73 3.346.019.02c.672.702.867 1.288.671 1.765-.298.728-1.305 1.093-2.062.988l-.194 1.391c1.328.184 3.033-.571 3.556-1.847.35-.856.255-1.992-.94-3.251l-2.692-3.3-1.088.888Z"></path>
  <path d="m62.013 141.461 8.955 14.691 7.452-2.983.046-.028c.836-.495 1.452-.552 1.874-.254.641.454.771 1.514.493 2.224l1.309.511c.487-1.25.137-3.083-.992-3.881-.751-.532-1.871-.697-3.355.166l-6.246 2.5-8.337-13.677-1.199.731ZM58.432 145.626l8.366 11.5-3.203 2.009c-1.538.789-2.004 1.827-1.959 2.749.067 1.38 1.425 2.66 2.744 2.921l.273-1.377c-.751-.149-1.577-.827-1.615-1.612-.025-.516.354-1.005 1.221-1.444l.029-.014 4.531-2.842-9.251-12.717-1.136.827Z"></path>
  <path d="M69.592 129.146c8.219 7.175 11.001 12.28 16.569 22.738-2.596 3.205-2.316 3.598-3.747 4.784l.897 1.081c1.542-1.279 1.197-1.652 4.231-5.336l.298-.362-.22-.414c-5.818-10.929-8.63-16.151-17.104-23.549l-.924 1.058ZM27.306 155.684l-3.85 1.658c-1.632.58-2.231 1.55-2.306 2.474-.113 1.378 1.066 2.827 2.337 3.257l.451-1.33c-.724-.245-1.453-1.028-1.389-1.813.042-.515.481-.95 1.396-1.272l.023-.008 3.893-1.676-.555-1.29ZM30.027 157.677l-2.696 3.305c-1.191 1.257-1.286 2.391-.935 3.246.523 1.276 2.229 2.031 3.559 1.847l-.193-1.391c-.76.105-1.768-.259-2.067-.988-.195-.477 0-1.063.671-1.765l.019-.02 2.73-3.346-1.088-.888ZM18.815 113.446c-2.209 1.016-4.696 2.114-12.612 7.464l-.338.228.031.406c.324 4.319.702 7.569 1.113 9.504.196.92.411 1.568.62 1.931l1.217-.7c-.226-.393-.424-1.209-.631-2.397-.325-1.869-.623-4.593-.888-8.036 7.526-5.071 9.932-6.139 12.075-7.125l-.587-1.275ZM23.125 122.781c-4.785 4.123-9.553 8.465-14.326 14.16l-.216.258.066.33c1.114 5.568 2.135 7.458 3.711 10.602l1.255-.629c-1.492-2.976-2.47-4.789-3.522-9.917 4.646-5.505 9.29-9.727 13.949-13.741l-.917-1.063ZM32.692 128.088c-8.473 7.398-11.29 12.62-17.108 23.549l-.22.414.299.362c3.037 3.684 2.692 4.056 4.23 5.335l.898-1.08c-1.427-1.186-1.147-1.578-3.748-4.784 5.569-10.458 8.354-15.563 16.573-22.738l-.924-1.058Z"></path>
  <path d="m39.775 141.374-7.9 13.032-6.249-2.501c-1.479-.86-2.598-.696-3.35-.164-1.128.798-1.48 2.631-.993 3.881l1.309-.511c-.278-.71-.147-1.77.495-2.224.422-.298 1.037-.241 1.871.254l.047.028 7.453 2.983 8.517-14.051-1.2-.727ZM43.376 181.663c-.431 2.313-.608 3.682-.681 4.409l-5.136.055c1.529-9.519 5.133-21.755 11.138-34.422l.156-.329-3.05-5.408-1.223.689 2.693 4.776c-6.153 13.058-9.776 25.644-11.23 35.3l-.123.815 8.118-.087.01-.685s.021-1.17.709-4.856l-1.381-.257Z"></path>
  <path d="m43.428 145.163-8.811 12.357 4.525 2.838.028.014c.867.439 1.245.928 1.22 1.443-.04.786-.867 1.464-1.618 1.613l.273 1.377c1.319-.261 2.678-1.54 2.747-2.92.046-.924-.42-1.962-1.962-2.753l-3.205-2.01 7.947-11.144-1.144-.815ZM51.485.996v10.187h1.405V.996h-1.405ZM52.242 75.06H15.418c-.602-6.462-6.891-18.601-6.891-18.601l-1.246.649s6.603 12.62 6.776 18.674l.019.683h38.166V75.06ZM43.394 68.488c2.986-.17 5.311-1.246 6.698-2.621 1.011-1.002 1.538-2.173 1.534-3.308-.007-1.839-1.412-3.72-4.843-4.617-1.611-.549-2.167-2.842-.58-4.26.785-.702 2.049-1.191 3.883-1.285l.664-.034.07-28.782-.708.004c-4.447.03-12.545-.171-17.715 1.014l-.592.136 2.339 28.576.688-.044c1.833-.115 3.149.227 4.016.836 1.743 1.224 1.482 3.556-.051 4.288-3.315 1.287-4.49 3.319-4.279 5.148.13 1.128.792 2.23 1.915 3.11 1.541 1.208 3.978 2.01 6.961 1.839Zm-.08-1.401c-2.573.147-4.686-.502-6.015-1.543-.79-.62-1.295-1.372-1.386-2.166-.158-1.37.918-2.721 3.403-3.681l.04-.017c2.1-.966 2.832-3.815 1.25-5.831-.886-1.129-2.537-2.025-5.173-2.007L33.304 25.84c4.815-.966 11.809-.84 16.109-.848l-.064 26.055c-2.636.279-4.174 1.361-4.919 2.587-1.325 2.179-.259 4.923 1.937 5.649l.044.013c2.578.67 3.805 1.889 3.811 3.269.003.797-.408 1.6-1.119 2.305-1.195 1.185-3.216 2.069-5.789 2.217ZM83.837 60.446c-1.488-.838-1.629-3.196.184-4.3.895-.545 2.218-.795 4.028-.557l5.621.964.238-.449c3.286-6.199 3.591-11.953 1.764-16.792-2.724-7.218-10.243-12.434-19.935-13.997l-.742-.119-2.619 28.402.677.082c1.823.222 3.051.799 3.786 1.553 1.481 1.521.772 3.761-.87 4.204-3.49.659-5.024 2.438-5.16 4.273-.083 1.132.361 2.337 1.3 3.407 1.288 1.468 3.532 2.702 6.498 3.079 2.966.379 5.444-.253 7.054-1.353 1.174-.801 1.903-1.856 2.102-2.974.322-1.809-.72-3.914-3.926-5.423Zm-.659 1.24.041.021c2.415 1.131 3.403 2.557 3.161 3.915-.139.785-.687 1.499-1.511 2.062-1.387.946-3.53 1.446-6.084 1.12-2.557-.325-4.511-1.347-5.621-2.613-.659-.752-1.013-1.582-.954-2.378.102-1.376 1.412-2.508 4.032-2.998l.044-.01c2.239-.57 3.494-3.231 2.325-5.497-.657-1.272-2.112-2.456-4.714-2.921l2.357-25.558c8.778 1.609 15.607 6.362 18.105 12.979 1.657 4.39 1.385 9.585-1.458 15.188l-4.633-.794c-3.039-.405-4.951.418-5.98 1.575-1.69 1.901-1.134 4.794.89 5.909ZM60.977 68.488c2.984.171 5.421-.631 6.962-1.839 1.123-.88 1.786-1.982 1.915-3.11.211-1.829-.964-3.859-4.27-5.143-1.54-.726-1.806-3.066-.059-4.293.867-.609 2.183-.951 4.018-.836l.688.044 2.331-28.576-.593-.136c-5.169-1.185-13.263-.984-17.71-1.014l-.709-.004.07 28.782.665.034c1.835.094 3.099.583 3.885 1.285 1.584 1.415 1.033 3.701-.574 4.258-3.436.901-4.84 2.78-4.848 4.619-.005 1.135.521 2.305 1.532 3.308 1.387 1.375 3.711 2.451 6.697 2.621Zm.08-1.401c-2.573-.148-4.593-1.032-5.788-2.217-.71-.704-1.121-1.508-1.117-2.305.006-1.379 1.234-2.599 3.812-3.269l.044-.013c2.194-.726 3.26-3.47 1.935-5.649-.745-1.226-2.284-2.308-4.922-2.587l-.063-26.055c4.299.008 11.291-.118 16.105.848l-2.121 26.002c-2.638-.018-4.289.878-5.175 2.007-1.582 2.016-.85 4.864 1.248 5.83l.04.018c2.485.96 3.562 2.311 3.404 3.682-.091.793-.595 1.545-1.386 2.165-1.329 1.041-3.442 1.69-6.016 1.543Z"></path>
  <path d="M52.242 76.465h38.227l.02-.682c.177-6.055 6.775-18.676 6.775-18.676l-1.245-.648s-6.286 12.139-6.89 18.601H52.242v1.405ZM20.539 60.089c-3.208 1.509-4.251 3.616-3.929 5.426.199 1.118.927 2.173 2.101 2.975 1.609 1.1 4.087 1.734 7.053 1.356 2.966-.378 5.21-1.613 6.498-3.082.939-1.071 1.383-2.275 1.299-3.407-.135-1.835-1.669-3.613-5.154-4.269-1.645-.434-2.359-2.683-.875-4.208.735-.755 1.963-1.332 3.786-1.554l.673-.082-2.436-28.232-.753.129c-9.686 1.67-17.265 6.798-20.039 13.923-1.863 4.783-1.588 10.483 1.7 16.686l.238.449 5.612-.963c1.815-.24 3.141.011 4.036.556 1.81 1.103 1.673 3.455.194 4.294l-.004.003Zm.613 1.263.04-.02c2.024-1.112 2.581-4.005.891-5.908-1.029-1.158-2.941-1.981-5.967-1.578l-.013.001-4.633.795c-2.84-5.596-3.086-10.734-1.399-15.068 2.546-6.538 9.435-11.21 18.217-12.911l2.189 25.37c-2.604.464-4.06 1.649-4.717 2.923-1.169 2.267.086 4.93 2.325 5.499l.045.01c2.619.488 3.929 1.62 4.031 2.995.059.796-.295 1.626-.955 2.378-1.11 1.266-3.063 2.289-5.62 2.616-2.554.324-4.697-.176-6.083-1.123-.824-.563-1.371-1.278-1.511-2.062-.242-1.359.746-2.785 3.16-3.917ZM14.758 80.331h75.563v-1.404H14.758v1.404ZM52.187 22.89a6.17 6.17 0 1 0 0-12.338 6.17 6.17 0 0 0 0 12.338Zm0-1.405a4.762 4.762 0 0 1-4.764-4.764 4.765 4.765 0 1 1 4.764 4.764ZM47.792 5.035h9.137V3.631h-9.137v1.404ZM103.602 83.871v-.702L-.002 83.144v53.777c0 47.307 31.546 62.701 51.796 62.76h.002c20.252-.059 51.798-15.453 51.798-62.76l.008-53.05Zm-1.404.702-.008 52.348c0 46.158-30.636 61.297-50.394 61.356-19.759-.059-50.394-15.198-50.394-61.356V84.548l100.796.025Z"></path>
  <path d="M55.303 109.923c.214.491.224.878.049 1.154-.251.394-.8.518-1.239.395-.209-.058-.398-.18-.497-.387-.129-.272-.111-.642.052-1.12l-1.328-.455c-.318.929-.242 1.651.009 2.178.281.59.792.971 1.386 1.136 1.005.281 2.229-.093 2.802-.994.374-.588.512-1.418.052-2.47l-1.286.563Z"></path>
  <path d="M56.589 109.381c-.214-.489-.226-.873-.053-1.144.247-.388.79-.504 1.224-.378.208.06.397.184.495.393.129.272.112.643-.052 1.12l1.328.456c.318-.925.243-1.646-.005-2.174-.279-.591-.787-.974-1.377-1.144-1.003-.29-2.226.076-2.797.971-.372.585-.51 1.411-.049 2.463l1.286-.563Z"></path>
  <path d="M64.718 106.813c-.387-.314-1.118-.496-1.85-.387-.729.108-1.431.49-1.786 1.145-.293.54-.383 1.298.058 2.306.214.49.227.873.055 1.143-.245.384-.784.495-1.215.367-.489-.145-.741-.668-.445-1.53l-1.328-.456c-.318.926-.245 1.649.003 2.179.277.593.783.979 1.371 1.153 1.003.298 2.226-.063 2.797-.957.372-.582.509-1.408.049-2.461-.207-.473-.247-.822-.111-1.075.146-.268.46-.381.759-.425.295-.044.601-.038.757.088l.886-1.09ZM53.645 110.023c.47-1.052.337-1.878-.032-2.459-.566-.892-1.789-1.254-2.798-.953-.587.175-1.095.56-1.376 1.153-.252.532-.331 1.256-.022 2.183l1.332-.444c-.29-.872-.028-1.399.467-1.546.431-.129.969-.022 1.211.359.171.269.153.649-.064 1.136l1.282.571ZM46.5 109.318c-.467 1.048-.336 1.879.033 2.471.566.905 1.787 1.288 2.794 1.016.595-.161 1.11-.537 1.396-1.123.255-.525.337-1.245.026-2.175l-1.332.445c.16.477.174.846.043 1.115-.1.206-.29.326-.499.382-.441.12-.989-.008-1.237-.404-.173-.277-.16-.664.059-1.155l-1.283-.572Z"></path>
  <path d="M47.783 109.915c.468-1.048.337-1.877-.031-2.464-.565-.901-1.786-1.276-2.792-.992-.591.166-1.103.546-1.386 1.137-.253.527-.333 1.25-.023 2.18l1.332-.444c-.161-.482-.174-.855-.043-1.129a.761.761 0 0 1 .501-.393c.435-.123.977-.003 1.221.387.172.273.157.658-.061 1.146l1.282.572Z"></path>
  <path d="M39.264 107.841c.099-.105.313-.104.529-.098.374.011.812.124.984.476.12.246.077.578-.118 1.016-.467 1.051-.336 1.878.032 2.463.565.899 1.785 1.268 2.791.978.588-.17 1.098-.552 1.38-1.144.251-.528.33-1.251.021-2.179l-1.332.444c.288.867.032 1.388-.458 1.53-.432.125-.971.01-1.214-.376-.171-.273-.155-.656.063-1.145.42-.943.356-1.671.097-2.203-.399-.817-1.335-1.238-2.205-1.263-.674-.02-1.278.207-1.589.535l1.019.966ZM62.677 107.891c.144-.138.432-.149.707-.113.283.037.58.143.715.402.133.254.088.605-.124 1.08l-.016.037-1.529 4.884H40.108v1.404h23.354l1.813-5.792c.429-.987.347-1.733.068-2.265-.348-.666-1.05-1.048-1.779-1.142-.737-.096-1.47.12-1.858.49l.971 1.015Z"></path>
  <path d="M41.327 106.843c-.396-.366-1.132-.574-1.87-.473-.73.1-1.431.486-1.78 1.154-.281.536-.363 1.286.068 2.276l1.814 5.785h23.349v-1.404H40.591l-1.533-4.884-.016-.036c-.212-.476-.255-.83-.121-1.086.137-.263.439-.374.726-.414.281-.038.576-.027.726.113l.954-1.031ZM7.726 103.4c.23-1.827.435-4.084 2.023-7.714 5.146.85 13.315 4.541 17.244 7.727-3.905 3.736-3.296 8.138-.844 10.615 2.573 2.598 7.283 3.188 11.209-1.401l-1.066-.913c-3.212 3.754-7.041 3.451-9.145 1.326-2.104-2.125-2.376-5.96 1.363-9.103l.616-.518-.597-.54c-3.911-3.537-13.526-7.923-19.112-8.663l-.515-.068-.216.473c-1.873 4.11-2.102 6.602-2.353 8.604l1.393.175Z"></path>
  <path d="M18.287 105.985c-1.982 0-5.518.291-12.177 1.478l-.505.09-.068.509c-.655 4.94-.559 7.101-.274 9.139l1.391-.194c-.264-1.882-.347-3.874.209-8.251 6.199-1.089 9.533-1.366 11.424-1.366v-1.405ZM97.097 103.226c-.248-2.002-.48-4.494-2.354-8.605l-.216-.473-.515.068c-5.59.74-15.196 5.126-19.112 8.663l-.598.54.617.518c3.739 3.143 3.467 6.978 1.363 9.103s-5.933 2.428-9.144-1.326l-1.067.913c3.926 4.589 8.636 3.999 11.209 1.401 2.452-2.477 3.061-6.879-.843-10.615 3.931-3.186 12.094-6.877 17.243-7.728 1.588 3.63 1.797 5.887 2.023 7.714l1.394-.173Z"></path>
  <path d="M85.142 107.39c1.887 0 5.225.277 11.424 1.366.56 4.376.477 6.368.21 8.249l1.39.198c.289-2.039.385-4.201-.274-9.142l-.068-.508-.505-.09c-6.659-1.187-10.199-1.478-12.177-1.478v1.405ZM32.755 92.431l.4 3.493.9-.456c.434-.22 1.09-.305 1.718-.346.6-.041 1.179-.032 1.561-.017l.023.065 2.941 9.872 1.346-.401-2.951-9.903-.339-.973-.457-.036s-2.053-.139-3.559.184l-.19-1.664-.001.001a2.65 2.65 0 0 1-.018-.855c.036-.237.11-.499.3-.697.212-.221.56-.335 1.088-.317h3.164l-.163-.836s-.038-.232.111-.438c.137-.188.408-.317.871-.367h3.763l.049-.008c.429-.061.756-.031.988.115.184.116.282.309.331.53l.016.071 6.492 14.403h1.28l6.5-14.402.016-.068c.05-.223.148-.417.333-.534.23-.146.557-.176.987-.115l.049.008h3.757c.464.049.736.179.873.368.151.207.114.441.114.441l-.157.832h3.142c.542-.018.891.096 1.103.317.192.199.266.461.301.697.058.387-.009.795-.009.795l.689.841-.698-.782-.19 1.664c-1.506-.323-3.559-.184-3.559-.184l-.457.036-.34.973-2.946 9.903 1.346.401 2.937-9.872.023-.065c.382-.015.961-.024 1.561.017.627.041 1.284.126 1.718.346l.9.456.4-3.493c.021-.121.103-.649.014-1.244-.075-.502-.272-1.042-.678-1.463-.425-.441-1.085-.78-2.137-.747h-1.622a1.963 1.963 0 0 0-.32-.696c-.306-.42-.856-.842-1.906-.942l-.034-.004h-3.727c-.823-.108-1.438.043-1.884.325-.481.304-.791.769-.936 1.339l-5.802 12.856-5.796-12.858c-.142-.567-.453-1.033-.936-1.338-.448-.282-1.067-.433-1.891-.323.008-.001-3.72-.001-3.72-.001l-.033.004c-1.055.1-1.605.523-1.91.943a1.927 1.927 0 0 0-.318.695h-1.624c-1.052-.033-1.711.306-2.135.748-.405.421-.602.96-.677 1.463a4.15 4.15 0 0 0 .015 1.243ZM54.44 189.51c.064.579.169 2.996.221 4.224l-6.615.061c.176-12.088.4-18.383 2.903-35.715l-1.39-.201c-2.564 17.76-2.748 23.988-2.928 36.615l-.01.719 9.501-.089-.029-.723s-.169-4.245-.258-5.045l-1.395.154ZM65.693 181.562c.401 2.155.574 3.448.649 4.151l-5.98.051c-1.786-12.419-3.056-19.287-4.854-27.752l-1.374.292c1.822 8.574 3.099 15.504 4.925 28.266l.087.608 8.663-.074-.007-.703s-.007-1.221-.728-5.096l-1.381.257Z"></path>
  <path d="M169.517 145.812h4.008c6.013 0 12.896-.87 12.896-8.458 0-7.312-6.796-7.925-12.896-7.925h-4.008v16.383Zm-12.2-25.97h13.158c13.071 0 28.667-.429 28.667 16.471 0 7.137-4.792 13.062-12.55 14.112v.171c3.312.271 5.229 3.579 6.45 6.275l9.758 23.787h-13.592l-7.321-18.996c-1.741-4.524-3.308-6.274-8.449-6.274h-3.921v25.27h-12.2v-60.816ZM224.592 116.45h11.67v11.15h-11.67v-11.15Zm0 19.333h11.67v44.884h-11.67v-44.884ZM262.575 116.45h11.679v11.15h-11.679v-11.15Zm-7.137 74.496c6.266-.35 7.137-1.571 7.137-8.538v-46.625h11.679v48.188c0 6.362-1.829 16.029-13.508 16.029-1.917 0-4.267-.258-5.746-.692l.438-8.362ZM300.304 135.783h11.067v6.105h.175c3.658-5.142 8.625-7.146 14.725-7.146 10.629 0 15.246 7.496 15.246 17.595v28.321h-11.675V156.7c0-5.492-.088-12.9-7.579-12.9-8.455 0-10.28 9.158-10.28 14.9v21.958h-11.679v-44.875ZM367.579 115.308h11.671v65.358h-11.671zM420.988 173.163c3.579 0 6.362-1.563 8.191-4.005 1.917-2.52 2.438-5.754 2.438-9.237h-5.054c-5.225 0-12.975.871-12.975 7.758 0 3.834 3.216 5.484 7.4 5.484Zm-13.68-35.017c4.53-2.092 10.634-3.404 15.596-3.404 13.683 0 19.346 5.666 19.346 18.908v5.75c0 4.533.088 7.929.179 11.242.079 3.391.254 6.533.521 10.025h-10.288c-.429-2.363-.429-5.321-.52-6.713h-.175c-2.696 4.963-8.542 7.754-13.854 7.754-7.93 0-15.684-4.795-15.684-13.329 0-6.717 3.221-10.629 7.667-12.812 4.446-2.18 10.196-2.617 15.075-2.617h6.446c0-7.229-3.217-9.671-10.104-9.671-4.963 0-9.934 1.913-13.859 4.875l-.346-10.008ZM467.529 135.783h11.067v6.105h.171c3.662-5.142 8.633-7.146 14.729-7.146 10.629 0 15.25 7.496 15.25 17.595v28.321h-11.679V156.7c0-5.492-.088-12.9-7.575-12.9-8.459 0-10.288 9.158-10.288 14.9v21.958h-11.675v-44.875ZM553.713 172.642c7.75 0 10.283-8.188 10.283-14.55 0-6.275-2.963-14.292-10.459-14.292-7.579 0-9.67 8.288-9.67 14.292 0 6.183 2.175 14.55 9.846 14.55Zm10.712 2.962h-.171c-3.483 4.363-8.275 6.104-13.766 6.104-13.767 0-18.817-11.329-18.817-23.616 0-12.371 5.05-23.35 18.817-23.35 5.837 0 9.933 2.004 13.416 6.275h.179v-25.709h11.675v65.35h-11.333v-5.054ZM157.35 68.967h2.804v8.204h9.388v-8.204h2.812v19.62h-2.812v-8.941h-9.388v8.941h-2.804v-19.62ZM188.1 86.783c3.092 0 4.471-2.808 4.471-5.366 0-2.725-1.663-5.367-4.471-5.367-2.837 0-4.496 2.642-4.496 5.367 0 2.558 1.379 5.366 4.496 5.366Zm0-12.87c4.354 0 7.279 3.145 7.279 7.504 0 4.104-2.979 7.504-7.279 7.504-4.329 0-7.304-3.4-7.304-7.504 0-4.359 2.921-7.504 7.304-7.504ZM209.775 86.783c3.092 0 4.467-2.808 4.467-5.366 0-2.725-1.659-5.367-4.467-5.367-2.837 0-4.496 2.642-4.496 5.367 0 2.558 1.375 5.366 4.496 5.366Zm0-12.87c4.354 0 7.279 3.145 7.279 7.504 0 4.104-2.979 7.504-7.279 7.504-4.329 0-7.308-3.4-7.308-7.504 0-4.359 2.925-7.504 7.308-7.504ZM235.129 81.587c0-2.983-1.379-5.537-4.183-5.537-2.671 0-3.992 2.892-3.992 5.338 0 2.699 1.517 5.062 3.992 5.062 2.467 0 4.183-2.192 4.183-4.863Zm2.642 6.376c0 4.354-2.246 6.858-7.396 6.858-1.513 0-2.833-.196-5.138-.984l.284-2.445c2.021.925 3.229 1.296 5.167 1.296 2.783 0 4.441-1.888 4.441-4.921v-1.4h-.054c-1.125 1.487-2.979 2.212-4.808 2.212-4.1 0-6.125-3.337-6.125-7.054 0-3.675 2.079-7.612 6.404-7.612 2.533 0 3.937.925 4.725 2.475h.058V74.25h2.442v13.713ZM246.767 67.508h2.646v8.796h.049c.959-1.521 2.621-2.391 4.617-2.391 3.708 0 5.363 2.308 5.363 6.154v8.512h-2.638v-7.412c0-3.35-.737-4.975-3.037-5.117-3.005 0-4.354 2.417-4.354 5.9v6.629h-2.646V67.508ZM277.717 80.042c0-2.192-1.296-3.992-3.567-3.992-2.587 0-3.654 2.137-3.854 3.992h7.421Zm1.716 7.954c-1.012.362-2.166.925-4.525.925-5.087 0-7.421-3.092-7.421-7.754 0-4.25 2.667-7.254 6.713-7.254 4.779 0 6.325 3.487 6.325 8.095h-10.229c0 2.834 2.221 4.78 4.725 4.78 1.741 0 3.762-.905 4.412-1.438v2.646ZM297.846 80.042c0-2.192-1.292-3.992-3.571-3.992-2.588 0-3.654 2.137-3.846 3.992h7.417Zm1.712 7.954c-1.008.362-2.166.925-4.525.925-5.087 0-7.416-3.092-7.416-7.754 0-4.25 2.666-7.254 6.716-7.254 4.78 0 6.321 3.487 6.321 8.095h-10.225c0 2.834 2.221 4.78 4.717 4.78 1.741 0 3.766-.905 4.412-1.438v2.646ZM308.671 74.25h2.471v2.079h.062c1.008-1.658 2.442-2.416 4.55-2.416 1.654 0 3.313.841 4.071 2.779.988-2.05 3.15-2.779 4.442-2.779 3.654 0 4.975 2.358 4.975 5.479v9.195H326.6v-8.55c0-1.77-.421-3.987-2.558-3.987-2.7 0-3.763 2.642-3.763 5.308v7.229h-2.637v-8.55c0-1.77-.425-3.987-2.563-3.987-2.7 0-3.767 2.642-3.767 5.308v7.229h-2.641V74.25ZM338.188 74.25h2.475v2.225h.058c.7-1.496 2.221-2.562 3.737-2.562.788 0 1.18.083 1.742.195v2.367c-.479-.204-1.012-.258-1.458-.258-2.363 0-3.909 2.245-3.909 5.845v6.525h-2.645V74.25ZM362.138 81.754c-.559 0-1.121-.058-1.688-.058-1.429 0-4.967.225-4.967 2.754 0 1.517 1.459 2.333 2.667 2.333 2.613 0 3.988-1.629 3.988-3.766v-1.263Zm-7.842-6.492c1.325-.787 2.896-1.349 4.725-1.349 4.104 0 5.758 2.025 5.758 5.929v5.929c0 1.633.054 2.387.113 2.812h-2.467v-1.854h-.062c-.613.871-2.021 2.192-4.438 2.192-3.092 0-5.258-1.35-5.258-4.471 0-3.596 3.937-4.721 6.666-4.721 1.034 0 1.767 0 2.805.059 0-2.475-.901-3.738-3.538-3.738-1.492 0-3.092.562-4.158 1.463l-.146-2.251ZM382.267 81.754c-.563 0-1.125-.058-1.688-.058-1.433 0-4.971.225-4.971 2.754 0 1.517 1.459 2.333 2.671 2.333 2.613 0 3.988-1.629 3.988-3.766v-1.263Zm-7.838-6.492c1.317-.787 2.892-1.349 4.717-1.349 4.104 0 5.762 2.025 5.762 5.929v5.929c0 1.633.059 2.387.117 2.812h-2.475v-1.854h-.058c-.617.871-2.025 2.192-4.434 2.192-3.091 0-5.262-1.35-5.262-4.471 0-3.596 3.933-4.721 6.662-4.721 1.042 0 1.771 0 2.809.059 0-2.475-.896-3.738-3.542-3.738-1.487 0-3.083.562-4.158 1.463l-.138-2.251ZM399.696 86.783c2.979 0 4.217-2.95 4.217-5.337 0-2.671-1.375-5.396-4.242-5.396s-3.988 2.696-3.938 5.308c-.05 2.25 1.125 5.425 3.963 5.425Zm4.329-.225h-.054c-.7 1.067-2.338 2.363-4.888 2.363-4.329 0-6.158-3.85-6.158-7.758 0-3.85 2.021-7.25 6.183-7.25 2.5 0 3.938.983 4.746 2.304h.059v-8.713h2.641v21.083h-2.529v-2.029ZM414.487 85.771c1.038.675 2.53 1.012 3.288 1.012 1.208 0 2.7-.508 2.7-2.054 0-2.608-6.213-2.387-6.213-6.404 0-2.975 2.221-4.412 5.059-4.412 1.237 0 2.25.254 3.292.566l-.225 2.3c-.596-.366-2.167-.729-2.784-.729-1.35 0-2.533.558-2.533 1.742 0 2.921 6.212 2.079 6.212 6.662 0 3.059-2.441 4.467-5.004 4.467-1.346 0-2.725-.138-3.933-.792l.141-2.358ZM440.096 76.667c-1.013-.421-2.025-.617-2.867-.617-2.954 0-4.608 2.642-4.608 5.367 0 2.554 1.375 5.366 4.779 5.366.896 0 2.021-.279 2.837-.816l.196 2.362c-1.095.504-2.362.592-3.316.592-4.329 0-7.309-3.4-7.309-7.504 0-4.359 2.921-7.504 7.309-7.504 1.066 0 2.446.254 3.208.562l-.229 2.192ZM447.967 67.508h2.641v8.796h.059c.954-1.521 2.612-2.391 4.604-2.391 3.712 0 5.371 2.308 5.371 6.154v8.512h-2.638v-7.412c0-3.35-.737-4.975-3.041-5.117-3.005 0-4.355 2.417-4.355 5.9v6.629h-2.641V67.508ZM478.158 81.754c-.562 0-1.125-.058-1.691-.058-1.429 0-4.975.225-4.975 2.754 0 1.517 1.466 2.333 2.675 2.333 2.612 0 3.991-1.629 3.991-3.766v-1.263Zm-7.845-6.492c1.325-.787 2.895-1.349 4.725-1.349 4.104 0 5.758 2.025 5.758 5.929v5.929c0 1.633.054 2.387.112 2.812h-2.475v-1.854h-.054c-.621.871-2.021 2.192-4.437 2.192-3.088 0-5.259-1.35-5.259-4.471 0-3.596 3.938-4.721 6.667-4.721 1.033 0 1.767 0 2.808.059 0-2.475-.904-3.738-3.541-3.738-1.488 0-3.092.562-4.159 1.463l-.145-2.251ZM496.654 76.05c-2.862 0-4.241 2.725-4.241 5.392 0 2.391 1.229 5.346 4.212 5.346 2.838 0 4.021-3.184 3.958-5.43.063-2.583-1.062-5.308-3.929-5.308Zm-6.883-1.8h2.529v2.025h.054c.704-1.067 2.329-2.358 4.863-2.358 4.158 0 6.183 3.4 6.183 7.25 0 3.933-1.829 7.754-6.15 7.754-2.533 0-3.967-.984-4.783-2.304h-.054v7.866h-2.642V74.25ZM530.1 88.583h-3.137l-5.146-14.333h2.887l3.884 11.692h.054l3.962-11.692h2.642L530.1 88.583ZM550.821 81.754c-.563 0-1.121-.058-1.684-.058-1.433 0-4.975.225-4.975 2.754 0 1.517 1.463 2.333 2.671 2.333 2.613 0 3.988-1.629 3.988-3.766v-1.263Zm-7.842-6.492c1.321-.787 2.9-1.349 4.725-1.349 4.1 0 5.763 2.025 5.763 5.929v5.929c0 1.633.054 2.387.112 2.812h-2.475v-1.854h-.054c-.621.871-2.029 2.192-4.438 2.192-3.091 0-5.258-1.35-5.258-4.471 0-3.596 3.934-4.721 6.658-4.721 1.042 0 1.776 0 2.809.059 0-2.475-.896-3.738-3.542-3.738-1.487 0-3.087.562-4.158 1.463l-.142-2.251ZM562.438 74.25h2.55v2.275h.062c.787-1.629 2.7-2.612 4.696-2.612 3.708 0 5.362 2.304 5.362 6.154v8.52h-2.637v-7.42c0-3.35-.734-4.98-3.038-5.117-3.004 0-4.354 2.412-4.354 5.9v6.637h-2.641V74.25ZM64.908 117.258V131.4c0 12.463-8.291 16.529-13.625 16.554-5.333-.025-13.625-4.091-13.625-16.554v-14.15l27.25.008Zm-13.03 15.969h-.584l-3.684 3.684v4.795h-3.662v2.652h1.054v-1.598h3.663v-5.413l3.066-3.066h.892v2.679l3.758 3.758v.892h-3.662v2.748h1.054v-1.693h3.662v-2.383l-3.758-3.759v-2.987l-2.563-2.563-.745.746 1.509 1.508Zm-5.015-5.206-.598.598v3.166h-2.7v3.123h1.054v-2.068h2.487l2.987-2.988h3.732v-1.054h-4.168l-2.338 2.338v-2.08l2.578-2.579h4.051l2.175-2.184-.746-.744-1.867 1.874h-1.954v-.313h1.804v-1.918h-1.054v.864h-1.804v1.367h-1.041l-1.853 1.852-3.473-3.472v-2.055h1.882v-1.054h-2.936v3.545l3.782 3.782Zm11.672 6.202 1.409-1.404v-4.1l-1.254-1.254v-5.538l1.041-1.042h1.132v-1.054h-1.569l-1.659 1.659v6.412l1.255 1.254v3.225l-1.1 1.096.745.746Zm-7.585-12.129h-2.573V120.3h-1.054v2.848h3.627v-1.054Zm-.598-1.002v-.677h2.826l.962-.971h2.481v-1.054h-2.92l-.962.97h-3.441v1.732h1.054Z"></path>
</svg>