{
    "components": {
        "schemas": {
            "EntityTotalResultCount": {
                "properties": {
                    "data": {
                        "description": "Count of results of query",
                        "properties": {
                            "attributes": {
                                "properties": {
                                    "total_results": {
                                        "minimum": 0,
                                        "title": "Total number of results",
                                        "type": "integer"
                                    }
                                },
                                "required": [
                                    "total_results"
                                ],
                                "type": "object"
                            },
                            "id": {
                                "format": "uuid",
                                "type": "string"
                            },
                            "links": {
                                "properties": {
                                    "self": {
                                        "example": "/api/v2/get_something?uuid=1a2b3c4d-1a2b-1a2b-1a2b-1a2b3c4d5e6f",
                                        "pattern": "^/api/v2/.*$",
                                        "type": "string"
                                    }
                                },
                                "type": "object"
                            },
                            "meta": {
                                "properties": {
                                    "summary": {
                                        "description": "Human readable summary of the content of the object",
                                        "title": "Summary of the subject",
                                        "type": "string"
                                    }
                                },
                                "type": "object"
                            },
                            "relationships": {
                                "properties": {},
                                "type": "object"
                            },
                            "type": {
                                "enum": [
                                    "result_count"
                                ],
                                "example": "result_count",
                                "type": "string"
                            }
                        },
                        "required": [
                            "type",
                            "id",
                            "attributes"
                        ],
                        "title": "TotalResultCount",
                        "type": "object"
                    },
                    "links": {
                        "properties": {
                            "self": {
                                "example": "/api/v2/get_something?uuid=1a2b3c4d-1a2b-1a2b-1a2b-1a2b3c4d5e6f",
                                "pattern": "^/api/v2/.*$",
                                "type": "string"
                            }
                        },
                        "type": "object"
                    }
                },
                "required": [
                    "data",
                    "links"
                ],
                "type": "object"
            }
        }
    }
}