<?xml version="1.0" encoding="utf-8"?>
<!-- Generator: Adobe Illustrator 26.3.1, SVG Export Plug-In . SVG Version: 6.00 Build 0)  -->
<svg version="1.1" id="Layer_1" xmlns="http://www.w3.org/2000/svg" xmlns:xlink="http://www.w3.org/1999/xlink" x="0px" y="0px"
	 viewBox="0 0 525.7217407 162.5000153" style="enable-background:new 0 0 525.7217407 162.5000153;" xml:space="preserve">
<style type="text/css">
	.st0{fill:#AA004A;}
	.st1{fill:#525D75;}
</style>
<g>
	<path class="st0" d="M74.1217651,71.1999969c5.1000061-3.8000031,10.3000031-7.8000031,15.3999939-11.8999939
		C117.221756,36.5,119.4217529,13.2000046,119.6217651,0.1000061h-13.6999969
		c-0.1999969,11.4000015-2.1999969,29.8000031-25.1000061,48.5999985c-4.8999939,4-10,7.8000031-14.9000015,11.5999985
		c-24.0999985,18.1999969-49,37-49,76.1000061v11.7999878l13.6999969,3.6000061v-15.3999939
		C30.5217686,104,50.7217636,88.8000031,74.1217651,71.1999969z"/>
	<path class="st0" d="M93.021759,85c2.8999939-2.1000061,5.8000031-4.3000031,8.6000061-6.5
		c9.6999969-7.3999939,17.6000061-15.1999969,23.6999969-23.3000031v-30c-2.5,9.1999969-9,24.6999969-32,42.3999939
		c-2.8000031,2.1999969-5.6999969,4.3000031-8.5,6.3999939c-21.8000031,16.1999969-44.4000015,32.8999939-44.4000015,64.6999969
		v15.6999969l13.6999969,3.6000061v-19.3999939C54.2217636,113.8000031,72.2217636,100.5,93.021759,85z"/>
	<path class="st0" d="M109.021759,101.1999969c1.6000061-1.1000061,3.1999969-2.1999969,4.8000031-3.3999939
		c4.3000031-3,8.1000061-6,11.5-8.8999939V70.3000031c-4.8999939,5-11.1999969,10.5-19.3999939,16.3000031
		c-1.6000061,1.1000061-3.1999969,2.1999969-4.8000031,3.3000031c-18.1999969,12.6999969-37,25.8000031-37,51.1000061v19.6999969
		l6.8000031,1.8000031l6.8999939-1.8000031v-19.6000061C77.9217682,122.8999939,91.7217712,113.3000031,109.021759,101.1999969z"/>
	<path class="st0" d="M122.4217682,119.8999939c1-0.6999969,1.8999939-1.3999939,2.8999939-2.1000061v-16.8999939
		c-2.3000031,1.6999969-4.6999969,3.5-7.1999969,5.3000031c-1.1999969,0.8999939-2.3999939,1.6999969-3.6000061,2.6000061
		c-14.8999939,10.5-26.6000061,18.8000031-26.6000061,35.6000061v13.8000031l13.6999969-3.6000061v-10.1999969
		C101.6217651,135,107.6217651,130.3000031,122.4217682,119.8999939z"/>
	<path class="st0" d="M123.2217712,129.8000031c-7.8999939,5.8999939-11.5,8.6000061-11.5,16v5.8999939l13.6999969-3.6000061
		v-2.3000031c0-0.1000061,0-0.1999969,0-0.3000031l0,0v-17.2999878
		C124.6217651,128.6999969,123.9217682,129.3000031,123.2217712,129.8000031z"/>
	<path class="st0" d="M57.0217667,0.0999985l-0.9000015,2.5999985H17.0217686v16.5999985
		c0,7.3000031,5.5,8.5999985,9.5999985,8.5999985c0,0,7.3000011,0,13.699995,0c5,0,13.5,3.3000031,13.5,12.5999985
		c0,3.5999985-2.0999985,9.0999985-8.0999985,9.0999985c-6.3000031,0-8.5999985-3.3000031-8.9000015-5.1999969H17.0217686
		v15.3000031l29.4999981,4.1000061C71.4217682,43.2000046,96.8217621,32.4000015,96.8217621,0H57.0217667V0.0999985z
		 M59.6217651,20.5999985V8.8999939l16.8000031,0.0999985C76.521759,9,71.7217636,18.0999985,59.6217651,20.5999985z"/>
	<g>
		<path class="st1" d="M150.3217621,38.3999939c-0.3000031,0-0.6000061-0.1999969-0.6000061-0.5999985V0.5999985
			C149.721756,0.2999954,149.9217529,0,150.3217621,0h14.3999939c7.3999939,0,12.6000061,4.8000031,12.6000061,11.9000015
			c0,7.1999969-5.1999969,12-12.6000061,12h-8c-0.1999969,0-0.3000031,0.0999985-0.3000031,0.3000031v13.5999985
			c0,0.3000031-0.1999969,0.5999985-0.6000061,0.5999985C155.8217468,38.4000015,150.3217621,38.4000015,150.3217621,38.3999939z
			 M170.7217712,12c0-3.5-2.3999939-5.9000015-6.3999939-5.9000015h-7.6000061
			c-0.1999969,0-0.3000031,0.0999985-0.3000031,0.3000031v11.1999969c0,0.1999969,0.1000061,0.3000031,0.3000031,0.3000031
			h7.6000061C168.3217621,17.8999939,170.7217712,15.5,170.7217712,12z"/>
		<path class="st1" d="M184.021759,38.3999939c-0.3000031,0-0.6000061-0.1999969-0.6000061-0.5999985v-26
			c0-0.3000031,0.1999969-0.5999985,0.6000061-0.5999985h5.1999969c0.3000031,0,0.6000061,0.1999969,0.6000061,0.5999985v2.3000031
			h0.1000061c1.3000031-2.0999985,3.6000061-3.5,7.1000061-3.5c2.1000061,0,4.3000031,0.8000031,5.6999969,2.3000031
			c0.2999878,0.3000031,0.2999878,0.5,0.1000061,0.8000031l-3,3.8000031c-0.1999969,0.3000031-0.5,0.3000031-0.8000031,0.0999985
			c-1.1999969-0.8000031-2.5-1.3000031-4-1.3000031c-3.6000061,0-5.1000061,2.5-5.1000061,6.9000015v14.6999969
			c0,0.3000031-0.1999969,0.5999985-0.6000061,0.5999985h-5.3000031V38.3999939z"/>
		<path class="st1" d="M206.1217651,31.5999985c-0.6000061-1.9000015-0.8999939-3.6999969-0.8999939-6.6999969
			s0.2999878-4.8000031,0.8999939-6.6999969c1.5-4.6999969,5.7000122-7.5,11.2000122-7.5s9.6000061,2.8000031,11.2000122,7.5
			c0.6000061,1.9000015,0.8999939,3.6999969,0.8999939,6.6999969s-0.2999878,4.8000031-0.8999939,6.6999969
			c-1.5,4.6999969-5.7000122,7.5-11.2000122,7.5S207.7217712,36.2999954,206.1217651,31.5999985z M222.4217529,29.8999939
			c0.5-1.4000015,0.6000061-2.6999969,0.6000061-5s-0.1000061-3.5999985-0.6000061-5
			c-0.7999878-2.3000031-2.5-3.5999985-5.1000061-3.5999985s-4.2999878,1.3000031-5.1000061,3.5999985
			c-0.5,1.5-0.6000061,2.6999969-0.6000061,5s0.1000061,3.5999985,0.6000061,5
			c0.7999878,2.3000031,2.6000061,3.5999985,5.1000061,3.5999985S221.7217712,32.0999985,222.4217529,29.8999939z"/>
		<path class="st1" d="M243.6217651,38.3999939c-0.3999939,0-0.6000061-0.1999969-0.7000122-0.5999985l-9.6000061-26.0999985
			c-0.1000061-0.3000031,0.1000061-0.5999985,0.5-0.5999985h5.5c0.2999878,0,0.6000061,0.1999969,0.7000122,0.5999985l6,17.6999969
			h0.1000061l5.8999939-17.6999969c0.1000061-0.3000031,0.2999878-0.5999985,0.7000122-0.5999985h5.3999939
			c0.2999878,0,0.6000061,0.1999969,0.5,0.5999985l-9.6000061,26.0999985
			c-0.1000061,0.3000031-0.2999878,0.5999985-0.7000122,0.5999985H243.6217651z"/>
		<path class="st1" d="M264.2217712,6.0999985c-0.2999878,0-0.6000061-0.1999969-0.6000061-0.5999985V0.5999985
			C263.6217651,0.2999954,263.8217773,0,264.2217712,0h5.2000122c0.2999878,0,0.6000061,0.1999969,0.6000061,0.5999985V5.5
			c0,0.3000031-0.2000122,0.5999985-0.6000061,0.5999985H264.2217712z M264.2217712,38.3999939
			c-0.2999878,0-0.6000061-0.1999969-0.6000061-0.5999985v-26c0-0.3000031,0.2000122-0.5999985,0.6000061-0.5999985h5.2000122
			c0.2999878,0,0.6000061,0.1999969,0.6000061,0.5999985v26.0999985c0,0.3000031-0.2000122,0.5999985-0.6000061,0.5999985
			h-5.2000122V38.3999939z"/>
		<path class="st1" d="M295.4217529,38.3999939c-0.2999878,0-0.6000061-0.1999969-0.6000061-0.5999985V22.1999969
			c0-3.5-1.7000122-5.9000015-5.1000061-5.9000015c-3.2999878,0-5.2000122,2.4000015-5.2000122,5.9000015v15.6999969
			c0,0.3000031-0.2000122,0.5999985-0.6000061,0.5999985h-5.2000122c-0.2999878,0-0.6000061-0.1999969-0.6000061-0.5999985
			V11.7999954c0-0.3000031,0.2000122-0.5999985,0.6000061-0.5999985h5.2000122c0.2999878,0,0.6000061,0.1999969,0.6000061,0.5999985
			v2h0.1000061c1.2000122-1.6999969,3.6000061-3.1999969,7.2000122-3.1999969c5.7999878,0,9.3999939,4.3000031,9.3999939,10.0999985
			v17.1999969c0,0.3000031-0.2000122,0.5999985-0.6000061,0.5999985h-5.1999817V38.3999939z"/>
		<path class="st1" d="M308.521759,31.5999985c-0.6000061-1.6999969-0.7999878-3.8000031-0.7999878-6.6999969
			c0-2.9000015,0.2999878-5,0.7999878-6.6999969c1.6000061-4.9000015,5.7999878-7.5,11.2000122-7.5
			c4.1000061,0,7.2999878,1.5999985,9.3999939,4.1999969c0.2000122,0.1999969,0.2000122,0.5999985-0.1000061,0.8000031
			l-3.6000061,3.0999985C325.1217651,19,324.8217468,19,324.6217651,18.7000046c-1.3999939-1.5-2.7999878-2.4000015-5-2.4000015
			c-2.3999939,0-4.2999878,1.1999969-5.1000061,3.5999985c-0.5,1.4000015-0.6000061,2.9000015-0.6000061,5
			S314.021759,28.5999985,314.521759,30c0.7999878,2.3000031,2.7000122,3.5,5.1000061,3.5
			c2.2999878,0,3.7000122-0.8000031,5-2.4000015c0.2000122-0.3000031,0.5-0.3000031,0.7999878-0.0999985l3.6000061,3.0999985
			c0.2999878,0.1999969,0.2000122,0.5,0.1000061,0.8000031c-2.1000061,2.5-5.3999939,4.1999969-9.3999939,4.1999969
			C314.2217712,39.0999985,310.1217651,36.3999939,308.521759,31.5999985z"/>
		<path class="st1" d="M336.521759,6.0999985c-0.2999878,0-0.6000061-0.1999969-0.6000061-0.5999985V0.5999985
			C335.9217529,0.2999954,336.1217651,0,336.521759,0h5.2000122c0.2999878,0,0.6000061,0.1999969,0.6000061,0.5999985V5.5
			c0,0.3000031-0.2000122,0.5999985-0.6000061,0.5999985H336.521759z M336.521759,38.3999939
			c-0.2999878,0-0.6000061-0.1999969-0.6000061-0.5999985v-26c0-0.3000031,0.2000122-0.5999985,0.6000061-0.5999985h5.2000122
			c0.2999878,0,0.6000061,0.1999969,0.6000061,0.5999985v26.0999985c0,0.3000031-0.2000122,0.5999985-0.6000061,0.5999985
			h-5.2000122V38.3999939z"/>
		<path class="st1" d="M350.021759,31.5c-0.6000061-1.6999969-1-3.8000031-1-6.6999969c0-2.8000031,0.2999878-5,0.8999939-6.6999969
			c1.5-4.6999969,5.7000122-7.5,11.1000061-7.5c5.6000061,0,9.6000061,2.9000015,11.2000122,7.5
			c0.6000061,1.9000015,0.8999939,3.8000031,0.8999939,8.1999969c0,0.3000031-0.2000122,0.5999985-0.6000061,0.5999985h-16.7999878
			c-0.2000122,0-0.2999878,0.0999985-0.2999878,0.3000031c0,0.8000031,0.2000122,1.5,0.3999939,2.0999985
			c0.8999939,2.6999969,3,4.0999985,6.1000061,4.0999985c3,0,5-1.0999985,6.3999939-2.5999985
			C368.6217651,30.5,368.9217834,30.5,369.1217651,30.7000046l3.2999878,2.9000015
			c0.2999878,0.1999969,0.2999878,0.5,0.1000061,0.8000031c-2.2999878,2.6999969-6.2000122,4.5999985-11.2000122,4.5999985
			C355.521759,39.0999985,351.521759,36.1999969,350.021759,31.5z M366.4217529,19.5
			c-0.7000122-2.1999969-2.7999878-3.5-5.2999878-3.5c-2.6000061,0-4.6000061,1.3000031-5.3999939,3.5
			c-0.2000122,0.6999969-0.2999878,1.4000015-0.2999878,2.3000031c0,0.1999969,0.1000061,0.3000031,0.2999878,0.3000031h10.7000122
			c0.2000122,0,0.2999878-0.0999985,0.2999878-0.3000031C366.7217712,20.7999954,366.6217651,20.1999969,366.4217529,19.5z"/>
	</g>
	<g>
		<path class="st1" d="M149.6217651,128.3000031c-0.6999969,0-1.1000061-0.5-1.1000061-1.1000061V117.5
			c0-0.5,0.1000061-0.8000031,0.3000031-1.1999969l34.5999908-52.3999939v-0.1999969h-32.6000061
			c-0.6999969,0-1.1000061-0.5-1.1000061-1.1000061v-9.6999969c0-0.6999969,0.5-1.0999985,1.1000061-1.0999985h46.5
			c0.6999969,0,1.1000061,0.5,1.1000061,1.0999985v9.6999969c0,0.5-0.1000061,0.8000031-0.3000031,1.1000061l-34.5999908,52.5
			v0.1999969h33.8000031c0.6999969,0,1.1000061,0.5,1.1000061,1.1000061v9.6999969c0,0.6999969-0.5,1.1000061-1.1000061,1.1000061
			h-47.6999969V128.3000031z"/>
		<path class="st1" d="M208.6217651,114.3999939c-1.1000061-3.5-1.8999939-7.6999969-1.8999939-13.3000031
			s0.7000122-9.8999939,1.7999878-13.3999939c3-9.5,11.3999939-15,22.2000122-15c11.2000122,0,19.2999878,5.8000031,22.2999878,15
			c1.2000122,3.8000031,1.7999878,7.6000061,1.7999878,16.3999939c0,0.6999969-0.5,1.1000061-1.2000122,1.1000061h-33.5
			c-0.5,0-0.7000122,0.1999969-0.7000122,0.6999969c0,1.6000061,0.2999878,2.8999939,0.7999878,4.1999969
			c1.7999878,5.3000031,6.1000061,8.1999969,12.2000122,8.1999969s10-2.3000031,12.7000122-5.1999969
			c0.6000061-0.6000061,1.1000061-0.6999969,1.7000122-0.1999969l6.7000122,5.8999939
			c0.6000061,0.5,0.6000061,1,0.1000061,1.6000061c-4.6000061,5.3999939-12.2999878,9.1999969-22.2999878,9.1999969
			C219.8217773,129.5,211.6217651,123.8999939,208.6217651,114.3999939z M241.4217529,90.3999939c-1.5-4.3999939-5.5-7-10.6000061-7
			c-5.2000122,0-9.2000122,2.6000061-10.7000122,7c-0.5,1.3999939-0.7000122,2.6999969-0.7000122,4.6000061
			c0,0.5,0.2000122,0.6999969,0.7000122,0.6999969h21.2999878c0.5,0,0.7000122-0.1999969,0.7000122-0.6999969
			C242.1217651,93.0999908,241.9217529,91.8000031,241.4217529,90.3999939z"/>
		<path class="st1" d="M267.3217773,114.3999939c-1.1000061-3.5-1.8999939-7.6999969-1.8999939-13.3000031
			s0.7000122-9.8999939,1.7999878-13.3999939c3-9.5,11.3999939-15,22.2000122-15c11.2000122,0,19.2999878,5.8000031,22.2999878,15
			c1.2000122,3.8000031,1.7999878,7.6000061,1.7999878,16.3999939c0,0.6999969-0.5,1.1000061-1.2000122,1.1000061h-33.5
			c-0.5,0-0.7000122,0.1999969-0.7000122,0.6999969c0,1.6000061,0.2999878,2.8999939,0.7999878,4.1999969
			c1.7999878,5.3000031,6.1000061,8.1999969,12.2000122,8.1999969s10-2.3000031,12.7000122-5.1999969
			c0.6000061-0.6000061,1.1000061-0.6999969,1.7000122-0.1999969l6.7000122,5.8999939
			c0.6000061,0.5,0.6000061,1,0.1000061,1.6000061c-4.6000061,5.3999939-12.2999878,9.1999969-22.2999878,9.1999969
			C278.521759,129.5,270.4217529,123.8999939,267.3217773,114.3999939z M300.2217712,90.3999939c-1.5-4.3999939-5.5-7-10.6000061-7
			c-5.2000122,0-9.2000122,2.6000061-10.7000122,7c-0.5,1.3999939-0.7000122,2.6999969-0.7000122,4.6000061
			c0,0.5,0.2000122,0.6999969,0.7000122,0.6999969h21.2999878c0.5,0,0.7000122-0.1999969,0.7000122-0.6999969
			C300.8217773,93.0999908,300.6217651,91.8000031,300.2217712,90.3999939z"/>
		<path class="st1" d="M341.8217773,129c-10.6000061,0-14.8999939-5.1000061-14.8999939-15.6000061V52.6999969
			c0-0.6999969,0.5-1.0999985,1.1000061-1.0999985h10.3999939c0.7000122,0,1.1000061,0.5,1.1000061,1.0999985v60
			c0,3.6999969,1.5,5,4.7000122,5h2.5c0.7000122,0,1.1000061,0.5,1.1000061,1.1000061v9
			c0,0.6999969-0.5,1.1000061-1.1000061,1.1000061h-4.9000244V129z"/>
		<path class="st1" d="M392.3217773,128.3000031c-0.7000122,0-1.1000061-0.5-1.1000061-1.1000061v-4h-0.1000061
			C388.521759,126.8999939,383.4217529,129.5,375.8217773,129.5c-9.8999939,0-18.2999878-5.1999969-18.2999878-16.6000061
			c0-11.8000031,8.2999878-17.3000031,21.7999878-17.3000031h11.1000061c0.5,0,0.7000122-0.1999969,0.7000122-0.6999969v-2.6000061
			c0-6.1999969-2.8999939-9-12.1000061-9c-6.1000061,0-9.7999878,1.6999969-12.3999939,3.6999969
			c-0.6000061,0.5-1.2000122,0.3000031-1.6000061-0.1999969l-4.2000122-7.3999939
			c-0.2999878-0.6000061-0.2000122-1.1000061,0.2000122-1.5c4.3999939-3.1999969,10.3999939-5.3000031,19.2999878-5.3000031
			c16.6000061,0,22.7000122,5.6000061,22.7000122,18.8999939v35.7000122c0,0.6999969-0.5,1.1000061-1.1000061,1.1000061H392.3217773
			z M390.9217529,110v-4.1999969c0-0.5-0.2000122-0.6999969-0.7000122-0.6999969h-9
			c-8.1000061,0-11.7000122,2.3000031-11.7000122,7.3000031c0,4.5,3.2999878,6.8000031,9.3999939,6.8000031
			C386.6217651,119.3000031,390.9217529,116.1999969,390.9217529,110z"/>
		<path class="st1" d="M453.3217773,128.3000031c-0.7000122,0-1.1000061-0.5-1.1000061-1.1000061V95.8999939
			c0-7-3.5-11.8000031-10.2999878-11.8000031c-6.5,0-10.3999939,4.8000031-10.3999939,11.8000031v31.3000031
			c0,0.6999969-0.5,1.1000061-1.1000061,1.1000061h-10.3999939c-0.7000122,0-1.1000061-0.5-1.1000061-1.1000061V75.0999908
			c0-0.6999969,0.5-1.1000061,1.1000061-1.1000061h10.3999939c0.7000122,0,1.1000061,0.5,1.1000061,1.1000061v3.8999939h0.1000061
			c2.3999939-3.3999939,7.1000061-6.3000031,14.2999878-6.3000031c11.6000061,0,18.8000183,8.6000061,18.8000183,20.1999969
			v34.3000183c0,0.6999969-0.5,1.1000061-1.0999756,1.1000061H453.3217773z"/>
		<path class="st1" d="M514.2217407,128.3000031c-0.7000122,0-1.0999756-0.5-1.0999756-1.1000061v-4.1000061h-0.0999756
			c-2.5999756,3.6999969-7.0999756,6.3999939-14.4000244,6.3999939c-9.2000122,0-16-4.3999939-18.7999878-13.1000061
			c-1.4000244-4.1999969-1.9000244-8-1.9000244-15.3000031s0.5999756-11.1999969,1.9000244-15.3000031
			c2.7999878-8.6999969,9.5999756-13.1000061,18.7999878-13.1000061c7.2999878,0,11.7999878,2.6999969,14.4000244,6.3999939
			h0.0999756V52.6999588c0-0.6999969,0.5-1.0999985,1.0999756-1.0999985h10.4000244c0.7000122,0,1.0999756,0.5,1.0999756,1.0999985
			v74.5000381c0,0.6999969-0.5,1.1000061-1.0999756,1.1000061H514.2217407z M511.9217529,111.3000031
			c0.7999878-2.5,1.0999756-5.1999969,1.0999756-10.1000061c0-5-0.2999878-7.6999969-1.0999756-10.1000061
			c-1.5-4.5-5-7-10.0999756-7s-8.5999756,2.5-10,7c-0.7999878,2.5-1.0999756,5.1999969-1.0999756,10.1000061
			c0,5,0.2999878,7.6999969,1.0999756,10.1000061c1.5,4.5,5,7,10,7
			C507.0217896,118.3000031,510.5217896,115.8000031,511.9217529,111.3000031z"/>
	</g>
	<g>
		<path class="st0" d="M45.7217636,43.6999969c-1.6999969,0-2.6999969-1.1999969-3.0999985-3
			c-0.1999969-0.6999969-0.9000015-1.5-2.4000015-1.5h-1.6999969H18.621767c-15.0999985,0-18-10.3000031-18.5999985-15.6999969
			c-0.2000008-1.6999969,1-3.0999985,2.7000008-3.3000031c1.5999985-0.1999969,3,1,3.2999992,2.6999969
			c0.2000008,1.0999985,1.5,10.1999969,12.5999985,10.1999969h19.8000011
			c0.9000015-0.0999985,5.4000015-0.1999969,8.0999985,2.4000015c1.4000015,1.3000031,2,2.8000031,2.0999985,5
			C48.7217636,42.0999985,47.3217621,43.6999969,45.7217636,43.6999969z"/>
	</g>
</g>
</svg>
