{
  "components": {
    "schemas": {
      "CaseFilter": {
        "additionalProperties": false,
        "properties": {
          "attributes.archival_state": {
            "items": {
              "$ref": "#/components/schemas/ValidCaseArchivalState"
            },
            "type": "array",
            "uniqueItems": true
          },
          "attributes.case_location": {
            "$ref": "#/components/schemas/FilterMultipleValuesWithOperator_str_"
          },
          "attributes.case_number": {
            "items": {
              "type": "integer"
            },
            "title": "Attributes.Case Number",
            "type": "array"
          },
          "attributes.case_phase": {
            "$ref": "#/components/schemas/FilterMultipleValuesWithOperator_str_"
          },
          "attributes.case_price": {
            "$ref": "#/components/schemas/FilterMultipleValuesWithOperator_Union_ConstrainedStrValue__list_pydantic.v1.types.ConstrainedStrValue___"
          },
          "attributes.channel_of_contact": {
            "items": {
              "$ref": "#/components/schemas/ValidContactChannel"
            },
            "type": "array",
            "uniqueItems": true
          },
          "attributes.completion_date": {
            "items": {
              "anyOf": [
                {
                  "pattern": "^(lt|le|gt|ge|eq|ne) ",
                  "type": "string"
                },
                {
                  "items": {
                    "pattern": "^(lt|le|gt|ge|eq|ne) ",
                    "type": "string"
                  },
                  "type": "array"
                }
              ]
            },
            "title": "Attributes.Completion Date",
            "type": "array"
          },
          "attributes.confidentiality": {
            "items": {
              "$ref": "#/components/schemas/ValidCaseConfidentiality"
            },
            "type": "array",
            "uniqueItems": true
          },
          "attributes.custom_number": {
            "items": {
              "type": "string"
            },
            "title": "Attributes.Custom Number",
            "type": "array"
          },
          "attributes.department_role": {
            "$ref": "#/components/schemas/FilterMultipleValuesWithOperator_DepartmentRoleTypedDict_"
          },
          "attributes.destruction_date": {
            "items": {
              "anyOf": [
                {
                  "pattern": "^(lt|le|gt|ge|eq|ne) ",
                  "type": "string"
                },
                {
                  "items": {
                    "pattern": "^(lt|le|gt|ge|eq|ne) ",
                    "type": "string"
                  },
                  "type": "array"
                }
              ]
            },
            "title": "Attributes.Destruction Date",
            "type": "array"
          },
          "attributes.external_reference": {
            "$ref": "#/components/schemas/FilterMultipleValuesWithOperator_str_"
          },
          "attributes.last_modified": {
            "items": {
              "anyOf": [
                {
                  "pattern": "^(lt|le|gt|ge|eq|ne) ",
                  "type": "string"
                },
                {
                  "items": {
                    "pattern": "^(lt|le|gt|ge|eq|ne) ",
                    "type": "string"
                  },
                  "type": "array"
                }
              ]
            },
            "title": "Attributes.Last Modified",
            "type": "array"
          },
          "attributes.num_unaccepted_files": {
            "items": {
              "anyOf": [
                {
                  "pattern": "^(lt|le|gt|ge|eq|ne) ",
                  "type": "string"
                },
                {
                  "items": {
                    "pattern": "^(lt|le|gt|ge|eq|ne) ",
                    "type": "string"
                  },
                  "type": "array"
                }
              ]
            },
            "title": "Attributes.Num Unaccepted Files",
            "type": "array"
          },
          "attributes.num_unaccepted_updates": {
            "items": {
              "anyOf": [
                {
                  "pattern": "^(lt|le|gt|ge|eq|ne) ",
                  "type": "string"
                },
                {
                  "items": {
                    "pattern": "^(lt|le|gt|ge|eq|ne) ",
                    "type": "string"
                  },
                  "type": "array"
                }
              ]
            },
            "title": "Attributes.Num Unaccepted Updates",
            "type": "array"
          },
          "attributes.num_unread_messages": {
            "items": {
              "anyOf": [
                {
                  "pattern": "^(lt|le|gt|ge|eq|ne) ",
                  "type": "string"
                },
                {
                  "items": {
                    "pattern": "^(lt|le|gt|ge|eq|ne) ",
                    "type": "string"
                  },
                  "type": "array"
                }
              ]
            },
            "title": "Attributes.Num Unread Messages",
            "type": "array"
          },
          "attributes.number_master": {
            "items": {
              "type": "integer"
            },
            "title": "Attributes.Number Master",
            "type": "array"
          },
          "attributes.parent_number": {
            "items": {
              "type": "integer"
            },
            "title": "Attributes.Parent Number",
            "type": "array"
          },
          "attributes.payment_status": {
            "items": {
              "$ref": "#/components/schemas/ValidCasePaymentStatus"
            },
            "type": "array",
            "uniqueItems": true
          },
          "attributes.period_of_preservation_active": {
            "title": "Attributes.Period Of Preservation Active",
            "type": "boolean"
          },
          "attributes.registration_date": {
            "items": {
              "anyOf": [
                {
                  "pattern": "^(lt|le|gt|ge|eq|ne) ",
                  "type": "string"
                },
                {
                  "items": {
                    "pattern": "^(lt|le|gt|ge|eq|ne) ",
                    "type": "string"
                  },
                  "type": "array"
                }
              ]
            },
            "title": "Attributes.Registration Date",
            "type": "array"
          },
          "attributes.result": {
            "items": {
              "$ref": "#/components/schemas/ValidCaseResult"
            },
            "type": "array",
            "uniqueItems": true
          },
          "attributes.retention_period_source_date": {
            "items": {
              "$ref": "#/components/schemas/ValidCaseRetentionPeriodSourceDate"
            },
            "type": "array"
          },
          "attributes.stalled_since": {
            "items": {
              "anyOf": [
                {
                  "pattern": "^(lt|le|gt|ge|eq|ne) ",
                  "type": "string"
                },
                {
                  "items": {
                    "pattern": "^(lt|le|gt|ge|eq|ne) ",
                    "type": "string"
                  },
                  "type": "array"
                }
              ]
            },
            "title": "Attributes.Stalled Since",
            "type": "array"
          },
          "attributes.stalled_until": {
            "items": {
              "anyOf": [
                {
                  "pattern": "^(lt|le|gt|ge|eq|ne) ",
                  "type": "string"
                },
                {
                  "items": {
                    "pattern": "^(lt|le|gt|ge|eq|ne) ",
                    "type": "string"
                  },
                  "type": "array"
                }
              ]
            },
            "title": "Attributes.Stalled Until",
            "type": "array"
          },
          "attributes.status": {
            "items": {
              "$ref": "#/components/schemas/ValidCaseStatus"
            },
            "type": "array",
            "uniqueItems": true
          },
          "attributes.subject": {
            "$ref": "#/components/schemas/FilterMultipleValuesWithOperator_str_"
          },
          "attributes.target_date": {
            "items": {
              "anyOf": [
                {
                  "pattern": "^(lt|le|gt|ge|eq|ne) ",
                  "type": "string"
                },
                {
                  "items": {
                    "pattern": "^(lt|le|gt|ge|eq|ne) ",
                    "type": "string"
                  },
                  "type": "array"
                }
              ]
            },
            "title": "Attributes.Target Date",
            "type": "array"
          },
          "attributes.type_of_archiving": {
            "items": {
              "$ref": "#/components/schemas/ValidTypeOfArchiving"
            },
            "type": "array"
          },
          "attributes.urgency": {
            "items": {
              "$ref": "#/components/schemas/ValidCaseUrgency"
            },
            "type": "array"
          },
          "attributes.value": {
            "$ref": "#/components/schemas/FilterMultipleValuesWithOperator"
          },
          "intake": {
            "title": "Intake",
            "type": "boolean"
          },
          "keyword": {
            "$ref": "#/components/schemas/FilterMultipleValuesWithOperator_str_"
          },
          "operator": {
            "title": "Operator",
            "type": "string"
          },
          "relationship.assignee.id": {
            "items": {
              "format": "uuid",
              "type": "string"
            },
            "title": "Relationship.Assignee.Id",
            "type": "array",
            "uniqueItems": true
          },
          "relationship.case_type.confidentiality": {
            "items": {
              "$ref": "#/components/schemas/DesignationOfConfidentialityType"
            },
            "type": "array"
          },
          "relationship.case_type.id": {
            "items": {
              "format": "uuid",
              "type": "string"
            },
            "title": "Relationship.Case Type.Id",
            "type": "array",
            "uniqueItems": true
          },
          "relationship.case_type.identification": {
            "items": {
              "type": "string"
            },
            "title": "Relationship.Case Type.Identification",
            "type": "array"
          },
          "relationship.case_type.version": {
            "items": {
              "format": "uuid",
              "type": "string"
            },
            "title": "Relationship.Case Type.Version",
            "type": "array"
          },
          "relationship.coordinator.id": {
            "items": {
              "format": "uuid",
              "type": "string"
            },
            "title": "Relationship.Coordinator.Id",
            "type": "array",
            "uniqueItems": true
          },
          "relationship.custom_object.id": {
            "items": {
              "format": "uuid",
              "type": "string"
            },
            "title": "Relationship.Custom Object.Id",
            "type": "array"
          },
          "relationship.requestor.city": {
            "items": {
              "type": "string"
            },
            "title": "Relationship.Requestor.City",
            "type": "array"
          },
          "relationship.requestor.coc_location_number": {
            "items": {
              "type": "string"
            },
            "title": "Relationship.Requestor.Coc Location Number",
            "type": "array"
          },
          "relationship.requestor.coc_number": {
            "items": {
              "pattern": "^[0-9]{1,8}$",
              "type": "string"
            },
            "title": "Relationship.Requestor.Coc Number",
            "type": "array"
          },
          "relationship.requestor.correspondence_city": {
            "items": {
              "type": "string"
            },
            "title": "Relationship.Requestor.Correspondence City",
            "type": "array"
          },
          "relationship.requestor.correspondence_street": {
            "items": {
              "type": "string"
            },
            "title": "Relationship.Requestor.Correspondence Street",
            "type": "array"
          },
          "relationship.requestor.correspondence_zipcode": {
            "items": {
              "type": "string"
            },
            "title": "Relationship.Requestor.Correspondence Zipcode",
            "type": "array"
          },
          "relationship.requestor.date_of_birth": {
            "items": {
              "anyOf": [
                {
                  "pattern": "^(lt|le|gt|ge|eq|ne) ",
                  "type": "string"
                },
                {
                  "items": {
                    "pattern": "^(lt|le|gt|ge|eq|ne) ",
                    "type": "string"
                  },
                  "type": "array"
                }
              ]
            },
            "title": "Relationship.Requestor.Date Of Birth",
            "type": "array"
          },
          "relationship.requestor.date_of_death": {
            "items": {
              "anyOf": [
                {
                  "pattern": "^(lt|le|gt|ge|eq|ne) ",
                  "type": "string"
                },
                {
                  "items": {
                    "pattern": "^(lt|le|gt|ge|eq|ne) ",
                    "type": "string"
                  },
                  "type": "array"
                }
              ]
            },
            "title": "Relationship.Requestor.Date Of Death",
            "type": "array"
          },
          "relationship.requestor.date_of_marriage": {
            "items": {
              "anyOf": [
                {
                  "pattern": "^(lt|le|gt|ge|eq|ne) ",
                  "type": "string"
                },
                {
                  "items": {
                    "pattern": "^(lt|le|gt|ge|eq|ne) ",
                    "type": "string"
                  },
                  "type": "array"
                }
              ]
            },
            "title": "Relationship.Requestor.Date Of Marriage",
            "type": "array"
          },
          "relationship.requestor.department": {
            "items": {
              "type": "string"
            },
            "title": "Relationship.Requestor.Department",
            "type": "array"
          },
          "relationship.requestor.gender": {
            "items": {
              "$ref": "#/components/schemas/ValidGender"
            },
            "type": "array"
          },
          "relationship.requestor.id": {
            "items": {
              "format": "uuid",
              "type": "string"
            },
            "title": "Relationship.Requestor.Id",
            "type": "array",
            "uniqueItems": true
          },
          "relationship.requestor.investigation": {
            "title": "Relationship.Requestor.Investigation",
            "type": "boolean"
          },
          "relationship.requestor.is_secret": {
            "title": "Relationship.Requestor.Is Secret",
            "type": "boolean"
          },
          "relationship.requestor.noble_title": {
            "items": {
              "type": "string"
            },
            "title": "Relationship.Requestor.Noble Title",
            "type": "array"
          },
          "relationship.requestor.post_code": {
            "items": {
              "type": "string"
            },
            "title": "Relationship.Requestor.Post Code",
            "type": "array"
          },
          "relationship.requestor.street": {
            "items": {
              "type": "string"
            },
            "title": "Relationship.Requestor.Street",
            "type": "array"
          },
          "relationship.requestor.trade_name": {
            "items": {
              "type": "string"
            },
            "title": "Relationship.Requestor.Trade Name",
            "type": "array"
          },
          "relationship.requestor.zipcode": {
            "items": {
              "type": "string"
            },
            "title": "Relationship.Requestor.Zipcode",
            "type": "array"
          }
        },
        "title": "CaseFilter",
        "type": "object"
      },
      "CaseSelectionFilter": {
        "description": "Case selection using a filter",
        "properties": {
          "filters": {
            "$ref": "#/components/schemas/CaseFilter"
          },
          "type": {
            "enum": [
              "filter"
            ],
            "title": "Type",
            "type": "string"
          }
        },
        "required": [
          "type",
          "filters"
        ],
        "title": "CaseSelectionFilter",
        "type": "object"
      },
      "CaseSelectionIdList": {
        "description": "Case selection from a list of user-supplied UUIDs",
        "properties": {
          "id_list": {
            "items": {
              "format": "uuid",
              "type": "string"
            },
            "maxItems": 100,
            "minItems": 1,
            "title": "Id List",
            "type": "array"
          },
          "type": {
            "enum": [
              "id_list"
            ],
            "title": "Type",
            "type": "string"
          }
        },
        "required": [
          "type",
          "id_list"
        ],
        "title": "CaseSelectionIdList",
        "type": "object"
      },
      "CaseSelectionOtherJob": {
        "description": "Case selection from a source job.\n\nThe source job must be in the \"finished\" state (successfully completed).",
        "properties": {
          "source_job": {
            "format": "uuid",
            "title": "Source Job",
            "type": "string"
          },
          "type": {
            "enum": [
              "source_job"
            ],
            "title": "Type",
            "type": "string"
          }
        },
        "required": [
          "type",
          "source_job"
        ],
        "title": "CaseSelectionOtherJob",
        "type": "object"
      },
      "DepartmentRoleTypedDict": {
        "properties": {
          "department_uuid": {
            "format": "uuid",
            "title": "Department Uuid",
            "type": "string"
          },
          "role_uuid": {
            "format": "uuid",
            "title": "Role Uuid",
            "type": "string"
          }
        },
        "required": [
          "department_uuid",
          "role_uuid"
        ],
        "title": "DepartmentRoleTypedDict",
        "type": "object"
      },
      "DesignationOfConfidentialityType": {
        "description": "An enumeration.",
        "enum": [
          "Openbaar",
          "Beperkt openbaar",
          "Intern",
          "Zaakvertrouwelijk",
          "Vertrouwelijk",
          "Confidentieel",
          "Geheim",
          "Zeer geheim"
        ],
        "title": "DesignationOfConfidentialityType",
        "type": "string"
      },
      "EntityJob": {
        "properties": {
          "data": {
            "description": "Entity representing a job as seen by the job domain.",
            "properties": {
              "attributes": {
                "properties": {
                  "cancel_reason": {
                    "allOf": [
                      {
                        "$ref": "#/components/schemas/JobCancelReason"
                      }
                    ],
                    "title": "Reason the job was cancelled (if the status is 'cancelled')"
                  },
                  "errors_file_size": {
                    "title": "Size of the errors file",
                    "type": "integer"
                  },
                  "expires_at": {
                    "format": "date-time",
                    "title": "Date when job will automatically be deleted",
                    "type": "string"
                  },
                  "friendly_name": {
                    "title": "Friendly (user-supplied?) name of the job",
                    "type": "string"
                  },
                  "job_description": {
                    "discriminator": {
                      "mapping": {
                        "delete_case": "#/definitions/JobDescriptionDeleteCase",
                        "run_archive_export": "#/definitions/JobDescriptionArchiveExport",
                        "simulate_delete_case": "#/definitions/JobDescriptionSimulateDeleteCase"
                      },
                      "propertyName": "job_type"
                    },
                    "oneOf": [
                      {
                        "$ref": "#/components/schemas/JobDescriptionDeleteCase"
                      },
                      {
                        "$ref": "#/components/schemas/JobDescriptionSimulateDeleteCase"
                      },
                      {
                        "$ref": "#/components/schemas/JobDescriptionArchiveExport"
                      }
                    ],
                    "title": "Description of job. Includes job type and any parameters required for that type of job."
                  },
                  "progress_percent": {
                    "title": "Percentage of job that is done",
                    "type": "number"
                  },
                  "results_file_size": {
                    "title": "Size of the results file",
                    "type": "integer"
                  },
                  "results_file_type": {
                    "title": "MIME type of the results file",
                    "type": "string"
                  },
                  "started_at": {
                    "format": "date-time",
                    "title": "Job started at",
                    "type": "string"
                  },
                  "status": {
                    "allOf": [
                      {
                        "$ref": "#/components/schemas/JobStatus"
                      }
                    ],
                    "title": "Status of the job"
                  },
                  "total_item_count": {
                    "title": "Total number of items affected by this job",
                    "type": "integer"
                  }
                },
                "required": [
                  "status",
                  "job_description",
                  "friendly_name",
                  "started_at",
                  "expires_at"
                ],
                "type": "object"
              },
              "id": {
                "format": "uuid",
                "type": "string"
              },
              "links": {
                "properties": {
                  "self": {
                    "example": "/api/v2/get_something?uuid=1a2b3c4d-1a2b-1a2b-1a2b-1a2b3c4d5e6f",
                    "pattern": "^/api/v2/.*$",
                    "type": "string"
                  }
                },
                "type": "object"
              },
              "meta": {
                "properties": {
                  "summary": {
                    "description": "Human readable summary of the content of the object",
                    "title": "Summary of the subject",
                    "type": "string"
                  }
                },
                "type": "object"
              },
              "relationships": {
                "properties": {},
                "type": "object"
              },
              "type": {
                "enum": [
                  "job"
                ],
                "example": "job",
                "type": "string"
              }
            },
            "required": [
              "type",
              "id",
              "attributes"
            ],
            "title": "Job",
            "type": "object"
          },
          "links": {
            "properties": {
              "self": {
                "example": "/api/v2/get_something?uuid=1a2b3c4d-1a2b-1a2b-1a2b-1a2b3c4d5e6f",
                "pattern": "^/api/v2/.*$",
                "type": "string"
              }
            },
            "type": "object"
          }
        },
        "required": [
          "data",
          "links"
        ],
        "type": "object"
      },
      "EntityJobList": {
        "properties": {
          "data": {
            "items": {
              "description": "Entity representing a job as seen by the job domain.",
              "properties": {
                "attributes": {
                  "properties": {
                    "cancel_reason": {
                      "allOf": [
                        {
                          "$ref": "#/components/schemas/JobCancelReason"
                        }
                      ],
                      "title": "Reason the job was cancelled (if the status is 'cancelled')"
                    },
                    "errors_file_size": {
                      "title": "Size of the errors file",
                      "type": "integer"
                    },
                    "expires_at": {
                      "format": "date-time",
                      "title": "Date when job will automatically be deleted",
                      "type": "string"
                    },
                    "friendly_name": {
                      "title": "Friendly (user-supplied?) name of the job",
                      "type": "string"
                    },
                    "job_description": {
                      "discriminator": {
                        "mapping": {
                          "delete_case": "#/definitions/JobDescriptionDeleteCase",
                          "run_archive_export": "#/definitions/JobDescriptionArchiveExport",
                          "simulate_delete_case": "#/definitions/JobDescriptionSimulateDeleteCase"
                        },
                        "propertyName": "job_type"
                      },
                      "oneOf": [
                        {
                          "$ref": "#/components/schemas/JobDescriptionDeleteCase"
                        },
                        {
                          "$ref": "#/components/schemas/JobDescriptionSimulateDeleteCase"
                        },
                        {
                          "$ref": "#/components/schemas/JobDescriptionArchiveExport"
                        }
                      ],
                      "title": "Description of job. Includes job type and any parameters required for that type of job."
                    },
                    "progress_percent": {
                      "title": "Percentage of job that is done",
                      "type": "number"
                    },
                    "results_file_size": {
                      "title": "Size of the results file",
                      "type": "integer"
                    },
                    "results_file_type": {
                      "title": "MIME type of the results file",
                      "type": "string"
                    },
                    "started_at": {
                      "format": "date-time",
                      "title": "Job started at",
                      "type": "string"
                    },
                    "status": {
                      "allOf": [
                        {
                          "$ref": "#/components/schemas/JobStatus"
                        }
                      ],
                      "title": "Status of the job"
                    },
                    "total_item_count": {
                      "title": "Total number of items affected by this job",
                      "type": "integer"
                    }
                  },
                  "required": [
                    "status",
                    "job_description",
                    "friendly_name",
                    "started_at",
                    "expires_at"
                  ],
                  "type": "object"
                },
                "id": {
                  "format": "uuid",
                  "type": "string"
                },
                "links": {
                  "properties": {
                    "self": {
                      "example": "/api/v2/get_something?uuid=1a2b3c4d-1a2b-1a2b-1a2b-1a2b3c4d5e6f",
                      "pattern": "^/api/v2/.*$",
                      "type": "string"
                    }
                  },
                  "type": "object"
                },
                "meta": {
                  "properties": {
                    "summary": {
                      "description": "Human readable summary of the content of the object",
                      "title": "Summary of the subject",
                      "type": "string"
                    }
                  },
                  "type": "object"
                },
                "relationships": {
                  "properties": {},
                  "type": "object"
                },
                "type": {
                  "enum": [
                    "job"
                  ],
                  "example": "job",
                  "type": "string"
                }
              },
              "required": [
                "type",
                "id",
                "attributes"
              ],
              "title": "Job",
              "type": "object"
            },
            "type": "array"
          },
          "links": {
            "properties": {
              "self": {
                "example": "/api/v2/get_something?uuid=1a2b3c4d-1a2b-1a2b-1a2b-1a2b3c4d5e6f",
                "pattern": "^/api/v2/.*$",
                "type": "string"
              }
            },
            "type": "object"
          },
          "meta": {
            "properties": {
              "total_results": {
                "type": "integer"
              }
            },
            "type": "object"
          }
        },
        "required": [
          "data",
          "links"
        ],
        "type": "object"
      },
      "FilterMultipleValuesWithOperator": {
        "properties": {
          "operator": {
            "$ref": "#/components/schemas/FilterOperator"
          },
          "values": {
            "items": {},
            "title": "Values",
            "type": "array"
          }
        },
        "required": [
          "values"
        ],
        "title": "FilterMultipleValuesWithOperator",
        "type": "object"
      },
      "FilterMultipleValuesWithOperator_DepartmentRoleTypedDict_": {
        "properties": {
          "operator": {
            "$ref": "#/components/schemas/FilterOperator"
          },
          "values": {
            "items": {
              "$ref": "#/components/schemas/DepartmentRoleTypedDict"
            },
            "title": "Values",
            "type": "array"
          }
        },
        "required": [
          "values"
        ],
        "title": "FilterMultipleValuesWithOperator[DepartmentRoleTypedDict]",
        "type": "object"
      },
      "FilterMultipleValuesWithOperator_Union_ConstrainedStrValue__list_pydantic.v1.types.ConstrainedStrValue___": {
        "properties": {
          "operator": {
            "$ref": "#/components/schemas/FilterOperator"
          },
          "values": {
            "items": {
              "anyOf": [
                {
                  "pattern": "^(lt|le|gt|ge|eq|ne) ",
                  "type": "string"
                },
                {
                  "items": {
                    "pattern": "^(lt|le|gt|ge|eq|ne) ",
                    "type": "string"
                  },
                  "type": "array"
                }
              ]
            },
            "title": "Values",
            "type": "array"
          }
        },
        "required": [
          "values"
        ],
        "title": "FilterMultipleValuesWithOperator[Union[ConstrainedStrValue, list[pydantic.v1.types.ConstrainedStrValue]]]",
        "type": "object"
      },
      "FilterMultipleValuesWithOperator_str_": {
        "properties": {
          "operator": {
            "$ref": "#/components/schemas/FilterOperator"
          },
          "values": {
            "items": {
              "type": "string"
            },
            "title": "Values",
            "type": "array"
          }
        },
        "required": [
          "values"
        ],
        "title": "FilterMultipleValuesWithOperator[str]",
        "type": "object"
      },
      "FilterOperator": {
        "description": "An enumeration.",
        "enum": [
          "or",
          "and"
        ],
        "title": "FilterOperator",
        "type": "string"
      },
      "JobCancelReason": {
        "description": "An enumeration.",
        "enum": [
          "user_action",
          "source_not_found",
          "source_not_finished"
        ],
        "title": "JobCancelReason",
        "type": "string"
      },
      "JobDescriptionArchiveExport": {
        "additionalProperties": false,
        "description": "Job that runs 'generate_archive_export' on the selection to generate topx export",
        "properties": {
          "job_type": {
            "enum": [
              "run_archive_export"
            ],
            "title": "Job Type",
            "type": "string"
          },
          "selection": {
            "discriminator": {
              "mapping": {
                "filter": "#/definitions/CaseSelectionFilter",
                "id_list": "#/definitions/CaseSelectionIdList",
                "source_job": "#/definitions/CaseSelectionOtherJob"
              },
              "propertyName": "type"
            },
            "oneOf": [
              {
                "$ref": "#/components/schemas/CaseSelectionFilter"
              },
              {
                "$ref": "#/components/schemas/CaseSelectionOtherJob"
              },
              {
                "$ref": "#/components/schemas/CaseSelectionIdList"
              }
            ],
            "title": "Selection"
          }
        },
        "required": [
          "selection",
          "job_type"
        ],
        "title": "JobDescriptionArchiveExport",
        "type": "object"
      },
      "JobDescriptionDeleteCase": {
        "additionalProperties": false,
        "description": "Job that runs 'delete_case' on the selection",
        "properties": {
          "job_type": {
            "enum": [
              "delete_case"
            ],
            "title": "Job Type",
            "type": "string"
          },
          "selection": {
            "discriminator": {
              "mapping": {
                "filter": "#/definitions/CaseSelectionFilter",
                "id_list": "#/definitions/CaseSelectionIdList",
                "source_job": "#/definitions/CaseSelectionOtherJob"
              },
              "propertyName": "type"
            },
            "oneOf": [
              {
                "$ref": "#/components/schemas/CaseSelectionFilter"
              },
              {
                "$ref": "#/components/schemas/CaseSelectionOtherJob"
              },
              {
                "$ref": "#/components/schemas/CaseSelectionIdList"
              }
            ],
            "title": "Selection"
          }
        },
        "required": [
          "selection",
          "job_type"
        ],
        "title": "JobDescriptionDeleteCase",
        "type": "object"
      },
      "JobDescriptionSimulateDeleteCase": {
        "additionalProperties": false,
        "description": "Job that runs 'check_delete_case' on the selection",
        "properties": {
          "job_type": {
            "enum": [
              "simulate_delete_case"
            ],
            "title": "Job Type",
            "type": "string"
          },
          "selection": {
            "discriminator": {
              "mapping": {
                "filter": "#/definitions/CaseSelectionFilter",
                "id_list": "#/definitions/CaseSelectionIdList",
                "source_job": "#/definitions/CaseSelectionOtherJob"
              },
              "propertyName": "type"
            },
            "oneOf": [
              {
                "$ref": "#/components/schemas/CaseSelectionFilter"
              },
              {
                "$ref": "#/components/schemas/CaseSelectionOtherJob"
              },
              {
                "$ref": "#/components/schemas/CaseSelectionIdList"
              }
            ],
            "title": "Selection"
          }
        },
        "required": [
          "selection",
          "job_type"
        ],
        "title": "JobDescriptionSimulateDeleteCase",
        "type": "object"
      },
      "JobStatus": {
        "description": "An enumeration.",
        "enum": [
          "pending",
          "running",
          "processed",
          "finished",
          "cancelled",
          "deleted"
        ],
        "title": "JobStatus",
        "type": "string"
      },
      "ValidCaseArchivalState": {
        "description": "An enumeration.",
        "enum": [
          "vernietigen",
          "overdragen"
        ],
        "title": "ValidCaseArchivalState",
        "type": "string"
      },
      "ValidCaseConfidentiality": {
        "description": "An enumeration.",
        "enum": [
          "public",
          "internal",
          "confidential"
        ],
        "title": "ValidCaseConfidentiality",
        "type": "string"
      },
      "ValidCasePaymentStatus": {
        "description": "An enumeration.",
        "enum": [
          "success",
          "pending",
          "failed",
          "offline"
        ],
        "title": "ValidCasePaymentStatus",
        "type": "string"
      },
      "ValidCaseResult": {
        "description": "An enumeration.",
        "enum": [
          "aangegaan",
          "aangehouden",
          "aangekocht",
          "aangesteld",
          "aanvaard",
          "afgeboekt",
          "afgebroken",
          "afgehandeld",
          "afgesloten",
          "afgewezen",
          "akkoord",
          "akkoord met wijzigingen",
          "be\u00ebindigd",
          "behaald",
          "betaald",
          "buiten behandeling gesteld",
          "definitief toegekend",
          "geannuleerd",
          "gedeeltelijk gegrond",
          "gedeeltelijk verleend",
          "gedoogd",
          "gegrond",
          "gegund",
          "ge\u00efnd",
          "geleverd",
          "geweigerd",
          "gewijzigd",
          "handhaving uitgevoerd",
          "ingericht",
          "ingeschreven",
          "ingesteld",
          "ingetrokken",
          "ingewilligd",
          "niet aangekocht",
          "niet aangesteld",
          "niet akkoord",
          "niet behaald",
          "niet betaald",
          "niet doorgegaan",
          "niet gegund",
          "niet geind",
          "niet geleverd",
          "niet gewijzigd",
          "niet ingesteld",
          "niet ingetrokken",
          "niet nodig",
          "niet ontvankelijk",
          "niet opgelegd",
          "niet opgeleverd",
          "niet toegekend",
          "niet uitgevoerd",
          "niet vastgesteld",
          "niet verkregen",
          "niet verleend",
          "niet verstrekt",
          "niet verwerkt",
          "ongegrond",
          "ontvankelijk",
          "opgeheven",
          "opgelegd",
          "opgeleverd",
          "opgelost",
          "opgezegd",
          "toegekend",
          "toezicht uitgevoerd",
          "uitgevoerd",
          "vastgesteld",
          "verhuurd",
          "verkocht",
          "verkregen",
          "verleend",
          "vernietigd",
          "verstrekt",
          "verwerkt",
          "voorlopig toegekend",
          "voorlopig verleend"
        ],
        "title": "ValidCaseResult",
        "type": "string"
      },
      "ValidCaseRetentionPeriodSourceDate": {
        "description": "An enumeration.",
        "enum": [
          "vervallen",
          "onherroepelijk",
          "verwerking",
          "verleend",
          "einde-dienstverband",
          "afhandeling",
          "geboorte",
          "geweigerd"
        ],
        "title": "ValidCaseRetentionPeriodSourceDate",
        "type": "string"
      },
      "ValidCaseStatus": {
        "description": "Valid status for the case",
        "enum": [
          "new",
          "stalled",
          "resolved",
          "open"
        ],
        "title": "ValidCaseStatus",
        "type": "string"
      },
      "ValidCaseUrgency": {
        "description": "An enumeration.",
        "enum": [
          "late",
          "high",
          "medium",
          "normal"
        ],
        "title": "ValidCaseUrgency",
        "type": "string"
      },
      "ValidContactChannel": {
        "description": "An enumeration.",
        "enum": [
          "behandelaar",
          "balie",
          "telefoon",
          "post",
          "email",
          "webformulier",
          "sociale media",
          "externe applicatie"
        ],
        "title": "ValidContactChannel",
        "type": "string"
      },
      "ValidGender": {
        "description": "An enumeration.",
        "enum": [
          "M",
          "F",
          "X"
        ],
        "title": "ValidGender",
        "type": "string"
      },
      "ValidTypeOfArchiving": {
        "description": "An enumeration.",
        "enum": [
          "Bewaren (B)",
          "Vernietigen (V)",
          "Overbrengen (O)",
          "Conversie",
          "Migratie",
          "Publicatie",
          "Vervallen beperkingen openbaarheid",
          "Overdracht",
          "Vernietigen"
        ],
        "title": "ValidTypeOfArchiving",
        "type": "string"
      }
    }
  }
}
