{
  "openapi": "3.0.0",
  "info": {
    "title": "hello world service api",
    "version": "v1"
  },
  "servers": [
    {
      "url": "http://localhost:6543"
    }
  ],
  "paths": {
    "/hello": {
      "get": {
        "x-view": "hello",
        "tags": [
          "Hello"
        ],
        "operationId": "hello_world",
        "summary": "hello world",
        "parameters": [
          {
            "name": "uuid",
            "in": "query",
            "description": "UUID to get hello message for",
            "required": true,
            "schema": {
              "type": "string"
            }
          }
        ],
        "responses": {
          "200": {
            "description": "hello world response",
            "content": {
              "application/json": {
                "schema": {
                  "$ref": "#/components/schemas/Result"
                }
              }
            }
          },
          "404": {
            "description": "hello world error",
            "content": {
              "application/json": {
                "schema": {
                  "$ref": "#/components/schemas/Error"
                }
              }
            }
          }
        }
      }
    },
    "/set_hello": {
      "post": {
        "x-view": "hello",
        "tags": [
          "Hello"
        ],
        "operationId": "hello_save",
        "summary": "Save a message",
        "requestBody": {
          "required": true,
          "content": {
            "application/x-www-from-urlencoded": {
              "schema": {
                "type": "object",
                "properties": {
                  "uuid": { "type": "string"},
                  "name": { "type": "string"}
                },
                "required": [ "uuid", "name" ]
              }
            }
          }
        },
        "responses": {
          "200": {
            "description": "hello world response",
            "content": {
              "application/json": {
                "schema": {
                  "$ref": "#/components/schemas/Result"
                }
              }
            }
          },
          "404": {
            "description": "hello world error",
            "content": {
              "application/json": {
                "schema": {
                  "$ref": "#/components/schemas/Error"
                }
              }
            }
          }
        }
      }
    }

  },
  "components": {
    "schemas": {
      "Result": {
        "type": "string",
        "example": "Hello, {name} from {context}"
      },
      "Error": {
        "required": [
          "error"
        ],
        "properties": {
          "error": {
            "type": "string"
          }
        }
      }
    }
  }
}
