{
	"@mui/icons-material@5.8.4": {
		"licenses": "MIT",
		"repository": "https://github.com/mui/material-ui",
		"publisher": "MUI Team"
	},
	"@mui/styles@5.9.2": {
		"licenses": "MIT",
		"repository": "https://github.com/mui/material-ui",
		"publisher": "MUI Team"
	},
	"bootstrap@5.2.0": {
		"licenses": "MIT",
		"repository": "https://github.com/twbs/bootstrap",
		"publisher": "The Bootstrap Authors",
		"url": "https://github.com/twbs/bootstrap/graphs/contributors"
	},
	"bootswatch@5.2.0": {
		"licenses": "MIT",
		"repository": "https://github.com/thomaspark/bootswatch",
		"publisher": "Thomas Park"
	},
	"ra-data-json-server@4.3.0": {
		"licenses": "MIT",
		"repository": "https://github.com/marmelab/react-admin"
	},
	"ra-data-simple-rest@4.3.0": {
		"licenses": "MIT",
		"repository": "https://github.com/marmelab/react-admin"
	},
	"ra-language-dutch@3.17.2": {
		"licenses": "MIT",
		"repository": "https://github.com/nickwaelkens/ra-language-dutch",
		"publisher": "Nick Waelkens"
	},
	"react-admin@4.3.0": {
		"licenses": "MIT",
		"repository": "https://github.com/marmelab/react-admin"
	},
	"react-dom@18.2.0": {
		"licenses": "MIT",
		"repository": "https://github.com/facebook/react"
	},
	"react@18.2.0": {
		"licenses": "MIT",
		"repository": "https://github.com/facebook/react"
	},
	"web-vitals@2.1.4": {
		"licenses": "Apache-2.0",
		"repository": "https://github.com/GoogleChrome/web-vitals",
		"publisher": "Philip Walton",
		"email": "philip@philipwalton.com",
		"url": "http://philipwalton.com"
	},
	"xxllnc-formio-components@1.1.3": {
		"licenses": "EUPL-1.2"
	},
	"xxllnc-react-components@3.0.4": {
		"licenses": "EUPL-1.2"
	}
}