{
  "extends": "ts-node/node14/tsconfig.json",
  "ts-node": {
    "files": true
  },
  "files": ["license-checker-rseidelsohn.d.ts"],
  "compilerOptions": {
    "jsx": "react-jsx"
  },
  "include": ["scripts"]
}
