{
  "$schema": "https://github.com/IBM/audit-ci/raw/main/docs/schema.json",
  "moderate": true,
  "allowlist": [
    // GHSA-f8q6-p94x-37v3|react-scripts>react-dev-utils>recursive-readdir>minimatch
    "GHSA-f8q6-p94x-37v3",
    // GHSA-rp65-9cf3-cjxr|react-scripts>@svgr/webpack>@svgr/plugin-svgo>svgo>css-select>nth-check
    "GHSA-rp65-9cf3-cjxr",
    // loader-utils used by react-scripts
    "GHSA-3rfm-jhwj-7488",
    // loader-utils used by react-scripts
    "GHSA-hhq3-ff78-jv3g"
  ]
}