<?xml version="1.0" encoding="utf-8"?>
<svg width="666" height="666" xmlns="http://www.w3.org/2000/svg" xml:space="preserve" version="1.1">

 <g>
  <title>Layer 1</title>
  <g id="Layer_2_3_">
   <rect id="svg_1" fill="#D5D0CA" height="666" width="666" class="st0"/>
  </g>
  <g id="svg_2">
   <path id="svg_3" fill="#252528" d="m329.994,180l0,53.324l-9.456,0l0,-53.324l9.456,0z" class="st1"/>
   <path id="svg_4" fill="#252528" d="m351.818,180l0,53.324l-9.456,0l0,-53.324l9.456,0z" class="st1"/>
   <g id="svg_5">
    <path id="svg_6" fill="#252528" d="m273.139,191.967l35.492,36.576l-6.294,6.486l-35.492,-36.576l6.294,-6.486z" class="st1"/>
    <path id="svg_7" fill="#252528" d="m308.63,198.453l-35.492,36.576l-6.294,-6.486l35.492,-36.576l6.294,6.486z" class="st1"/>
   </g>
   <g id="svg_8">
    <path id="svg_9" fill="#252528" d="m223.877,191.967l35.492,36.576l-6.294,6.486l-35.492,-36.576l6.294,-6.486z" class="st1"/>
    <path id="svg_10" fill="#252528" d="m259.369,198.453l-35.492,36.576l-6.294,-6.486l35.492,-36.576l6.294,6.486z" class="st1"/>
   </g>
   <path id="svg_11" fill="#252528" d="m382.037,193.607c10.818,0 18.837,6.806 18.837,18.685l0,21.032l-9.456,0l0,-20.804c0,-6.279 -4.008,-9.684 -9.381,-9.684s-9.381,3.405 -9.381,9.684l0,20.805l-9.456,0l0,-21.032c0,-11.88 7.944,-18.686 18.837,-18.686z" class="st1"/>
   <path id="svg_12" fill="#252528" d="m428.992,225.438c-6.006,0 -10.876,-5.191 -10.876,-11.594c0,-6.4 4.869,-11.59 10.876,-11.59c4.451,0 8.265,2.856 9.949,6.937l9.476,0c-1.664,-9.229 -9.384,-15.583 -19.295,-15.583c-11.572,0 -20.047,8.546 -20.047,20.275c0,11.652 8.474,20.202 20.047,20.202c9.911,0 17.555,-6.285 19.295,-15.514l-9.513,0c-1.699,4.041 -5.489,6.867 -9.912,6.867z" class="st1"/>
  </g>
 </g>
</svg>
