{
  "Functions": [
    {
      "Name": "_PyCode_CheckLineNumber",
      "Arguments": "PyCodeObject *, int, PyAddrPair *",
      "ReturnType": "int",
      "Signatures": [
        {
          "Signature": "48 89 5C 24 08 48 89 7C 24 10 48 8B 41 68"
        }
      ]
    },
    {
      "Name": "PyCode_Addr2Line",
      "Arguments": "PyCodeObject *, int",
      "ReturnType": "int",
      "Signatures": [
        {
          "Signature": "48 89 5C 24 08 48 89 74 24 10 57 48 83 EC 20 48 8B D9 8B F2 48 8B 49 68 E8"
        }
      ]
    },
    {
      "Name": "PyCode_New",
      "Arguments": "int, int, int, int, PyObject *, PyObject *, PyObject *, PyObject *, PyObject *, PyObject *, PyObject *, PyObject *, int, PyObject *",
      "ReturnType": "PyCodeObject *",
      "Signatures": [
        {
          "Signature": "44 89 4C 24 20 44 89 44 24 18 89 54 24 10 89 4C 24 08"
        }
      ]
    },
    {
      "Name": "PyCode_NewEmpty",
      "Arguments": "const char *, const char *, int",
      "ReturnType": "PyCodeObject *",
      "Signatures": [
        {
          "Signature": "48 89 5C 24 20 55 57 41 54 48 83 EC 20 33 DB"
        }
      ]
    },
    {
      "Name": "PyCode_Optimize",
      "Arguments": "PyObject *code, PyObject* consts, PyObject *names, PyObject *lineno_obj",
      "ReturnType": "PyObject*",
      "Signatures": [
        {
          "Signature": "48 89 5C 24 20 4C 89 44 24 18 48 89 54 24 10 48 89 4C 24 08 55 56 57 41 54 41 55 41 56 41 57 48 83 EC 70"
        }
      ]
    }
  ],
  "Structures": [
    {
      "Name": "PyCode_Type",
      "Type": "PyTypeObject",
      "Signatures": [
        {
          "Signature": "PyCode_New+0x1B7",
          "ValidationPrefix": "48 8D 15"
        }
      ]
    }
  ]
}