{
  "Functions": [
    {
      "Name": "PyRun_FileExFlags",
      "Arguments": "FILE *, const char *, int, PyObject *, PyObject *, int, PyCompilerFlags *",
      "ReturnType": "PyObject *",
      "Signatures": []
    },
    {
      "Name": "PyRun_SimpleStringFlags",
      "Arguments": "const char *, PyCompilerFlags *",
      "ReturnType": "int",
      "Signatures": [
        {
          "Signature": "48 89 5C 24 08 57 48 83 EC 30 48 8B F9 48 8B DA 48 8D 0D ? ? ? ? E8"
        }
      ]
    },
    {
      "Name": "PyRun_StringFlags",
      "Arguments": "const char *, int, PyObject *, PyObject *, PyCompilerFlags *",
      "ReturnType": "PyObject *",
      "Signatures": [
        {
          "Signature": "48 89 6C 24 10 48 89 74 24 18 48 89 7C 24 20 41 54 41 56 41 57 48 83 EC 30 49 8B E9 4D 8B F0 44"
        }
      ]
    }
  ],
  "Structures": []
}