{
  "Functions": [
    {
      "Name": "_PyBuiltin_Init",
      "Arguments": "void",
      "ReturnType": "PyObject *",
      "Signatures": [
        {
          "Signature": "48 89 5C 24 08 48 89 74 24 10 57 48 83 EC 30 45 33 C9 C7 44 24 20 F5 03 00 00"
        }
      ]
    }
  ],
  "Structures": []
}