{
  "Functions": [
    {
      "Name": "_PyNode_SizeOf",
      "Arguments": "node *",
      "ReturnType": "Py_ssize_t",
      "Signatures": [
        {
          "Signature": "48 83 EC 28 48 85 C9 74 ? E8 ? ? ? ? 48 83 C0 28"
        }
      ]
    },
    {
      "Name": "PyNode_AddChild",
      "Arguments": "node *, int, char *, int, int *",
      "ReturnType": "int",
      "Signatures": [
        {
          "Signature": "48 89 5C 24 08 48 89 6C 24 10 48 89 74 24 18 57 48 83 EC 20 44 8B 59 18"
        }
      ]
    },
    {
      "Name": "PyNode_Free",
      "Arguments": "node *",
      "ReturnType": "void",
      "Signatures": [
        {
          "Signature": "48 85 C9 74 ? 53 48 83 EC 20 48 8B D9 E8 ? ? ? ? 48 8B CB E8 ? ? ? ? 48 83 C4 20 5B C3 40 53"
        }
      ]
    },
    {
      "Name": "PyNode_New",
      "Arguments": "int",
      "ReturnType": "node *",
      "Signatures": [
        {
          "Signature": "40 53 48 83 EC 20 8B D9 B9 28 00 00 00"
        }
      ]
    }
  ],
  "Structures": []
}