{
  "Functions": [
    {
      "Name": "PyTraceBack_Here",
      "Arguments": "struct _frame *",
      "ReturnType": "int",
      "Signatures": [
        {
          "Signature": "48 89 5C 24 08 48 89 6C 24 10 48 89 74 24 18 57 48 83 EC 20 48 8B 2D ? ? ? ? 48 8B F9"
        }
      ]
    },
    {
      "Name": "PyTraceBack_Print",
      "Arguments": "PyObject *, PyObject *",
      "ReturnType": "int",
      "Signatures": [
        {
          "Signature": "40 57 41 54 41 57 48 81 EC 20 08 00 00"
        }
      ]
    }
  ],
  "Structures": [
    {
      "Name": "PyTraceBack_Type",
      "Type": "PyTypeObject",
      "Signatures": [
        {
          "Signature": "PyTraceBack_Print+0x37",
          "ValidationPrefix": "48 8D 05"
        }
      ]
    }
  ]
}