{
  "Functions": [
    {
      "Name": "PySeqIter_New",
      "Arguments": "PyObject *",
      "ReturnType": "PyObject *",
      "Signatures": []
    }
  ],
  "Structures": [
    {
      "Name": "PySeqIter_Type",
      "Type": "PyTypeObject",
      "Signatures": []
    }
  ]
}