{
  "Functions": [
    {
      "Name": "_PyWarnings_Init",
      "Arguments": "void",
      "ReturnType": "void",
      "Signatures": [
        {
          "Signature": "40 56 48 83 EC 30 45 33 C9 C7 44 24 20 F5 03 00 00 4C 8D 05 ? ? ? ? 48 8D 15 ? ? ? ? 48 8D 0D ? ? ? ? E8 ? ? ? ? 48 8B F0 48 85 C0 0F 84 ? ? ? ? 83 3D"
        }
      ]
    }
  ],
  "Structures": []
}