{
  "Functions": [
    {
      "Name": "_PyTime_FloatTime",
      "Arguments": "void",
      "ReturnType": "double",
      "Signatures": [
        {
          "Signature": "48 83 EC 48 48 8B 05 ? ? ? ? 48 33 C4 48 89 44 24 30 48 8D 4C 24 20 FF 15 ? ? ? ? 0F B7 44 24 ? 0F 57 C9 F2 48 0F 2A 4C 24 ? 66 0F 6E C0 F3 0F E6 C0 F2 0F 59 05 ? ? ? ? F2 0F 58 C1 48 8B 4C 24 30 48 33 CC E8 ? ? ? ? 48 83 C4 48 C3 CC CC CC CC CC CC CC CC CC CC CC CC CC 40 53"
        }
      ]
    }
  ],
  "Structures": []
}