{
  "Functions": [
    {
      "Name": "PyMethod_Class",
      "Arguments": "PyObject *",
      "ReturnType": "PyObject *",
      "Signatures": []
    },
    {
      "Name": "PyMethod_ClearFreeList",
      "Arguments": "void",
      "ReturnType": "int",
      "Signatures": [
        {
          "Signature": "40 53 48 83 EC 20 48 8B 0D ? ? ? ? 8B 1D ? ? ? ? 48 85 C9 74 ? 0F 1F 84 00 00 00 00 00 48 8B 51 18 48 89 15 ? ? ? ? E8 ? ? ? ? 48 8B 0D ? ? ? ? FF 0D ? ? ? ? 48 85 C9 75 ? 8B C3 48 83 C4 20 5B C3 CC CC CC CC CC CC 48 83 EC 28 48 8B 05 ? ? ? ? 48 85 C0 74 ? 48 8B 48 18 48 89 0D ? ? ? ? 48 8B C8 E8 ? ? ? ? 48 8B 05 ? ? ? ? FF 0D ? ? ? ? 48 85 C0 75 ? 48 83 C4 28 C3 CC CC CC CC CC CC 48 89 5C 24 08"
        }
      ]
    },
    {
      "Name": "PyMethod_Fini",
      "Arguments": "void",
      "ReturnType": "void",
      "Signatures": [
        {
          "Signature": "48 83 EC 28 48 8B 05 ? ? ? ? 48 85 C0 74 ? 48 8B 48 18 48 89 0D ? ? ? ? 48 8B C8 E8 ? ? ? ? 48 8B 05 ? ? ? ? FF 0D ? ? ? ? 48 85 C0 75 ? 48 83 C4 28 C3 CC CC CC CC CC CC 48 89 5C 24 08"
        }
      ]
    },
    {
      "Name": "PyMethod_Function",
      "Arguments": "PyObject *",
      "ReturnType": "PyObject *",
      "Signatures": []
    },
    {
      "Name": "PyMethod_New",
      "Arguments": "PyObject *, PyObject *, PyObject *",
      "ReturnType": "PyObject *",
      "Signatures": [
        {
          "Signature": "48 89 5C 24 08 48 89 6C 24 10 48 89 74 24 18 57 48 83 EC 20 48 8B 1D ? ? ? ? 48 8B E9 48 8D 0D ? ? ? ? 49 8B F8 48 8B F2 48 85 DB 0F 84 ? ? ? ? 48 8B 43 18 FF 0D ? ? ? ? 48 89 05 ? ? ? ? 48 89 4B 08 48 C7 03 01 00 00 00 48 8B CD"
        }
      ]
    },
    {
      "Name": "PyMethod_Self",
      "Arguments": "PyObject *",
      "ReturnType": "PyObject *",
      "Signatures": []
    }
  ],
  "Structures": [
    {
      "Name": "PyMethod_Type",
      "Type": "PyTypeObject",
      "Signatures": [
        {
          "Signature": "PyMethod_New+0x21",
          "ValidationPrefix": "48 8D 0D"
        }
      ]
    }
  ]
}