{
  "_Py_add_one_to_index_C": "0x141EF0810",
  "_Py_add_one_to_index_F": "0x141EF0870",
  "_Py_BuildValue_SizeT": "0x141EE3250",
  "_Py_CheckRecursionLimit": "0x1434AC5E0",
  "_Py_CheckRecursiveCall": "0x141EE8C90",
  "_Py_NoneStruct": "0x14349FDF8",
  "_Py_NotImplementedStruct": "0x14349FE08",
  "_Py_TrueStruct": "0x1434ACDF0",
  "_Py_ZeroStruct": "0x1434ACDD8",
  "_PyArg_NoKeywords": "0x141F3BF10",
  "_PyArg_Parse_SizeT": "0x141F3C040",
  "_PyArg_ParseTuple_SizeT": "0x141F3C000",
  "_PyArg_ParseTupleAndKeywords_SizeT": "0x141F3BF80",
  "_PyBuiltin_Init": "0x141F4EC00",
  "_PyCode_CheckLineNumber": "0x141F1D140",
  "_PyCodec_Lookup": "0x141F43290",
  "_PyDict_Contains": "0x141ED7E90",
  "_PyDict_MaybeUntrack": "0x141ED8010",
  "_PyDict_NewPresized": "0x141ED8140",
  "_PyDict_Next": "0x141ED81B0",
  "_PyErr_BadInternalCall": "0x141EE2080",
  "_PyEval_CallTracing": "0x141EE8AC0",
  "_PyEval_SliceIndex": "0x141EE8B50",
  "_PyExc_Fini": "0x141EF8400",
  "_PyExc_Init": "0x141EF8470",
  "_PyFloat_Init": "0x141EFD640",
  "_PyFloat_Pack4": "0x141EFD6F0",
  "_PyFloat_Pack8": "0x141EFD940",
  "_PyFloat_Unpack4": "0x141EFDBB0",
  "_PyFloat_Unpack8": "0x141EFDCF0",
  "_PyFrame_Init": "0x141EF3010",
  "_PyImport_AcquireLock": "0x141F02F20",
  "_PyImport_FindExtension": "0x141F02FC0",
  "_PyImport_Fini": "0x141F03090",
  "_PyImport_FixupExtension": "0x141F030E0",
  "_PyImport_Init": "0x141F031F0",
  "_PyInstance_Lookup": "0x141EDF960",
  "_PyInt_AsInt": "0x141F08710",
  "_PyInt_Format": "0x141F08810",
  "_PyInt_FormatAdvanced": "0x141F444B0",
  "_PyInt_Init": "0x141F08990",
  "_PyList_Extend": "0x141ED3630",
  "_PyLong_AsByteArray": "0x141F0CA90",
  "_PyLong_AsInt": "0x141F0CC70",
  "_PyLong_Copy": "0x141F0CCB0",
  "_PyLong_Format": "0x141F0CD20",
  "_PyLong_FormatAdvanced": "0x141F444C0",
  "_PyLong_Frexp": "0x141F0D220",
  "_PyLong_FromByteArray": "0x141F0D510",
  "_PyLong_Init": "0x141F0D770",
  "_PyLong_New": "0x141F0D7A0",
  "_PyLong_NumBits": "0x141F0D810",
  "_PyLong_Sign": "0x141F0D890",
  "_PyModule_Clear": "0x141EFE990",
  "_PyNode_SizeOf": "0x141F5F1C0",
  "_PyNumber_ConvertIntegralToInt": "0x141EF0150",
  "_PyObject_CallFunction_SizeT": "0x141EF02A0",
  "_PyObject_CallMethod_SizeT": "0x141EF0330",
  "_PyObject_GC_Malloc": "0x141F204A0",
  "_PyObject_GC_New": "0x141F205C0",
  "_PyObject_GC_NewVar": "0x141F205F0",
  "_PyObject_GC_Resize": "0x141F20640",
  "_PyObject_GenericGetAttrWithDict": "0x141E9D620",
  "_PyObject_GenericSetAttrWithDict": "0x141E9D890",
  "_PyObject_GetDictPtr": "0x141E9DB00",
  "_PyObject_LengthHint": "0x141EF0410",
  "_PyObject_LookupSpecial": "0x141EA7E50",
  "_PyObject_New": "0x141E9DB50",
  "_PyObject_NextNotImplemented": "0x141E9DB90",
  "_PyObject_RealIsInstance": "0x141EF05F0",
  "_PyObject_RealIsSubclass": "0x141EF0600",
  "_PyObject_Str": "0x141E9DBC0",
  "_PyOS_ascii_strtod": "0x141F43B30",
  "_PySequence_IterSearch": "0x141EF0610",
  "_PySet_NextEntry": "0x141F25030",
  "_PySlice_FromIndices": "0x141F21C90",
  "_PyString_Eq": "0x141EC9EF0",
  "_PyString_FormatLong": "0x141EC9F20",
  "_PyString_InsertThousandsGrouping": "0x141ECA2C0",
  "_PyString_Join": "0x141ECA530",
  "_PyString_Resize": "0x141ECA540",
  "_PySys_Init": "0x141F1EA10",
  "_PyThread_CurrentFrames": "0x141EE29A0",
  "_PyThreadState_Current": "0x143B31260",
  "_PyThreadState_GetFrame": "0x143B31268",
  "_PyThreadState_Init": "0x141EE2940",
  "_PyThreadState_Prealloc": "0x141EE2990",
  "_PyTime_FloatTime": "0x141FD4B10",
  "_PyTuple_MaybeUntrack": "0x141ECFFA0",
  "_PyTuple_Resize": "0x141ED0080",
  "_PyType_Lookup": "0x141EA7E60",
  "_PyUnicode_XStrip": "0x141EBD400",
  "_PyUnicodeUCS2_AsDefaultEncodedString": "0x141EBC7F0",
  "_PyUnicodeUCS2_Init": "0x141EBCBF0",
  "_PyWarnings_Init": "0x141F26E30",
  "_PyWeakref_CallableProxyType": "0x1434A2540",
  "_PyWeakref_ClearRef": "0x141EAEB90",
  "_PyWeakref_GetWeakrefCount": "0x141EAEBC0",
  "_PyWeakref_ProxyType": "0x1434A23B0",
  "_PyWeakref_RefType": "0x1434A2210",
  "bloom_linebreak": "0x1434A5780",
  "BW_Py_DEC_REF": "0x141E9C160",
  "BW_Py_INC_REF": "0x141E9C170",
  "dummy": "0x143B32CF0",
  "interp_head": "0x143B31288",
  "interpreter_lock": "0x143B312A8",
  "Py_AtExit": "0x141EFF8E0",
  "Py_BuildValue": "0x141EE2F60",
  "Py_CompileStringFlags": "0x141EFF910",
  "Py_FatalError": "0x141EFF9E0",
  "Py_Finalize": "0x141EFFB60",
  "Py_GetVersion": "0x141F69EC0",
  "Py_InitializeEx": "0x141EFFDE0",
  "Py_InitModule4_64": "0x141EE2F90",
  "Py_IsInitialized": "0x141F00400",
  "Py_OptimizeFlag": "0x143B325B0",
  "Py_SetRecursionLimit": "0x141EE8AB0",
  "PyArena_AddPyObject": "0x141F4AB20",
  "PyArena_Free": "0x141F4AB70",
  "PyArena_Malloc": "0x141F4ABD0",
  "PyArena_New": "0x141F4AC90",
  "PyArg_Parse": "0x141F3BCE0",
  "PyArg_ParseTuple": "0x141F3BD20",
  "PyArg_ParseTupleAndKeywords": "0x141F3BD50",
  "PyArg_UnpackTuple": "0x141F3BDD0",
  "PyArg_VaParse": "0x141F3BDD0",
  "PyAST_Check": "0x141F509A0",
  "PyAST_Compile": "0x141F13D00",
  "PyAST_FromNode": "0x141F62270",
  "PyAST_mod2obj": "0x141F509D0",
  "PyAST_obj2mod": "0x141F509F0",
  "PyBaseObject_Type": "0x1434A1C60",
  "PyBool_FromLong": "0x141EF37D0",
  "PyBool_Type": "0x1434ACC50",
  "PyBuffer_FillInfo": "0x141EEB130",
  "PyBuffer_FromMemory": "0x141F2E6E0",
  "PyBuffer_GetPointer": "0x141EEB230",
  "PyBuffer_IsContiguous": "0x141EEB2A0",
  "PyBuffer_Release": "0x141EEB300",
  "PyBuffer_ToContiguous": "0x141EEB380",
  "PyBuffer_Type": "0x1434BF830",
  "PyByteArray_AsString": "0x141F329E0",
  "PyByteArray_Concat": "0x141F32790",
  "PyByteArray_FromStringAndSize": "0x141F32A00",
  "PyByteArray_Resize": "0x141F32AF0",
  "PyByteArray_Type": "0x1434C1AF0",
  "PyCallable_Check": "0x141E9C3E0",
  "PyCallIter_New": "0x141F3B170",
  "PyCapsule_GetContext": "0x141EE04F0",
  "PyCapsule_GetName": "0x141EE0530",
  "PyCapsule_GetPointer": "0x141EE0570",
  "PyCapsule_Import": "0x141EE0610",
  "PyCapsule_IsValid": "0x141EE07D0",
  "PyCapsule_New": "0x141EE0830",
  "PyCapsule_SetContext": "0x141EE08C0",
  "PyCapsule_SetDestructor": "0x141EE0910",
  "PyCapsule_Type": "0x1434AC230",
  "PyCell_Get": "0x141F3ADB0",
  "PyCell_New": "0x141F3AE10",
  "PyCell_Set": "0x142031050",
  "PyCell_Type": "0x1434C39F0",
  "PyCFunction_Call": "0x141ED94E0",
  "PyCFunction_ClearFreeList": "0x141ED9A50",
  "PyCFunction_Fini": "0x141ED9AA0",
  "PyCFunction_GetFunction": "0x141ED9AE0",
  "PyCFunction_NewEx": "0x141ED9B20",
  "PyCFunction_Type": "0x1434AB660",
  "PyClass_IsSubclass": "0x141EDF1E0",
  "PyClass_New": "0x141EDF2B0",
  "PyClass_Type": "0x1434AB8E0",
  "PyClassMethod_Type": "0x1434B6BE0",
  "PyCode_Addr2Line": "0x141F1CB80",
  "PyCode_New": "0x141F1CBF0",
  "PyCode_NewEmpty": "0x141F1CED0",
  "PyCode_Optimize": "0x141F68B60",
  "PyCode_Type": "0x1434B8390",
  "PyCodec_BackslashReplaceErrors": "0x141F42060",
  "PyCodec_Decode": "0x141F422A0",
  "PyCodec_Encode": "0x141F42330",
  "PyCodec_LookupError": "0x141F423C0",
  "PyCodec_Register": "0x141F42470",
  "PyCodec_RegisterError": "0x141F42500",
  "PyCodec_ReplaceErrors": "0x141F42590",
  "PyCodec_StreamReader": "0x141F42780",
  "PyCodec_StrictErrors": "0x141F42810",
  "PyCodec_XMLCharRefReplaceErrors": "0x141F42860",
  "PyDescr_NewClassMethod": "0x141EF5250",
  "PyDescr_NewGetSet": "0x141EF52E0",
  "PyDescr_NewMember": "0x141EF5370",
  "PyDescr_NewMethod": "0x141EF5400",
  "PyDescr_NewWrapper": "0x141EF5490",
  "PyDict_Clear": "0x141ED6F40",
  "PyDict_Contains": "0x141ED4A70",
  "PyDict_Copy": "0x141ED7070",
  "PyDict_DelItem": "0x141ED7110",
  "PyDict_DelItemString": "0x141ED71C0",
  "PyDict_Fini": "0x141ED7220",
  "PyDict_GetItem": "0x141ED7270",
  "PyDict_GetItemString": "0x141ED7340",
  "PyDict_Items": "0x141ED73A0",
  "PyDict_Keys": "0x141ED7520",
  "PyDict_Merge": "0x141ED7630",
  "PyDict_MergeFromSeq2": "0x141ED7930",
  "PyDict_New": "0x141ED7BC0",
  "PyDict_Next": "0x141ED7C80",
  "PyDict_SetItem": "0x141ED7D20",
  "PyDict_SetItemString": "0x141ED7DC0",
  "PyDict_Size": "0x141ED7E40",
  "PyDict_Type": "0x1434A9E00",
  "PyDict_Update": "0x141ED7E80",
  "PyDictProxy_New": "0x141EF5540",
  "PyErr_BadArgument": "0x141EE0960",
  "PyErr_CheckSignals": "0x141F285D0",
  "PyErr_Clear": "0x141EE09F0",
  "PyErr_Display": "0x141EFEB10",
  "PyErr_ExceptionMatches": "0x141EE0A00",
  "PyErr_Fetch": "0x141EE0A20",
  "PyErr_Format": "0x141EE0A50",
  "PyErr_GivenExceptionMatches": "0x141EE0AF0",
  "PyErr_NewException": "0x141EE0C80",
  "PyErr_NoMemory": "0x141EE0F50",
  "PyErr_NormalizeException": "0x141EE0FE0",
  "PyErr_Occurred": "0x141EE12C0",
  "PyErr_Print": "0x141EFF030",
  "PyErr_PrintEx": "0x141EFF040",
  "PyErr_ProgramText": "0x141EE12D0",
  "PyErr_Restore": "0x141EE13B0",
  "PyErr_SetExcFromWindowsErr": "0x141EE14A0",
  "PyErr_SetFromErrno": "0x141EE1600",
  "PyErr_SetFromErrnoWithFilenameObject": "0x141EE14B0",
  "PyErr_SetFromWindowsErr": "0x141EE1880",
  "PyErr_SetNone": "0x141EE19B0",
  "PyErr_SetObject": "0x141EE19E0",
  "PyErr_SetString": "0x141EE1A30",
  "PyErr_SyntaxLocation": "0x141EE1AC0",
  "PyErr_WarnEx": "0x141F26C60",
  "PyErr_WriteUnraisable": "0x141EE1DF0",
  "PyEval_AcquireThread": "0x141EE3EA0",
  "PyEval_CallMethod": "0x141EE2CC0",
  "PyEval_CallObjectWithKeywords": "0x141EE3EF0",
  "PyEval_EvalCode": "0x141EE4000",
  "PyEval_EvalCodeEx": "0x141EE4030",
  "PyEval_EvalFrameEx": "0x141EE48B0",
  "PyEval_GetBuiltins": "0x141EE84B0",
  "PyEval_GetFrame": "0x141EE8520",
  "PyEval_GetFuncDesc": "0x141EE8530",
  "PyEval_GetFuncName": "0x141EE8590",
  "PyEval_GetGlobals": "0x141EE8610",
  "PyEval_GetLocals": "0x141EE8640",
  "PyEval_GetRestricted": "0x141EE8680",
  "PyEval_InitThreads": "0x141EE86D0",
  "PyEval_MergeCompilerFlags": "0x141EE8710",
  "PyEval_ReleaseLock": "0x141EE8760",
  "PyEval_RestoreThread": "0x141EE8770",
  "PyEval_SaveThread": "0x141EE87D0",
  "PyEval_SetProfile": "0x141EE8810",
  "PyEval_SetTrace": "0x141EE88C0",
  "PyExc_AttributeError": "0x1434AE420",
  "PyExc_BaseException": "0x1434AE3E0",
  "PyExc_BufferError": "0x1434AE510",
  "PyExc_Exception": "0x1434AE3E8",
  "PyExc_FutureWarning": "0x1434AE548",
  "PyExc_GeneratorExit": "0x1434AE3F8",
  "PyExc_ImportError": "0x1434AE450",
  "PyExc_IndexError": "0x1434AE458",
  "PyExc_IOError": "0x1434AE440",
  "PyExc_KeyError": "0x1434AE460",
  "PyExc_MemoryError": "0x1434AE470",
  "PyExc_NameError": "0x1434AE478",
  "PyExc_NotImplementedError": "0x1434AE490",
  "PyExc_OSError": "0x1434AE448",
  "PyExc_OverflowError": "0x1434AE480",
  "PyExc_RuntimeError": "0x1434AE488",
  "PyExc_RuntimeWarning": "0x1434AE540",
  "PyExc_StandardError": "0x1434AE400",
  "PyExc_StopIteration": "0x1434AE3F0",
  "PyExc_SystemError": "0x1434AE4B8",
  "PyExc_TypeError": "0x1434AE4C8",
  "PyExc_UnicodeError": "0x1434AE4D8",
  "PyExc_ValueError": "0x1434AE4F8",
  "PyExc_WindowsError": "0x1434AE508",
  "PyExc_ZeroDivisionError": "0x1434AE500",
  "PyFile_AsFile": "0x141F38130",
  "PyFile_DecUseCount": "0x141F38170",
  "PyFile_FromFile": "0x141F38180",
  "PyFile_GetLine": "0x141F38280",
  "PyFile_IncUseCount": "0x141F38610",
  "PyFile_Name": "0x141F38620",
  "PyFile_SetBufSize": "0x141F38660",
  "PyFile_SetEncodingAndErrors": "0x141F38700",
  "PyFile_SoftSpace": "0x141F387D0",
  "PyFile_Type": "0x1434C23A0",
  "PyFile_WriteObject": "0x141F388E0",
  "PyFile_WriteString": "0x141F38B50",
  "PyFloat_AsDouble": "0x141EFC570",
  "PyFloat_ClearFreeList": "0x141EFC690",
  "PyFloat_Fini": "0x141EFD0E0",
  "PyFloat_FromDouble": "0x141EFD240",
  "PyFloat_FromString": "0x141EFD300",
  "PyFloat_GetInfo": "0x141EFD540",
  "PyFloat_Type": "0x1434B4460",
  "PyFrame_BlockPop": "0x141EF2730",
  "PyFrame_BlockSetup": "0x141EF2780",
  "PyFrame_ClearFreeList": "0x141EF2800",
  "PyFrame_FastToLocals": "0x141EF2850",
  "PyFrame_Fini": "0x141EF2A70",
  "PyFrame_GetLineNumber": "0x141EF2AE0",
  "PyFrame_LocalsToFast": "0x141EF2B00",
  "PyFrame_New": "0x141EF2D30",
  "PyFrame_Type": "0x1434AC5F0",
  "PyFrozenSet_New": "0x141F24E50",
  "PyFrozenSet_Type": "0x1434BC740",
  "PyFunction_New": "0x141F10B20",
  "PyFunction_SetClosure": "0x141F10CB0",
  "PyFunction_SetDefaults": "0x141F10D80",
  "PyFunction_Type": "0x1434B6A50",
  "PyGC_Collect": "0x141F20350",
  "PyGILState_Ensure": "0x141EE2150",
  "PyGILState_GetThisThreadState": "0x141EE21E0",
  "PyGILState_Release": "0x141EE2200",
  "PyImport_AddModule": "0x141F019A0",
  "PyImport_Cleanup": "0x141F01BC0",
  "PyImport_ExecCodeModuleEx": "0x141F02150",
  "PyImport_GetMagicNumber": "0x141F02320",
  "PyImport_GetModuleDict": "0x141F02330",
  "PyImport_Import": "0x141F02360",
  "PyImport_ImportFrozenModule": "0x141F025D0",
  "PyImport_ImportModule": "0x141F027D0",
  "PyImport_ImportModuleLevel": "0x141F02820",
  "PyImport_ImportModuleNoBlock": "0x141F028F0",
  "PyImport_ReloadModule": "0x141F029A0",
  "PyInstance_New": "0x141ED9EE0",
  "PyInstance_NewRaw": "0x141EDF660",
  "PyInstance_Type": "0x1434ABA80",
  "PyInt_AsLong": "0x141F078C0",
  "PyInt_AsSsize_t": "0x141F079E0",
  "PyInt_AsUnsignedLongLongMask": "0x141F07B50",
  "PyInt_AsUnsignedLongMask": "0x141F07CA0",
  "PyInt_ClearFreeList": "0x141F07DE0",
  "PyInt_Fini": "0x141F08250",
  "PyInt_FromLong": "0x141F083B0",
  "PyInt_FromSize_t": "0x141F08430",
  "PyInt_FromSsize_t": "0x141F08450",
  "PyInt_FromString": "0x141F08470",
  "PyInt_FromUnicode": "0x141F08670",
  "PyInt_GetMax": "0x141F08700",
  "PyInt_Type": "0x1434B5C70",
  "PyInterpreterState_Clear": "0x141EE22D0",
  "PyInterpreterState_Delete": "0x141EE2440",
  "PyInterpreterState_New": "0x141EE2520",
  "PyIter_Next": "0x141EEB4D0",
  "PyList_Append": "0x141ED3020",
  "PyList_AsTuple": "0x141ED3060",
  "PyList_Fini": "0x141ED3120",
  "PyList_GetItem": "0x141ED3170",
  "PyList_GetSlice": "0x141ED31F0",
  "PyList_Insert": "0x141ED3230",
  "PyList_New": "0x141ED3270",
  "PyList_Reverse": "0x141ED33D0",
  "PyList_SetItem": "0x141ED3450",
  "PyList_SetSlice": "0x141ED3530",
  "PyList_Size": "0x141ED3570",
  "PyList_Sort": "0x141ED35B0",
  "PyList_Type": "0x1434A9AC0",
  "PyLong_AsDouble": "0x141F0B680",
  "PyLong_AsLong": "0x141F0B730",
  "PyLong_AsLongAndOverflow": "0x141F0B770",
  "PyLong_AsLongLong": "0x141F0B940",
  "PyLong_AsSsize_t": "0x141F0BAB0",
  "PyLong_AsUnsignedLong": "0x141F0BBA0",
  "PyLong_AsUnsignedLongLong": "0x141F0BC70",
  "PyLong_AsUnsignedLongLongMask": "0x141F0BCE0",
  "PyLong_AsUnsignedLongMask": "0x141F0BD70",
  "PyLong_AsVoidPtr": "0x141F0BE00",
  "PyLong_FromDouble": "0x141F0BEA0",
  "PyLong_FromLong": "0x141F0C060",
  "PyLong_FromLongLong": "0x141F0C0E0",
  "PyLong_FromSize_t": "0x141F0C180",
  "PyLong_FromSsize_t": "0x141F0C1B0",
  "PyLong_FromString": "0x141F0C1E0",
  "PyLong_FromUnicode": "0x141F0C830",
  "PyLong_FromUnsignedLong": "0x141F0C8B0",
  "PyLong_FromUnsignedLongLong": "0x141F0C920",
  "PyLong_FromVoidPtr": "0x141F0C9A0",
  "PyLong_GetInfo": "0x141F0CA20",
  "PyLong_Type": "0x1434B64A0",
  "PyMapping_Check": "0x141EEB510",
  "PyMapping_GetItemString": "0x141EEB560",
  "PyMapping_SetItemString": "0x141EEB5F0",
  "PyMapping_Size": "0x141EEB800",
  "PyMem_Free": "0x141E9C4C0",
  "PyMem_Malloc": "0x141E9C4D0",
  "PyMem_Realloc": "0x141E9C4E0",
  "PyMember_GetOne": "0x141F45900",
  "PyMember_SetOne": "0x141F45B90",
  "PyMethod_ClearFreeList": "0x141EDF7C0",
  "PyMethod_Fini": "0x141EDF810",
  "PyMethod_New": "0x141EDF850",
  "PyMethod_Type": "0x1434ABC10",
  "PyModule_AddIntConstant": "0x141EE2D70",
  "PyModule_AddObject": "0x141EE2DF0",
  "PyModule_AddStringConstant": "0x141EE2EE0",
  "PyModule_GetDict": "0x141EFE7A0",
  "PyModule_GetName": "0x141EFE800",
  "PyModule_New": "0x141EFE890",
  "PyModule_Type": "0x1434B4610",
  "PyNode_AddChild": "0x141F5F020",
  "PyNode_Free": "0x141F5F160",
  "PyNode_New": "0x141F5F180",
  "PyNumber_Absolute": "0x141EEB880",
  "PyNumber_Add": "0x141EEB8F0",
  "PyNumber_And": "0x141EEB9B0",
  "PyNumber_AsOff_t": "0x141FAFF70",
  "PyNumber_AsSsize_t": "0x141EEBA50",
  "PyNumber_Check": "0x141EEBB30",
  "PyNumber_Coerce": "0x141E9C4F0",
  "PyNumber_CoerceEx": "0x141E9C520",
  "PyNumber_Divide": "0x141EEBB60",
  "PyNumber_Divmod": "0x141EEBC00",
  "PyNumber_Float": "0x141EEBCA0",
  "PyNumber_FloorDivide": "0x141EEBD90",
  "PyNumber_Index": "0x141EEC720",
  "PyNumber_InPlaceAdd": "0x141EEBE30",
  "PyNumber_InPlaceAnd": "0x141EEBF00",
  "PyNumber_InPlaceDivide": "0x141EEBFB0",
  "PyNumber_InPlaceFloorDivide": "0x141EEC060",
  "PyNumber_InPlaceLshift": "0x141EEC100",
  "PyNumber_InPlaceMultiply": "0x141EEC1B0",
  "PyNumber_InPlaceOr": "0x141EEC2C0",
  "PyNumber_InPlacePower": "0x141EEC370",
  "PyNumber_InPlaceRemainder": "0x141EEC3C0",
  "PyNumber_InPlaceRshift": "0x141EEC470",
  "PyNumber_InPlaceSubtract": "0x141EEC520",
  "PyNumber_InPlaceTrueDivide": "0x141EEC5D0",
  "PyNumber_InPlaceXor": "0x141EEC670",
  "PyNumber_Int": "0x141EEC830",
  "PyNumber_Invert": "0x141EECAD0",
  "PyNumber_Long": "0x141EECB40",
  "PyNumber_Lshift": "0x141EECE20",
  "PyNumber_Multiply": "0x141EECEC0",
  "PyNumber_Negative": "0x141EECFB0",
  "PyNumber_Or": "0x141EED020",
  "PyNumber_Positive": "0x141EED0C0",
  "PyNumber_Power": "0x141EED130",
  "PyNumber_Remainder": "0x141EED150",
  "PyNumber_Rshift": "0x141EED1F0",
  "PyNumber_Subtract": "0x141EED290",
  "PyNumber_ToBase": "0x141EED330",
  "PyNumber_TrueDivide": "0x141EED3F0",
  "PyNumber_Xor": "0x141EED490",
  "PyObject_AsCharBuffer": "0x141EED530",
  "PyObject_AsFileDescriptor": "0x141F38C90",
  "PyObject_AsReadBuffer": "0x141EED600",
  "PyObject_AsWriteBuffer": "0x141EED6D0",
  "PyObject_Call": "0x141EED7A0",
  "PyObject_CallFunction": "0x141EED860",
  "PyObject_CallFunctionObjArgs": "0x141EED8F0",
  "PyObject_CallMethod": "0x141EED990",
  "PyObject_CallMethodObjArgs": "0x141EEDA70",
  "PyObject_CallObject": "0x141EEDB60",
  "PyObject_CheckReadBuffer": "0x141EEDB70",
  "PyObject_ClearWeakRefs": "0x141EAE480",
  "PyObject_Cmp": "0x141EEDBB0",
  "PyObject_Compare": "0x141E9C5D0",
  "PyObject_CopyData": "0x141EEDC20",
  "PyObject_DelItem": "0x141EEE190",
  "PyObject_DelItemString": "0x141EEE340",
  "PyObject_Dir": "0x141E9C670",
  "PyObject_Format": "0x141EEE500",
  "PyObject_Free": "0x141F05E70",
  "PyObject_GC_Del": "0x141F203C0",
  "PyObject_GC_Track": "0x141F20410",
  "PyObject_GC_UnTrack": "0x141F20470",
  "PyObject_GenericGetAttr": "0x141E9C730",
  "PyObject_GenericSetAttr": "0x141E9C740",
  "PyObject_GetAttr": "0x141E9C750",
  "PyObject_GetAttrString": "0x141E9C820",
  "PyObject_GetBuffer": "0x141EEE7A0",
  "PyObject_GetItem": "0x141EEE800",
  "PyObject_GetIter": "0x141EEE9A0",
  "PyObject_HasAttr": "0x141E9C8A0",
  "PyObject_HasAttrString": "0x141E9C8F0",
  "PyObject_Hash": "0x141E9C940",
  "PyObject_HashNotImplemented": "0x141E9C9F0",
  "PyObject_Init": "0x141E9CA20",
  "PyObject_InitVar": "0x141E9CA40",
  "PyObject_IsInstance": "0x141EEEAA0",
  "PyObject_IsSubclass": "0x141EEEC70",
  "PyObject_IsTrue": "0x141E9CA60",
  "PyObject_Malloc": "0x141F06090",
  "PyObject_Not": "0x141E9CB10",
  "PyObject_Print": "0x141E9CB30",
  "PyObject_Realloc": "0x141F063D0",
  "PyObject_Repr": "0x141E9CB40",
  "PyObject_RichCompare": "0x141E9CC90",
  "PyObject_RichCompareBool": "0x141E9CE50",
  "PyObject_SetAttr": "0x141E9CF10",
  "PyObject_SetAttrString": "0x141E9D0C0",
  "PyObject_SetItem": "0x141EEEE20",
  "PyObject_Size": "0x141EEEFE0",
  "PyObject_Str": "0x141E9D150",
  "PyObject_Type": "0x141EEF070",
  "PyObject_Unicode": "0x141E9D2C0",
  "PyOS_double_to_string": "0x141F438D0",
  "PyOS_getsig": "0x141EFF330",
  "PyOS_InterruptOccurred": "0x141F28870",
  "PyOS_Readline": "0x141F73390",
  "PyOS_setsig": "0x141EFF3C0",
  "PyOS_snprintf": "0x141F3BBC0",
  "PyOS_string_to_double": "0x141F43A20",
  "PyOS_strtol": "0x141F68840",
  "PyOS_strtoul": "0x141F688F0",
  "PyOS_vsnprintf": "0x141F3BC50",
  "PyParser_ASTFromFile": "0x141EFF3D0",
  "PyProperty_Type": "0x1434AD480",
  "PyRun_SimpleStringFlags": "0x141EFF770",
  "PyRun_StringFlags": "0x141EFF810",
  "PySequence_Check": "0x141EEF0C0",
  "PySequence_Concat": "0x141EEF110",
  "PySequence_Contains": "0x141EEF280",
  "PySequence_Count": "0x141EEF2B0",
  "PySequence_DelItem": "0x141EEF2C0",
  "PySequence_DelSlice": "0x141EEF380",
  "PySequence_Fast": "0x141EEF450",
  "PySequence_GetItem": "0x141EEF5A0",
  "PySequence_GetSlice": "0x141EEF660",
  "PySequence_Index": "0x141EEFA90",
  "PySequence_InPlaceConcat": "0x141EEF790",
  "PySequence_InPlaceRepeat": "0x141EEF910",
  "PySequence_List": "0x141EEFAA0",
  "PySequence_Repeat": "0x141EEFB50",
  "PySequence_SetSlice": "0x141EEFCA0",
  "PySequence_Size": "0x141EEFDD0",
  "PySequence_Tuple": "0x141EEFE50",
  "PySet_Add": "0x141F24E60",
  "PySet_Fini": "0x141F24F70",
  "PySet_New": "0x141F25020",
  "PySet_Type": "0x1434BC580",
  "PySlice_GetIndicesEx": "0x142022730",
  "PySlice_New": "0x141F21AF0",
  "PySlice_Type": "0x1434BBFB0",
  "PyString_AsString": "0x141EC7380",
  "PyString_AsStringAndSize": "0x141EC73E0",
  "PyString_Concat": "0x141EC74D0",
  "PyString_ConcatAndDel": "0x141EC7540",
  "PyString_DecodeEscape": "0x141EC75F0",
  "PyString_Fini": "0x141EC7C20",
  "PyString_Format": "0x141EC7CB0",
  "PyString_FromFormat": "0x141EC8F40",
  "PyString_FromFormatV": "0x141EC8F70",
  "PyString_FromString": "0x141EC9760",
  "PyString_FromStringAndSize": "0x141EC98D0",
  "PyString_InternFromString": "0x141EC9A70",
  "PyString_InternInPlace": "0x141EC9AA0",
  "PyString_Repr": "0x141EC9BB0",
  "PyString_Size": "0x141EC9DA0",
  "PyString_Type": "0x1434A8750",
  "PySys_GetFile": "0x141F1E430",
  "PySys_GetObject": "0x141F1E4A0",
  "PySys_HasWarnOptions": "0x141F1E4D0",
  "PySys_SetArgv": "0x141F1E500",
  "PySys_SetArgvEx": "0x141F1E510",
  "PySys_SetObject": "0x141F1E7E0",
  "PySys_SetPath": "0x141F1E850",
  "PySys_WriteStderr": "0x141F1E9C0",
  "PyThread_acquire_lock": "0x141EF3160",
  "PyThread_allocate_lock": "0x141EF31E0",
  "PyThread_create_key": "0x141EF3260",
  "PyThread_delete_key": "0x141EF3270",
  "PyThread_delete_key_value": "0x141EF3280",
  "PyThread_exit_thread": "0x141EF3290",
  "PyThread_free_lock": "0x141EF32B0",
  "PyThread_get_key_value": "0x141EF32E0",
  "PyThread_get_stacksize": "0x141EF3320",
  "PyThread_get_thread_ident": "0x141EF3330",
  "PyThread_init_thread": "0x141EF3350",
  "PyThread_release_lock": "0x141EF3370",
  "PyThread_set_key_value": "0x141EF33A0",
  "PyThread_set_stacksize": "0x141EF33F0",
  "PyThread_start_new_thread": "0x141EF3420",
  "PyThreadState_Clear": "0x141EE25C0",
  "PyThreadState_DeleteCurrent": "0x141EE27C0",
  "PyThreadState_Get": "0x141EE2820",
  "PyThreadState_GetDict": "0x141EE2850",
  "PyThreadState_New": "0x141EE28A0",
  "PyThreadState_Swap": "0x141EE28B0",
  "PyTraceBack_Here": "0x141F3A6A0",
  "PyTraceBack_Print": "0x141F3A790",
  "PyTraceBack_Type": "0x1434C3790",
  "PyTuple_ClearFreeList": "0x141ECFA90",
  "PyTuple_Fini": "0x141ECFB20",
  "PyTuple_GetItem": "0x141ECFBD0",
  "PyTuple_GetSlice": "0x141ECFC30",
  "PyTuple_New": "0x141ECFC70",
  "PyTuple_Pack": "0x141ECFDF0",
  "PyTuple_SetItem": "0x141ECFE80",
  "PyTuple_Size": "0x141ECFF60",
  "PyTuple_Type": "0x1434A8D50",
  "PyType_ClearCache": "0x141EA7600",
  "PyType_GenericAlloc": "0x141EA5840",
  "PyType_GenericNew": "0x141EA5950",
  "PyType_IsSubtype": "0x141EA7700",
  "PyType_Modified": "0x141EA7780",
  "PyType_Ready": "0x141EA7820",
  "PyType_Type": "0x1434A1AD0",
  "PyUnicode_Type": "0x1434A54C0",
  "PyUnicodeDecodeError_Create": "0x141EF7DE0",
  "PyUnicodeDecodeError_GetEnd": "0x141EF7E20",
  "PyUnicodeDecodeError_SetStart": "0x141EF7F60",
  "PyUnicodeEncodeError_Create": "0x141EF7F70",
  "PyUnicodeEncodeError_GetEnd": "0x141EF7FB0",
  "PyUnicodeEncodeError_GetObject": "0x141EF8080",
  "PyUnicodeEncodeError_GetStart": "0x141EF8100",
  "PyUnicodeEncodeError_SetEnd": "0x141EF7EF0",
  "PyUnicodeUCS2_AsEncodedString": "0x141EB30D0",
  "PyUnicodeUCS2_AsUTF8String": "0x141EB33B0",
  "PyUnicodeUCS2_AsWideChar": "0x141EB3460",
  "PyUnicodeUCS2_DecodeUTF16Stateful": "0x141EB4D20",
  "PyUnicodeUCS2_DecodeUTF32Stateful": "0x141EB5330",
  "PyUnicodeUCS2_DecodeUTF8": "0x141EB5920",
  "PyUnicodeUCS2_DecodeUTF8Stateful": "0x141EB5930",
  "PyUnicodeUCS2_Encode": "0x141EB68C0",
  "PyUnicodeUCS2_EncodeASCII": "0x141EB6BF0",
  "PyUnicodeUCS2_EncodeCharmap": "0x141EB6C00",
  "PyUnicodeUCS2_EncodeLatin1": "0x141EB7580",
  "PyUnicodeUCS2_EncodeUnicodeEscape": "0x141EB7C10",
  "PyUnicodeUCS2_EncodeUTF8": "0x141EB7A50",
  "PyUnicodeUCS2_Find": "0x141EB7C20",
  "PyUnicodeUCS2_Format": "0x141EB7D50",
  "PyUnicodeUCS2_FromEncodedObject": "0x141EB8EF0",
  "PyUnicodeUCS2_FromObject": "0x141EB9D80",
  "PyUnicodeUCS2_FromOrdinal": "0x141EB9DF0",
  "PyUnicodeUCS2_FromString": "0x141EB9ED0",
  "PyUnicodeUCS2_FromStringAndSize": "0x141EB9F20",
  "PyUnicodeUCS2_FromUnicode": "0x141EBA040",
  "PyUnicodeUCS2_FromWideChar": "0x141EBA1A0",
  "PyUnicodeUCS2_Join": "0x141EBA270",
  "PyUnicodeUCS2_Resize": "0x141EBAB20",
  "PyWeakref_GetObject": "0x141EAE6E0",
  "PyWeakref_NewProxy": "0x141EAE760",
  "PyWeakref_NewRef": "0x141EAE9A0",
  "warnoptions": "0x143B328E0"
}