{
    "xfw_prefix": "xfw_native_hooks",
    "xfw_features": ["native","python"],
    "xfw_url": "https://modxvm.com/",
    "xfw_url_update": "https://modxvm.com/",
    "xfw_wot_versions": ["1.23.0.0"],
    "xfw_wot_versions_strategy": "allow_newer"
}