{
    "architecture": [ "x86_32", "x86_64"],

    "xfw_prefix": "xfw_hidpi",
    "xfw_features": ["native","python"],
    "xfw_dependencies": [],
    "xfw_url": "https://gitlab.com/xvm/xvm-components/xfw.hidpi",
    "xfw_url_update": "https://gitlab.com/xvm/xvm-components/xfw.hidpi",
    "xfw_wot_versions": ["1.18.0.0"],
    "xfw_wot_versions_strategy": "allow_newer"
}