{
    "xfw_prefix": "xfw_crashfix",
    "xfw_features": [
        "native",
        "python"
    ],
    "xfw_dependencies": [
        "com.modxvm.xfw.loader"
    ],
    "xfw_url": "https://gitlab.com/xvm/xvm-components/xfw.crashfix",
    "xfw_url_update": "https://gitlab.com/xvm/xvm-components/xfw.crashfix",
    "xfw_wot_versions": [
        "1.19.1.0"
    ],
    "xfw_wot_versions_strategy": "allow_newer"
}