{
  "Functions": [
    {
      "Name": "_PyType_Lookup",
      "Arguments": "PyTypeObject *, PyObject *",
      "ReturnType": "PyObject *",
      "Signatures": [
        {
          "Signature": "40 57 41 55 41 56 48 83 EC 30 48 8D 05"
        }
      ]
    },
    {
      "Name": "PyType_ClearCache",
      "Arguments": "void",
      "ReturnType": "unsigned int",
      "Signatures": [
        {
          "Signature": "48 89 5C 24 08 48 89 6C 24 10 48 89 74 24 18 48 89 7C 24 20 41 56 48 83 EC 20 8B 2D"
        }
      ]
    },
    {
      "Name": "PyType_GenericAlloc",
      "Arguments": "PyTypeObject *, Py_ssize_t",
      "ReturnType": "PyObject *",
      "Signatures": [
        {
          "Signature": "48 89 5C 24 08 48 89 6C 24 10 48 89 74 24 18 57 48 83 EC 20 48 8B 71 20 4C 8D 42 01"
        }
      ]
    },
    {
      "Name": "PyType_GenericNew",
      "Arguments": "PyTypeObject *, PyObject *, PyObject *",
      "ReturnType": "PyObject *",
      "Signatures": [
        {
          "Signature": "33 D2 48 FF A1 30 01 00 00"
        }
      ]
    },
    {
      "Name": "PyType_IsSubtype",
      "Arguments": "PyTypeObject *, PyTypeObject *",
      "ReturnType": "int",
      "Signatures": [
        {
          "Signature": "F7 81 A8 00 00 00 00 01 00 00 75"
        }
      ]
    },
    {
      "Name": "PyType_Modified",
      "Arguments": "PyTypeObject *",
      "ReturnType": "void",
      "Signatures": [
        {
          "Signature": "40 55 48 83 EC 20 8B 81 A8 00 00 00"
        }
      ]
    },
    {
      "Name": "PyType_Ready",
      "Arguments": "PyTypeObject *",
      "ReturnType": "int",
      "Signatures": [
        {
          "Signature": "40 53 48 81 EC 80 01 00 00 48 8B 05 ? ? ? ? 48 33 C4 48 89 84 24 60 01 00 00"
        }
      ]
    }
  ],
  "Structures": [
    {
      "Name": "PyType_Type",
      "Type": "PyTypeObject",
      "Signatures": [
        {
          "Signature": "_PyBuiltin_Init+0x3D2",
          "ValidationPrefix": "4C 8D 05"
        }
      ]
    }
  ]
}