{
  "Functions": [
    {
      "Name": "BW_Py_DEC_REF",
      "Arguments": "PyObject*",
      "ReturnType": "void",
      "Signatures": [
        {
          "Signature": "48 8B 05 ? ? ? ? 48 85 C0 74 ? 48 FF E0 C3 48 8B 05 ? ? ? ? 48 85 C0 74 ? 48 FF E0 C3 48 8B 05 ? ? ? ? 48 85 C0 74 ? 48 FF E0 C3 48 8B 05 ? ? ? ? 48 85 C0 74 ? 48 FF E0 C3 48 8B 05 ? ? ? ? 48 85 C0 74 ? 48 FF E0 C3"
        }
      ]
    },
    {
      "Name": "BW_Py_INC_REF",
      "Arguments": "PyObject*",
      "ReturnType": "void",
      "Signatures": [
        {
          "Signature": "48 8B 05 ? ? ? ? 48 85 C0 74 ? 48 FF E0 C3 48 8B 05 ? ? ? ? 48 85 C0 74 ? 48 FF E0 C3 48 8B 05 ? ? ? ? 48 85 C0 74 ? 48 FF E0 C3 48 8B 05 ? ? ? ? 48 85 C0 74 ? 48 FF E0 C3 48 8B 05 ? ? ? ? 48 85 C0 74 ? 48 FF E0 48 FF 25"
        }
      ]
    }
  ],
  "Structures": []
}