{
  "Functions": [
    {
      "Name": "PyCallable_Check",
      "Arguments": "PyObject *",
      "ReturnType": "int",
      "Signatures": [
        {
          "Signature": "40 53 48 83 EC 20 48 8B D9 48 85 C9 75 ? 33 C0 48 83 C4 20 5B C3 48 8B 49 08"
        }
      ]
    }
  ],
  "Structures": []
}