{
  "Functions": [
    {
      "Name": "_PyWeakref_ClearRef",
      "Arguments": "PyWeakReference *",
      "ReturnType": "void",
      "Signatures": [
        {
          "Signature": "48 89 5C 24 08 57 48 83 EC 20 48 8B 59 18 48 8B F9 48 C7 41 18 00 00 00 00"
        }
      ]
    },
    {
      "Name": "_PyWeakref_GetWeakrefCount",
      "Arguments": "PyWeakReference *",
      "ReturnType": "Py_ssize_t",
      "Signatures": [
        {
          "Signature": "33 C0 48 85 C9 74 ? 66 0F 1F 84 00 00 00 00 00 48 8B 49 30"
        }
      ]
    },
    {
      "Name": "PyWeakref_GetObject",
      "Arguments": "PyObject *",
      "ReturnType": "PyObject *",
      "Signatures": [
        {
          "Signature": "40 53 48 83 EC 20 48 8B D9 48 85 C9 74 ? 48 8B 49 08 48 8D 15 ? ? ? ? 48 3B CA 74 ? E8 ? ? ? ? 85 C0 75"
        }
      ]
    },
    {
      "Name": "PyWeakref_NewProxy",
      "Arguments": "PyObject *, PyObject *",
      "ReturnType": "PyObject *",
      "Signatures": [
        {
          "Signature": "40 55 48 83 EC 40 4C 8B 41 08"
        }
      ]
    },
    {
      "Name": "PyWeakref_NewRef",
      "Arguments": "PyObject *, PyObject *",
      "ReturnType": "PyObject *",
      "Signatures": [
        {
          "Signature": "40 57 48 83 EC 30 4C 8B 41 08"
        }
      ]
    }
  ],
  "Structures": [
    {
      "Name": "_PyWeakref_CallableProxyType",
      "Type": "PyTypeObject",
      "Signatures": [
        {
          "Signature": "PyWeakref_GetObject+0x3A",
          "ValidationPrefix": "48 8D 0D"
        }
      ]
    },
    {
      "Name": "_PyWeakref_ProxyType",
      "Type": "PyTypeObject",
      "Signatures": [
        {
          "Signature": "PyWeakref_GetObject+0x2E",
          "ValidationPrefix": "48 8D 0D"
        }
      ]
    },
    {
      "Name": "_PyWeakref_RefType",
      "Type": "PyTypeObject",
      "Signatures": [
        {
          "Signature": "PyWeakref_GetObject+0x15",
          "ValidationPrefix": "48 8D 15"
        }
      ]
    }
  ]
}