{
  "Functions": [
    {
      "Name": "PyMember_Get",
      "Arguments": "const char *, struct memberlist *, const char *",
      "ReturnType": "PyObject *",
      "Signatures": []
    },
    {
      "Name": "PyMember_GetOne",
      "Arguments": "const char *, PyMemberDef *",
      "ReturnType": "PyObject *",
      "Signatures": [
        {
          "Signature": "48 89 5C 24 08 57 48 83 EC 20 F6 42 18 02"
        }
      ]
    },
    {
      "Name": "PyMember_Set",
      "Arguments": "char *, struct memberlist *, const char *, PyObject *",
      "ReturnType": "int",
      "Signatures": []
    },
    {
      "Name": "PyMember_SetOne",
      "Arguments": "char *, PyMemberDef *, PyObject *",
      "ReturnType": "int",
      "Signatures": [
        {
          "Signature": "48 89 5C 24 10 48 89 74 24 18 48 89 7C 24 20 41 56 48 83 EC 30 8B 42 18"
        }
      ]
    }
  ],
  "Structures": []
}