{
  "Functions": [
    {
      "Name": "PyGen_NeedsFinalizing",
      "Arguments": "PyGenObject *",
      "ReturnType": "int",
      "Signatures": []
    },
    {
      "Name": "PyGen_New",
      "Arguments": "PyFrameObject *",
      "ReturnType": "PyObject *",
      "Signatures": []
    }
  ],
  "Structures": [
    {
      "Name": "PyGen_Type",
      "Type": "PyTypeObject",
      "Signatures": []
    }
  ]
}