{
  "Functions": [
    {
      "Name": "PyUnicodeEncodeError_Create",
      "Arguments": "const char *, const Py_UNICODE *, Py_ssize_t, Py_ssize_t, Py_ssize_t, const char *",
      "ReturnType": "PyObject *",
      "Signatures": [
        {
          "Signature": "48 83 EC 48 48 8B 44 24 78 48 89 44 24 38 48 8B 44 24 70 48 89 44 24 30 4C 89 4C 24 28 4C 8B CA 4C 89 44 24 20 48 8D 15 ? ? ? ? 4C 8B C1 48 8B 0D ? ? ? ? E8 ? ? ? ? 48 83 C4 48 C3 48 89 5C 24 08 48 89 74 24 10 57 48 83 EC 20 48 8B 59 30 48 8B FA 48 8B F1 48 85 DB 75 ? 48 8D 15 ? ? ? ? EB ? 48 8B 43 08 F7 80 A8 00 00 00 00 00 00 10"
        }
      ]
    },
    {
      "Name": "PyUnicodeEncodeError_GetEncoding",
      "Arguments": "PyObject *",
      "ReturnType": "PyObject *",
      "Signatures": []
    },
    {
      "Name": "PyUnicodeEncodeError_GetEnd",
      "Arguments": "PyObject *, Py_ssize_t *",
      "ReturnType": "int",
      "Signatures": [
        {
          "Signature": "48 89 5C 24 08 48 89 74 24 10 57 48 83 EC 20 48 8B 59 30 48 8B FA 48 8B F1 48 85 DB 75 ? 48 8D 15 ? ? ? ? EB ? 48 8B 43 08 F7 80 A8 00 00 00 00 00 00 10 75 ? 48 8D 15 ? ? ? ? 48 8B 0D ? ? ? ? 4C 8D 05 ? ? ? ? E8 ? ? ? ? B8 FF FF FF FF 48 8B 5C 24 30 48 8B 74 24 38 48 83 C4 20 5F C3 48 8B CB E8 ? ? ? ? 48 FF 03 48 8B 4E 40"
        }
      ]
    },
    {
      "Name": "PyUnicodeEncodeError_GetObject",
      "Arguments": "PyObject *",
      "ReturnType": "PyObject *",
      "Signatures": [
        {
          "Signature": "40 53 48 83 EC 20 48 8B 59 30 48 85 DB 75"
        }
      ]
    },
    {
      "Name": "PyUnicodeEncodeError_GetReason",
      "Arguments": "PyObject *",
      "ReturnType": "PyObject *",
      "Signatures": []
    },
    {
      "Name": "PyUnicodeEncodeError_GetStart",
      "Arguments": "PyObject *, Py_ssize_t *",
      "ReturnType": "int",
      "Signatures": [
        {
          "Signature": "48 89 5C 24 08 48 89 74 24 10 57 48 83 EC 20 48 8B 59 30 48 8B FA 48 8B F1 48 85 DB 75 ? 48 8D 15 ? ? ? ? EB ? 48 8B 43 08 F7 80 A8 00 00 00 00 00 00 10 75 ? 48 8D 15 ? ? ? ? 48 8B 0D ? ? ? ? 4C 8D 05 ? ? ? ? E8 ? ? ? ? B8 FF FF FF FF 48 8B 5C 24 30 48 8B 74 24 38 48 83 C4 20 5F C3 48 8B CB E8 ? ? ? ? 48 FF 03 48 8B 46 38 48 89 07 48 8B 4B 10"
        }
      ]
    },
    {
      "Name": "PyUnicodeEncodeError_SetEnd",
      "Arguments": "PyObject *, Py_ssize_t",
      "ReturnType": "int",
      "Signatures": [
        {
          "Signature": "48 89 51 40 33 C0"
        }
      ]
    },
    {
      "Name": "PyUnicodeEncodeError_SetReason",
      "Arguments": "PyObject *, const char *",
      "ReturnType": "int",
      "Signatures": []
    },
    {
      "Name": "PyUnicodeEncodeError_SetStart",
      "Arguments": "PyObject *, Py_ssize_t",
      "ReturnType": "int",
      "Signatures": []
    }
  ],
  "Structures": []
}