{
  "Functions": [
    {
      "Name": "PyCell_Get",
      "Arguments": "PyObject *",
      "ReturnType": "PyObject *",
      "Signatures": [
        {
          "Signature": "40 53 48 83 EC 20 48 8D 05 ? ? ? ? 48 8B D9 48 39 41 08 74 ? BA 18 00 00 00"
        }
      ]
    },
    {
      "Name": "PyCell_New",
      "Arguments": "PyObject *",
      "ReturnType": "PyObject *",
      "Signatures": [
        {
          "Signature": "48 89 5C 24 08 57 48 83 EC 20 48 8B D9 48 8D 0D ? ? ? ? E8 ? ? ? ? 48 8B F8 48 85 C0 75 ? 48 8B 5C 24 30 48 83 C4 20 5F C3 48 89 58 10"
        }
      ]
    },
    {
      "Name": "PyCell_Set",
      "Arguments": "PyObject *, PyObject *",
      "ReturnType": "int",
      "Signatures": [
        {
          "Signature": "48 83 EC 28 48 8B C1 48 8D 0D"
        }
      ]
    }
  ],
  "Structures": [
    {
      "Name": "PyCell_Type",
      "Type": "PyTypeObject",
      "Signatures": [
        {
          "Signature": "PyCell_New+0x10",
          "ValidationPrefix": "48 8D 0D"
        }
      ]
    }
  ]
}