{
  "Functions": [
    {
      "Name": "PyCallIter_New",
      "Arguments": "PyObject *, PyObject *",
      "ReturnType": "PyObject *",
      "Signatures": [
        {
          "Signature": "48 89 5C 24 08 48 89 74 24 10 57 48 83 EC 20 48 8B F1 48 8B DA 48 8D 0D"
        }
      ]
    }
  ],
  "Structures": [
    {
      "Name": "PyCallIter_Type",
      "Type": "PyTypeObject",
      "Signatures": []
    }
  ]
}