{
  "Functions": [
    {
      "Name": "PyByteArray_AsString",
      "Arguments": "PyObject *",
      "ReturnType": "char *",
      "Signatures": [
        {
          "Signature": "48 83 79 10 00 74 ? 48 8B 41 28 C3"
        }
      ]
    },
    {
      "Name": "PyByteArray_Concat",
      "Arguments": "PyObject *, PyObject *",
      "ReturnType": "PyObject *",
      "Signatures": [
        {
          "Signature": "4C 8B DC 53 48 81 EC 00 01 00 00 48 8B 05 ? ? ? ? 48 33 C4 48 89 84 24 E0 00 00 00"
        }
      ]
    },
    {
      "Name": "PyByteArray_Fini",
      "Arguments": "void",
      "ReturnType": "void",
      "Signatures": []
    },
    {
      "Name": "PyByteArray_FromObject",
      "Arguments": "PyObject *",
      "ReturnType": "PyObject *",
      "Signatures": []
    },
    {
      "Name": "PyByteArray_FromStringAndSize",
      "Arguments": "const char *, Py_ssize_t",
      "ReturnType": "PyObject *",
      "Signatures": [
        {
          "Signature": "48 89 6C 24 18 57 48 83 EC 20 48 8B FA 48 8B E9 48 85 D2 79"
        }
      ]
    },
    {
      "Name": "PyByteArray_Init",
      "Arguments": "void",
      "ReturnType": "int",
      "Signatures": []
    },
    {
      "Name": "PyByteArray_Resize",
      "Arguments": "PyObject *self, Py_ssize_t size",
      "ReturnType": "int",
      "Signatures": [
        {
          "Signature": "48 89 5C 24 10 57 48 83 EC 20 48 8B F9 48 8B DA 48 8B 49 20"
        }
      ]
    },
    {
      "Name": "PyByteArray_Size",
      "Arguments": "PyObject *",
      "ReturnType": "Py_ssize_t",
      "Signatures": []
    }
  ],
  "Structures": [
    {
      "Name": "PyByteArray_Type",
      "Type": "PyTypeObject",
      "Signatures": [
        {
          "Signature": "PyByteArray_FromStringAndSize+0x38",
          "ValidationPrefix": "48 8D 0D"
        }
      ]
    }
  ]
}