{
  "_Py_add_one_to_index_C": "0x141F39BD0",
  "_Py_add_one_to_index_F": "0x141F39C30",
  "_Py_BuildValue_SizeT": "0x141F2C610",
  "_Py_CheckRecursionLimit": "0x1435041F0",
  "_Py_CheckRecursiveCall": "0x141F32050",
  "_Py_NoneStruct": "0x1434F7A08",
  "_Py_NotImplementedStruct": "0x1434F7A18",
  "_Py_TrueStruct": "0x143504A00",
  "_Py_ZeroStruct": "0x1435049E8",
  "_PyArg_NoKeywords": "0x141F852D0",
  "_PyArg_Parse_SizeT": "0x141F85400",
  "_PyArg_ParseTuple_SizeT": "0x141F853C0",
  "_PyArg_ParseTupleAndKeywords_SizeT": "0x141F85340",
  "_PyBuiltin_Init": "0x141F97FC0",
  "_PyCode_CheckLineNumber": "0x141F66500",
  "_PyCodec_Lookup": "0x141F8C650",
  "_PyDict_Contains": "0x141F21250",
  "_PyDict_MaybeUntrack": "0x141F213D0",
  "_PyDict_NewPresized": "0x141F21500",
  "_PyDict_Next": "0x141F21570",
  "_PyErr_BadInternalCall": "0x141F2B440",
  "_PyEval_CallTracing": "0x141F31E80",
  "_PyEval_SliceIndex": "0x141F31F10",
  "_PyExc_Fini": "0x141F417C0",
  "_PyExc_Init": "0x141F41830",
  "_PyFloat_Init": "0x141F46A00",
  "_PyFloat_Pack4": "0x141F46AB0",
  "_PyFloat_Pack8": "0x141F46D00",
  "_PyFloat_Unpack4": "0x141F46F70",
  "_PyFloat_Unpack8": "0x141F470B0",
  "_PyFrame_Init": "0x141F3C3D0",
  "_PyImport_AcquireLock": "0x141F4C2E0",
  "_PyImport_FindExtension": "0x141F4C380",
  "_PyImport_Fini": "0x141F4C450",
  "_PyImport_FixupExtension": "0x141F4C4A0",
  "_PyImport_Init": "0x141F4C5B0",
  "_PyInstance_Lookup": "0x141F28D20",
  "_PyInt_AsInt": "0x141F51AD0",
  "_PyInt_Format": "0x141F51BD0",
  "_PyInt_FormatAdvanced": "0x141F8D870",
  "_PyInt_Init": "0x141F51D50",
  "_PyList_Extend": "0x141F1C9F0",
  "_PyLong_AsByteArray": "0x141F55E50",
  "_PyLong_AsInt": "0x141F56030",
  "_PyLong_Copy": "0x141F56070",
  "_PyLong_Format": "0x141F560E0",
  "_PyLong_FormatAdvanced": "0x141F8D880",
  "_PyLong_Frexp": "0x141F565E0",
  "_PyLong_FromByteArray": "0x141F568D0",
  "_PyLong_Init": "0x141F56B30",
  "_PyLong_New": "0x141F56B60",
  "_PyLong_NumBits": "0x141F56BD0",
  "_PyLong_Sign": "0x141F56C50",
  "_PyModule_Clear": "0x141F47D50",
  "_PyNode_SizeOf": "0x141FA8580",
  "_PyNumber_ConvertIntegralToInt": "0x141F39510",
  "_PyObject_CallFunction_SizeT": "0x141F39660",
  "_PyObject_CallMethod_SizeT": "0x141F396F0",
  "_PyObject_GC_Malloc": "0x141F69860",
  "_PyObject_GC_New": "0x141F69980",
  "_PyObject_GC_NewVar": "0x141F699B0",
  "_PyObject_GC_Resize": "0x141F69A00",
  "_PyObject_GenericGetAttrWithDict": "0x141EE69E0",
  "_PyObject_GenericSetAttrWithDict": "0x141EE6C50",
  "_PyObject_GetDictPtr": "0x141EE6EC0",
  "_PyObject_LengthHint": "0x141F397D0",
  "_PyObject_LookupSpecial": "0x141EF1210",
  "_PyObject_New": "0x141EE6F10",
  "_PyObject_NextNotImplemented": "0x141EE6F50",
  "_PyObject_RealIsInstance": "0x141F399B0",
  "_PyObject_RealIsSubclass": "0x141F399C0",
  "_PyObject_Str": "0x141EE6F80",
  "_PyOS_ascii_strtod": "0x141F8CEF0",
  "_PySequence_IterSearch": "0x141F399D0",
  "_PySet_NextEntry": "0x141F6E3F0",
  "_PySlice_FromIndices": "0x141F6B050",
  "_PyString_Eq": "0x141F132B0",
  "_PyString_FormatLong": "0x141F132E0",
  "_PyString_InsertThousandsGrouping": "0x141F13680",
  "_PyString_Join": "0x141F138F0",
  "_PyString_Resize": "0x141F13900",
  "_PySys_Init": "0x141F67DD0",
  "_PyThread_CurrentFrames": "0x141F2BD60",
  "_PyThreadState_Current": "0x143B9F360",
  "_PyThreadState_GetFrame": "0x143B9F368",
  "_PyThreadState_Init": "0x141F2BD00",
  "_PyThreadState_Prealloc": "0x141F2BD50",
  "_PyTime_FloatTime": "0x14201DED0",
  "_PyTuple_MaybeUntrack": "0x141F19360",
  "_PyTuple_Resize": "0x141F19440",
  "_PyType_Lookup": "0x141EF1220",
  "_PyUnicode_XStrip": "0x141F067C0",
  "_PyUnicodeUCS2_AsDefaultEncodedString": "0x141F05BB0",
  "_PyUnicodeUCS2_Init": "0x141F05FB0",
  "_PyWarnings_Init": "0x141F701F0",
  "_PyWeakref_CallableProxyType": "0x1434FA150",
  "_PyWeakref_ClearRef": "0x141EF7F50",
  "_PyWeakref_GetWeakrefCount": "0x141EF7F80",
  "_PyWeakref_ProxyType": "0x1434F9FC0",
  "_PyWeakref_RefType": "0x1434F9E20",
  "bloom_linebreak": "0x1434FD390",
  "BW_Py_DEC_REF": "0x141EE5520",
  "BW_Py_INC_REF": "0x141EE5530",
  "dummy": "0x143BA0DF0",
  "interp_head": "0x143B9F388",
  "interpreter_lock": "0x143B9F3A8",
  "Py_AtExit": "0x141F48CA0",
  "Py_BuildValue": "0x141F2C320",
  "Py_CompileStringFlags": "0x141F48CD0",
  "Py_FatalError": "0x141F48DA0",
  "Py_Finalize": "0x141F48F20",
  "Py_GetVersion": "0x141FB3280",
  "Py_InitializeEx": "0x141F491A0",
  "Py_InitModule4_64": "0x141F2C350",
  "Py_IsInitialized": "0x141F497C0",
  "Py_OptimizeFlag": "0x143BA06B0",
  "Py_SetRecursionLimit": "0x141F31E70",
  "PyArena_AddPyObject": "0x141F93EE0",
  "PyArena_Free": "0x141F93F30",
  "PyArena_Malloc": "0x141F93F90",
  "PyArena_New": "0x141F94050",
  "PyArg_Parse": "0x141F850A0",
  "PyArg_ParseTuple": "0x141F850E0",
  "PyArg_ParseTupleAndKeywords": "0x141F85110",
  "PyArg_UnpackTuple": "0x141F85190",
  "PyArg_VaParse": "0x141F85190",
  "PyAST_Check": "0x141F99D60",
  "PyAST_Compile": "0x141F5D0C0",
  "PyAST_FromNode": "0x141FAB630",
  "PyAST_mod2obj": "0x141F99D90",
  "PyAST_obj2mod": "0x141F99DB0",
  "PyBaseObject_Type": "0x1434F9870",
  "PyBool_FromLong": "0x141F3CB90",
  "PyBool_Type": "0x143504860",
  "PyBuffer_FillInfo": "0x141F344F0",
  "PyBuffer_FromMemory": "0x141F77AA0",
  "PyBuffer_GetPointer": "0x141F345F0",
  "PyBuffer_IsContiguous": "0x141F34660",
  "PyBuffer_Release": "0x141F346C0",
  "PyBuffer_ToContiguous": "0x141F34740",
  "PyBuffer_Type": "0x143517440",
  "PyByteArray_AsString": "0x141F7BDA0",
  "PyByteArray_Concat": "0x141F7BB50",
  "PyByteArray_FromStringAndSize": "0x141F7BDC0",
  "PyByteArray_Resize": "0x141F7BEB0",
  "PyByteArray_Type": "0x143519700",
  "PyCallable_Check": "0x141EE57A0",
  "PyCallIter_New": "0x141F84530",
  "PyCapsule_GetContext": "0x141F298B0",
  "PyCapsule_GetName": "0x141F298F0",
  "PyCapsule_GetPointer": "0x141F29930",
  "PyCapsule_Import": "0x141F299D0",
  "PyCapsule_IsValid": "0x141F29B90",
  "PyCapsule_New": "0x141F29BF0",
  "PyCapsule_SetContext": "0x141F29C80",
  "PyCapsule_SetDestructor": "0x141F29CD0",
  "PyCapsule_Type": "0x143503E40",
  "PyCell_Get": "0x141F84170",
  "PyCell_New": "0x141F841D0",
  "PyCell_Set": "0x14207A410",
  "PyCell_Type": "0x14351B600",
  "PyCFunction_Call": "0x141F228A0",
  "PyCFunction_ClearFreeList": "0x141F22E10",
  "PyCFunction_Fini": "0x141F22E60",
  "PyCFunction_GetFunction": "0x141F22EA0",
  "PyCFunction_NewEx": "0x141F22EE0",
  "PyCFunction_Type": "0x143503270",
  "PyClass_IsSubclass": "0x141F285A0",
  "PyClass_New": "0x141F28670",
  "PyClass_Type": "0x1435034F0",
  "PyClassMethod_Type": "0x14350E7F0",
  "PyCode_Addr2Line": "0x141F65F40",
  "PyCode_New": "0x141F65FB0",
  "PyCode_NewEmpty": "0x141F66290",
  "PyCode_Optimize": "0x141FB1F20",
  "PyCode_Type": "0x14350FFA0",
  "PyCodec_BackslashReplaceErrors": "0x141F8B420",
  "PyCodec_Decode": "0x141F8B660",
  "PyCodec_Encode": "0x141F8B6F0",
  "PyCodec_LookupError": "0x141F8B780",
  "PyCodec_Register": "0x141F8B830",
  "PyCodec_RegisterError": "0x141F8B8C0",
  "PyCodec_ReplaceErrors": "0x141F8B950",
  "PyCodec_StreamReader": "0x141F8BB40",
  "PyCodec_StrictErrors": "0x141F8BBD0",
  "PyCodec_XMLCharRefReplaceErrors": "0x141F8BC20",
  "PyDescr_NewClassMethod": "0x141F3E610",
  "PyDescr_NewGetSet": "0x141F3E6A0",
  "PyDescr_NewMember": "0x141F3E730",
  "PyDescr_NewMethod": "0x141F3E7C0",
  "PyDescr_NewWrapper": "0x141F3E850",
  "PyDict_Clear": "0x141F20300",
  "PyDict_Contains": "0x141F1DE30",
  "PyDict_Copy": "0x141F20430",
  "PyDict_DelItem": "0x141F204D0",
  "PyDict_DelItemString": "0x141F20580",
  "PyDict_Fini": "0x141F205E0",
  "PyDict_GetItem": "0x141F20630",
  "PyDict_GetItemString": "0x141F20700",
  "PyDict_Items": "0x141F20760",
  "PyDict_Keys": "0x141F208E0",
  "PyDict_Merge": "0x141F209F0",
  "PyDict_MergeFromSeq2": "0x141F20CF0",
  "PyDict_New": "0x141F20F80",
  "PyDict_Next": "0x141F21040",
  "PyDict_SetItem": "0x141F210E0",
  "PyDict_SetItemString": "0x141F21180",
  "PyDict_Size": "0x141F21200",
  "PyDict_Type": "0x143501A10",
  "PyDict_Update": "0x141F21240",
  "PyDictProxy_New": "0x141F3E900",
  "PyErr_BadArgument": "0x141F29D20",
  "PyErr_CheckSignals": "0x141F71990",
  "PyErr_Clear": "0x141F29DB0",
  "PyErr_Display": "0x141F47ED0",
  "PyErr_ExceptionMatches": "0x141F29DC0",
  "PyErr_Fetch": "0x141F29DE0",
  "PyErr_Format": "0x141F29E10",
  "PyErr_GivenExceptionMatches": "0x141F29EB0",
  "PyErr_NewException": "0x141F2A040",
  "PyErr_NoMemory": "0x141F2A310",
  "PyErr_NormalizeException": "0x141F2A3A0",
  "PyErr_Occurred": "0x141F2A680",
  "PyErr_Print": "0x141F483F0",
  "PyErr_PrintEx": "0x141F48400",
  "PyErr_ProgramText": "0x141F2A690",
  "PyErr_Restore": "0x141F2A770",
  "PyErr_SetExcFromWindowsErr": "0x141F2A860",
  "PyErr_SetFromErrno": "0x141F2A9C0",
  "PyErr_SetFromErrnoWithFilenameObject": "0x141F2A870",
  "PyErr_SetFromWindowsErr": "0x141F2AC40",
  "PyErr_SetNone": "0x141F2AD70",
  "PyErr_SetObject": "0x141F2ADA0",
  "PyErr_SetString": "0x141F2ADF0",
  "PyErr_SyntaxLocation": "0x141F2AE80",
  "PyErr_WarnEx": "0x141F70020",
  "PyErr_WriteUnraisable": "0x141F2B1B0",
  "PyEval_AcquireThread": "0x141F2D260",
  "PyEval_CallMethod": "0x141F2C080",
  "PyEval_CallObjectWithKeywords": "0x141F2D2B0",
  "PyEval_EvalCode": "0x141F2D3C0",
  "PyEval_EvalCodeEx": "0x141F2D3F0",
  "PyEval_EvalFrameEx": "0x141F2DC70",
  "PyEval_GetBuiltins": "0x141F31870",
  "PyEval_GetFrame": "0x141F318E0",
  "PyEval_GetFuncDesc": "0x141F318F0",
  "PyEval_GetFuncName": "0x141F31950",
  "PyEval_GetGlobals": "0x141F319D0",
  "PyEval_GetLocals": "0x141F31A00",
  "PyEval_GetRestricted": "0x141F31A40",
  "PyEval_InitThreads": "0x141F31A90",
  "PyEval_MergeCompilerFlags": "0x141F31AD0",
  "PyEval_ReleaseLock": "0x141F31B20",
  "PyEval_RestoreThread": "0x141F31B30",
  "PyEval_SaveThread": "0x141F31B90",
  "PyEval_SetProfile": "0x141F31BD0",
  "PyEval_SetTrace": "0x141F31C80",
  "PyExc_AttributeError": "0x143506030",
  "PyExc_BaseException": "0x143505FF0",
  "PyExc_BufferError": "0x143506120",
  "PyExc_Exception": "0x143505FF8",
  "PyExc_FutureWarning": "0x143506158",
  "PyExc_GeneratorExit": "0x143506008",
  "PyExc_ImportError": "0x143506060",
  "PyExc_IndexError": "0x143506068",
  "PyExc_IOError": "0x143506050",
  "PyExc_KeyError": "0x143506070",
  "PyExc_MemoryError": "0x143506080",
  "PyExc_NameError": "0x143506088",
  "PyExc_NotImplementedError": "0x1435060A0",
  "PyExc_OSError": "0x143506058",
  "PyExc_OverflowError": "0x143506090",
  "PyExc_RuntimeError": "0x143506098",
  "PyExc_RuntimeWarning": "0x143506150",
  "PyExc_StandardError": "0x143506010",
  "PyExc_StopIteration": "0x143506000",
  "PyExc_SystemError": "0x1435060C8",
  "PyExc_TypeError": "0x1435060D8",
  "PyExc_UnicodeError": "0x1435060E8",
  "PyExc_ValueError": "0x143506108",
  "PyExc_WindowsError": "0x143506118",
  "PyExc_ZeroDivisionError": "0x143506110",
  "PyFile_AsFile": "0x141F814F0",
  "PyFile_DecUseCount": "0x141F81530",
  "PyFile_FromFile": "0x141F81540",
  "PyFile_GetLine": "0x141F81640",
  "PyFile_IncUseCount": "0x141F819D0",
  "PyFile_Name": "0x141F819E0",
  "PyFile_SetBufSize": "0x141F81A20",
  "PyFile_SetEncodingAndErrors": "0x141F81AC0",
  "PyFile_SoftSpace": "0x141F81B90",
  "PyFile_Type": "0x143519FB0",
  "PyFile_WriteObject": "0x141F81CA0",
  "PyFile_WriteString": "0x141F81F10",
  "PyFloat_AsDouble": "0x141F45930",
  "PyFloat_ClearFreeList": "0x141F45A50",
  "PyFloat_Fini": "0x141F464A0",
  "PyFloat_FromDouble": "0x141F46600",
  "PyFloat_FromString": "0x141F466C0",
  "PyFloat_GetInfo": "0x141F46900",
  "PyFloat_Type": "0x14350C070",
  "PyFrame_BlockPop": "0x141F3BAF0",
  "PyFrame_BlockSetup": "0x141F3BB40",
  "PyFrame_ClearFreeList": "0x141F3BBC0",
  "PyFrame_FastToLocals": "0x141F3BC10",
  "PyFrame_Fini": "0x141F3BE30",
  "PyFrame_GetLineNumber": "0x141F3BEA0",
  "PyFrame_LocalsToFast": "0x141F3BEC0",
  "PyFrame_New": "0x141F3C0F0",
  "PyFrame_Type": "0x143504200",
  "PyFrozenSet_New": "0x141F6E210",
  "PyFrozenSet_Type": "0x143514350",
  "PyFunction_New": "0x141F59EE0",
  "PyFunction_SetClosure": "0x141F5A070",
  "PyFunction_SetDefaults": "0x141F5A140",
  "PyFunction_Type": "0x14350E660",
  "PyGC_Collect": "0x141F69710",
  "PyGILState_Ensure": "0x141F2B510",
  "PyGILState_GetThisThreadState": "0x141F2B5A0",
  "PyGILState_Release": "0x141F2B5C0",
  "PyImport_AddModule": "0x141F4AD60",
  "PyImport_Cleanup": "0x141F4AF80",
  "PyImport_ExecCodeModuleEx": "0x141F4B510",
  "PyImport_GetMagicNumber": "0x141F4B6E0",
  "PyImport_GetModuleDict": "0x141F4B6F0",
  "PyImport_Import": "0x141F4B720",
  "PyImport_ImportFrozenModule": "0x141F4B990",
  "PyImport_ImportModule": "0x141F4BB90",
  "PyImport_ImportModuleLevel": "0x141F4BBE0",
  "PyImport_ImportModuleNoBlock": "0x141F4BCB0",
  "PyImport_ReloadModule": "0x141F4BD60",
  "PyInstance_New": "0x141F232A0",
  "PyInstance_NewRaw": "0x141F28A20",
  "PyInstance_Type": "0x143503690",
  "PyInt_AsLong": "0x141F50C80",
  "PyInt_AsSsize_t": "0x141F50DA0",
  "PyInt_AsUnsignedLongLongMask": "0x141F50F10",
  "PyInt_AsUnsignedLongMask": "0x141F51060",
  "PyInt_ClearFreeList": "0x141F511A0",
  "PyInt_Fini": "0x141F51610",
  "PyInt_FromLong": "0x141F51770",
  "PyInt_FromSize_t": "0x141F517F0",
  "PyInt_FromSsize_t": "0x141F51810",
  "PyInt_FromString": "0x141F51830",
  "PyInt_FromUnicode": "0x141F51A30",
  "PyInt_GetMax": "0x141F51AC0",
  "PyInt_Type": "0x14350D880",
  "PyInterpreterState_Clear": "0x141F2B690",
  "PyInterpreterState_Delete": "0x141F2B800",
  "PyInterpreterState_New": "0x141F2B8E0",
  "PyIter_Next": "0x141F34890",
  "PyList_Append": "0x141F1C3E0",
  "PyList_AsTuple": "0x141F1C420",
  "PyList_Fini": "0x141F1C4E0",
  "PyList_GetItem": "0x141F1C530",
  "PyList_GetSlice": "0x141F1C5B0",
  "PyList_Insert": "0x141F1C5F0",
  "PyList_New": "0x141F1C630",
  "PyList_Reverse": "0x141F1C790",
  "PyList_SetItem": "0x141F1C810",
  "PyList_SetSlice": "0x141F1C8F0",
  "PyList_Size": "0x141F1C930",
  "PyList_Sort": "0x141F1C970",
  "PyList_Type": "0x1435016D0",
  "PyLong_AsDouble": "0x141F54A40",
  "PyLong_AsLong": "0x141F54AF0",
  "PyLong_AsLongAndOverflow": "0x141F54B30",
  "PyLong_AsLongLong": "0x141F54D00",
  "PyLong_AsSsize_t": "0x141F54E70",
  "PyLong_AsUnsignedLong": "0x141F54F60",
  "PyLong_AsUnsignedLongLong": "0x141F55030",
  "PyLong_AsUnsignedLongLongMask": "0x141F550A0",
  "PyLong_AsUnsignedLongMask": "0x141F55130",
  "PyLong_AsVoidPtr": "0x141F551C0",
  "PyLong_FromDouble": "0x141F55260",
  "PyLong_FromLong": "0x141F55420",
  "PyLong_FromLongLong": "0x141F554A0",
  "PyLong_FromSize_t": "0x141F55540",
  "PyLong_FromSsize_t": "0x141F55570",
  "PyLong_FromString": "0x141F555A0",
  "PyLong_FromUnicode": "0x141F55BF0",
  "PyLong_FromUnsignedLong": "0x141F55C70",
  "PyLong_FromUnsignedLongLong": "0x141F55CE0",
  "PyLong_FromVoidPtr": "0x141F55D60",
  "PyLong_GetInfo": "0x141F55DE0",
  "PyLong_Type": "0x14350E0B0",
  "PyMapping_Check": "0x141F348D0",
  "PyMapping_GetItemString": "0x141F34920",
  "PyMapping_SetItemString": "0x141F349B0",
  "PyMapping_Size": "0x141F34BC0",
  "PyMem_Free": "0x141EE5880",
  "PyMem_Malloc": "0x141EE5890",
  "PyMem_Realloc": "0x141EE58A0",
  "PyMember_GetOne": "0x141F8ECC0",
  "PyMember_SetOne": "0x141F8EF50",
  "PyMethod_ClearFreeList": "0x141F28B80",
  "PyMethod_Fini": "0x141F28BD0",
  "PyMethod_New": "0x141F28C10",
  "PyMethod_Type": "0x143503820",
  "PyModule_AddIntConstant": "0x141F2C130",
  "PyModule_AddObject": "0x141F2C1B0",
  "PyModule_AddStringConstant": "0x141F2C2A0",
  "PyModule_GetDict": "0x141F47B60",
  "PyModule_GetName": "0x141F47BC0",
  "PyModule_New": "0x141F47C50",
  "PyModule_Type": "0x14350C220",
  "PyNode_AddChild": "0x141FA83E0",
  "PyNode_Free": "0x141FA8520",
  "PyNode_New": "0x141FA8540",
  "PyNumber_Absolute": "0x141F34C40",
  "PyNumber_Add": "0x141F34CB0",
  "PyNumber_And": "0x141F34D70",
  "PyNumber_AsOff_t": "0x141FF9330",
  "PyNumber_AsSsize_t": "0x141F34E10",
  "PyNumber_Check": "0x141F34EF0",
  "PyNumber_Coerce": "0x141EE58B0",
  "PyNumber_CoerceEx": "0x141EE58E0",
  "PyNumber_Divide": "0x141F34F20",
  "PyNumber_Divmod": "0x141F34FC0",
  "PyNumber_Float": "0x141F35060",
  "PyNumber_FloorDivide": "0x141F35150",
  "PyNumber_Index": "0x141F35AE0",
  "PyNumber_InPlaceAdd": "0x141F351F0",
  "PyNumber_InPlaceAnd": "0x141F352C0",
  "PyNumber_InPlaceDivide": "0x141F35370",
  "PyNumber_InPlaceFloorDivide": "0x141F35420",
  "PyNumber_InPlaceLshift": "0x141F354C0",
  "PyNumber_InPlaceMultiply": "0x141F35570",
  "PyNumber_InPlaceOr": "0x141F35680",
  "PyNumber_InPlacePower": "0x141F35730",
  "PyNumber_InPlaceRemainder": "0x141F35780",
  "PyNumber_InPlaceRshift": "0x141F35830",
  "PyNumber_InPlaceSubtract": "0x141F358E0",
  "PyNumber_InPlaceTrueDivide": "0x141F35990",
  "PyNumber_InPlaceXor": "0x141F35A30",
  "PyNumber_Int": "0x141F35BF0",
  "PyNumber_Invert": "0x141F35E90",
  "PyNumber_Long": "0x141F35F00",
  "PyNumber_Lshift": "0x141F361E0",
  "PyNumber_Multiply": "0x141F36280",
  "PyNumber_Negative": "0x141F36370",
  "PyNumber_Or": "0x141F363E0",
  "PyNumber_Positive": "0x141F36480",
  "PyNumber_Power": "0x141F364F0",
  "PyNumber_Remainder": "0x141F36510",
  "PyNumber_Rshift": "0x141F365B0",
  "PyNumber_Subtract": "0x141F36650",
  "PyNumber_ToBase": "0x141F366F0",
  "PyNumber_TrueDivide": "0x141F367B0",
  "PyNumber_Xor": "0x141F36850",
  "PyObject_AsCharBuffer": "0x141F368F0",
  "PyObject_AsFileDescriptor": "0x141F82050",
  "PyObject_AsReadBuffer": "0x141F369C0",
  "PyObject_AsWriteBuffer": "0x141F36A90",
  "PyObject_Call": "0x141F36B60",
  "PyObject_CallFunction": "0x141F36C20",
  "PyObject_CallFunctionObjArgs": "0x141F36CB0",
  "PyObject_CallMethod": "0x141F36D50",
  "PyObject_CallMethodObjArgs": "0x141F36E30",
  "PyObject_CallObject": "0x141F36F20",
  "PyObject_CheckReadBuffer": "0x141F36F30",
  "PyObject_ClearWeakRefs": "0x141EF7840",
  "PyObject_Cmp": "0x141F36F70",
  "PyObject_Compare": "0x141EE5990",
  "PyObject_CopyData": "0x141F36FE0",
  "PyObject_DelItem": "0x141F37550",
  "PyObject_DelItemString": "0x141F37700",
  "PyObject_Dir": "0x141EE5A30",
  "PyObject_Format": "0x141F378C0",
  "PyObject_Free": "0x141F4F230",
  "PyObject_GC_Del": "0x141F69780",
  "PyObject_GC_Track": "0x141F697D0",
  "PyObject_GC_UnTrack": "0x141F69830",
  "PyObject_GenericGetAttr": "0x141EE5AF0",
  "PyObject_GenericSetAttr": "0x141EE5B00",
  "PyObject_GetAttr": "0x141EE5B10",
  "PyObject_GetAttrString": "0x141EE5BE0",
  "PyObject_GetBuffer": "0x141F37B60",
  "PyObject_GetItem": "0x141F37BC0",
  "PyObject_GetIter": "0x141F37D60",
  "PyObject_HasAttr": "0x141EE5C60",
  "PyObject_HasAttrString": "0x141EE5CB0",
  "PyObject_Hash": "0x141EE5D00",
  "PyObject_HashNotImplemented": "0x141EE5DB0",
  "PyObject_Init": "0x141EE5DE0",
  "PyObject_InitVar": "0x141EE5E00",
  "PyObject_IsInstance": "0x141F37E60",
  "PyObject_IsSubclass": "0x141F38030",
  "PyObject_IsTrue": "0x141EE5E20",
  "PyObject_Malloc": "0x141F4F450",
  "PyObject_Not": "0x141EE5ED0",
  "PyObject_Print": "0x141EE5EF0",
  "PyObject_Realloc": "0x141F4F790",
  "PyObject_Repr": "0x141EE5F00",
  "PyObject_RichCompare": "0x141EE6050",
  "PyObject_RichCompareBool": "0x141EE6210",
  "PyObject_SetAttr": "0x141EE62D0",
  "PyObject_SetAttrString": "0x141EE6480",
  "PyObject_SetItem": "0x141F381E0",
  "PyObject_Size": "0x141F383A0",
  "PyObject_Str": "0x141EE6510",
  "PyObject_Type": "0x141F38430",
  "PyObject_Unicode": "0x141EE6680",
  "PyOS_double_to_string": "0x141F8CC90",
  "PyOS_getsig": "0x141F486F0",
  "PyOS_InterruptOccurred": "0x141F71C30",
  "PyOS_Readline": "0x141FBC750",
  "PyOS_setsig": "0x141F48780",
  "PyOS_snprintf": "0x141F84F80",
  "PyOS_string_to_double": "0x141F8CDE0",
  "PyOS_strtol": "0x141FB1C00",
  "PyOS_strtoul": "0x141FB1CB0",
  "PyOS_vsnprintf": "0x141F85010",
  "PyParser_ASTFromFile": "0x141F48790",
  "PyProperty_Type": "0x143505090",
  "PyRun_SimpleStringFlags": "0x141F48B30",
  "PyRun_StringFlags": "0x141F48BD0",
  "PySequence_Check": "0x141F38480",
  "PySequence_Concat": "0x141F384D0",
  "PySequence_Contains": "0x141F38640",
  "PySequence_Count": "0x141F38670",
  "PySequence_DelItem": "0x141F38680",
  "PySequence_DelSlice": "0x141F38740",
  "PySequence_Fast": "0x141F38810",
  "PySequence_GetItem": "0x141F38960",
  "PySequence_GetSlice": "0x141F38A20",
  "PySequence_Index": "0x141F38E50",
  "PySequence_InPlaceConcat": "0x141F38B50",
  "PySequence_InPlaceRepeat": "0x141F38CD0",
  "PySequence_List": "0x141F38E60",
  "PySequence_Repeat": "0x141F38F10",
  "PySequence_SetSlice": "0x141F39060",
  "PySequence_Size": "0x141F39190",
  "PySequence_Tuple": "0x141F39210",
  "PySet_Add": "0x141F6E220",
  "PySet_Fini": "0x141F6E330",
  "PySet_New": "0x141F6E3E0",
  "PySet_Type": "0x143514190",
  "PySlice_GetIndicesEx": "0x14206BAF0",
  "PySlice_New": "0x141F6AEB0",
  "PySlice_Type": "0x143513BC0",
  "PyString_AsString": "0x141F10740",
  "PyString_AsStringAndSize": "0x141F107A0",
  "PyString_Concat": "0x141F10890",
  "PyString_ConcatAndDel": "0x141F10900",
  "PyString_DecodeEscape": "0x141F109B0",
  "PyString_Fini": "0x141F10FE0",
  "PyString_Format": "0x141F11070",
  "PyString_FromFormat": "0x141F12300",
  "PyString_FromFormatV": "0x141F12330",
  "PyString_FromString": "0x141F12B20",
  "PyString_FromStringAndSize": "0x141F12C90",
  "PyString_InternFromString": "0x141F12E30",
  "PyString_InternInPlace": "0x141F12E60",
  "PyString_Repr": "0x141F12F70",
  "PyString_Size": "0x141F13160",
  "PyString_Type": "0x143500360",
  "PySys_GetFile": "0x141F677F0",
  "PySys_GetObject": "0x141F67860",
  "PySys_HasWarnOptions": "0x141F67890",
  "PySys_SetArgv": "0x141F678C0",
  "PySys_SetArgvEx": "0x141F678D0",
  "PySys_SetObject": "0x141F67BA0",
  "PySys_SetPath": "0x141F67C10",
  "PySys_WriteStderr": "0x141F67D80",
  "PyThread_acquire_lock": "0x141F3C520",
  "PyThread_allocate_lock": "0x141F3C5A0",
  "PyThread_create_key": "0x141F3C620",
  "PyThread_delete_key": "0x141F3C630",
  "PyThread_delete_key_value": "0x141F3C640",
  "PyThread_exit_thread": "0x141F3C650",
  "PyThread_free_lock": "0x141F3C670",
  "PyThread_get_key_value": "0x141F3C6A0",
  "PyThread_get_stacksize": "0x141F3C6E0",
  "PyThread_get_thread_ident": "0x141F3C6F0",
  "PyThread_init_thread": "0x141F3C710",
  "PyThread_release_lock": "0x141F3C730",
  "PyThread_set_key_value": "0x141F3C760",
  "PyThread_set_stacksize": "0x141F3C7B0",
  "PyThread_start_new_thread": "0x141F3C7E0",
  "PyThreadState_Clear": "0x141F2B980",
  "PyThreadState_DeleteCurrent": "0x141F2BB80",
  "PyThreadState_Get": "0x141F2BBE0",
  "PyThreadState_GetDict": "0x141F2BC10",
  "PyThreadState_New": "0x141F2BC60",
  "PyThreadState_Swap": "0x141F2BC70",
  "PyTraceBack_Here": "0x141F83A60",
  "PyTraceBack_Print": "0x141F83B50",
  "PyTraceBack_Type": "0x14351B3A0",
  "PyTuple_ClearFreeList": "0x141F18E50",
  "PyTuple_Fini": "0x141F18EE0",
  "PyTuple_GetItem": "0x141F18F90",
  "PyTuple_GetSlice": "0x141F18FF0",
  "PyTuple_New": "0x141F19030",
  "PyTuple_Pack": "0x141F191B0",
  "PyTuple_SetItem": "0x141F19240",
  "PyTuple_Size": "0x141F19320",
  "PyTuple_Type": "0x143500960",
  "PyType_ClearCache": "0x141EF09C0",
  "PyType_GenericAlloc": "0x141EEEC00",
  "PyType_GenericNew": "0x141EEED10",
  "PyType_IsSubtype": "0x141EF0AC0",
  "PyType_Modified": "0x141EF0B40",
  "PyType_Ready": "0x141EF0BE0",
  "PyType_Type": "0x1434F96E0",
  "PyUnicode_Type": "0x1434FD0D0",
  "PyUnicodeDecodeError_Create": "0x141F411A0",
  "PyUnicodeDecodeError_GetEnd": "0x141F411E0",
  "PyUnicodeDecodeError_SetStart": "0x141F41320",
  "PyUnicodeEncodeError_Create": "0x141F41330",
  "PyUnicodeEncodeError_GetEnd": "0x141F41370",
  "PyUnicodeEncodeError_GetObject": "0x141F41440",
  "PyUnicodeEncodeError_GetStart": "0x141F414C0",
  "PyUnicodeEncodeError_SetEnd": "0x141F412B0",
  "PyUnicodeUCS2_AsEncodedString": "0x141EFC490",
  "PyUnicodeUCS2_AsUTF8String": "0x141EFC770",
  "PyUnicodeUCS2_AsWideChar": "0x141EFC820",
  "PyUnicodeUCS2_DecodeUTF16Stateful": "0x141EFE0E0",
  "PyUnicodeUCS2_DecodeUTF32Stateful": "0x141EFE6F0",
  "PyUnicodeUCS2_DecodeUTF8": "0x141EFECE0",
  "PyUnicodeUCS2_DecodeUTF8Stateful": "0x141EFECF0",
  "PyUnicodeUCS2_Encode": "0x141EFFC80",
  "PyUnicodeUCS2_EncodeASCII": "0x141EFFFB0",
  "PyUnicodeUCS2_EncodeCharmap": "0x141EFFFC0",
  "PyUnicodeUCS2_EncodeLatin1": "0x141F00940",
  "PyUnicodeUCS2_EncodeUnicodeEscape": "0x141F00FD0",
  "PyUnicodeUCS2_EncodeUTF8": "0x141F00E10",
  "PyUnicodeUCS2_Find": "0x141F00FE0",
  "PyUnicodeUCS2_Format": "0x141F01110",
  "PyUnicodeUCS2_FromEncodedObject": "0x141F022B0",
  "PyUnicodeUCS2_FromObject": "0x141F03140",
  "PyUnicodeUCS2_FromOrdinal": "0x141F031B0",
  "PyUnicodeUCS2_FromString": "0x141F03290",
  "PyUnicodeUCS2_FromStringAndSize": "0x141F032E0",
  "PyUnicodeUCS2_FromUnicode": "0x141F03400",
  "PyUnicodeUCS2_FromWideChar": "0x141F03560",
  "PyUnicodeUCS2_Join": "0x141F03630",
  "PyUnicodeUCS2_Resize": "0x141F03EE0",
  "PyWeakref_GetObject": "0x141EF7AA0",
  "PyWeakref_NewProxy": "0x141EF7B20",
  "PyWeakref_NewRef": "0x141EF7D60",
  "warnoptions": "0x143BA09E0"
}