{
  "Functions": [],
  "Structures": [
    {
      "Name": "bloom_linebreak",
      "Type": "unsigned long",
      "Signatures": [
        {
          "Signature": "_PyUnicodeUCS2_Init+0x6C",
          "ValidationPrefix": "89 05"
        }
      ]
    },
    {
      "Name": "dummy",
      "Type": "PyObject *",
      "Signatures": [
        {
          "Signature": "PySet_Fini+0x41",
          "ValidationPrefix": "48 8B 1D"
        }
      ]
    },
    {
      "Name": "interp_head",
      "Type": "PyInterpreterState *",
      "Signatures": [
        {
          "Signature": "PyInterpreterState_New+0x79",
          "ValidationPrefix": "48 8B 05"
        }
      ]
    },
    {
      "Name": "interpreter_lock",
      "Type": "PyThread_type_lock",
      "Signatures": [
        {
          "Signature": "PyEval_InitThreads+0x1B",
          "ValidationPrefix": "48 89 05"
        }
      ]
    },
    {
      "Name": "unicode_empty",
      "Type": "PyUnicodeObject *",
      "Signatures": []
    },
    {
      "Name": "warnoptions",
      "Type": "PyObject *",
      "Signatures": [
        {
          "Signature": "PySys_HasWarnOptions+0x7",
          "ValidationPrefix": "48 8B 0D"
        }
      ]
    }
  ]
}