{
  "Functions": [
    {
      "Name": "PyArena_AddPyObject",
      "Arguments": "PyArena *, PyObject *",
      "ReturnType": "int",
      "Signatures": [
        {
          "Signature": "48 89 5C 24 08 57 48 83 EC 20 48 8B 49 10 48 8B DA"
        }
      ]
    },
    {
      "Name": "PyArena_Free",
      "Arguments": "PyArena *",
      "ReturnType": "void",
      "Signatures": [
        {
          "Signature": "40 57 48 83 EC 20 48 8B F9 48 8B 09 48 85 C9"
        }
      ]
    },
    {
      "Name": "PyArena_Malloc",
      "Arguments": "PyArena *, size_t",
      "ReturnType": "void *",
      "Signatures": [
        {
          "Signature": "48 89 5C 24 08 48 89 6C 24 10 48 89 74 24 18 57 48 83 EC 20 48 8B 59 08 48 8D 7A 07"
        }
      ]
    },
    {
      "Name": "PyArena_New",
      "Arguments": "void",
      "ReturnType": "PyArena *",
      "Signatures": [
        {
          "Signature": "40 57 48 83 EC 20 B9 18 00 00 00"
        }
      ]
    }
  ],
  "Structures": []
}