{
  "Functions": [
    {
      "Name": "_PyFrame_Init",
      "Arguments": "void",
      "ReturnType": "int",
      "Signatures": [
        {
          "Signature": "48 83 EC 28 48 8D 0D ? ? ? ? E8 ? ? ? ? 33 C9"
        }
      ]
    },
    {
      "Name": "PyFrame_BlockPop",
      "Arguments": "PyFrameObject *",
      "ReturnType": "PyTryBlock *",
      "Signatures": [
        {
          "Signature": "40 53 48 83 EC 20 8B 81 80 00 00 00"
        }
      ]
    },
    {
      "Name": "PyFrame_BlockSetup",
      "Arguments": "PyFrameObject *, int, int, int",
      "ReturnType": "void",
      "Signatures": [
        {
          "Signature": "48 89 5C 24 08 48 89 6C 24 10 48 89 74 24 18 57 48 83 EC 20 44 8B 91 80 00 00 00"
        }
      ]
    },
    {
      "Name": "PyFrame_ClearFreeList",
      "Arguments": "void",
      "ReturnType": "int",
      "Signatures": [
        {
          "Signature": "40 53 48 83 EC 20 48 8B 0D ? ? ? ? 8B 1D ? ? ? ? 48 85 C9 74 ? 0F 1F 84 00 00 00 00 00 48 8B 51 18 48 89 15 ? ? ? ? E8 ? ? ? ? 48 8B 0D ? ? ? ? FF 0D ? ? ? ? 48 85 C9 75 ? 8B C3 48 83 C4 20 5B C3 CC CC CC CC CC CC 48 85 C9"
        }
      ]
    },
    {
      "Name": "PyFrame_FastToLocals",
      "Arguments": "PyFrameObject *",
      "ReturnType": "void",
      "Signatures": [
        {
          "Signature": "48 85 C9 0F 84 ? ? ? ? 53 48 83 EC 50 48 89 74 24 48"
        }
      ]
    },
    {
      "Name": "PyFrame_Fini",
      "Arguments": "void",
      "ReturnType": "void",
      "Signatures": [
        {
          "Signature": "48 83 EC 28 48 8B 0D ? ? ? ? 48 85 C9 74 ? 48 8B 41 18"
        }
      ]
    },
    {
      "Name": "PyFrame_GetLineNumber",
      "Arguments": "PyFrameObject *",
      "ReturnType": "int",
      "Signatures": [
        {
          "Signature": "48 83 79 50 00 74 ? 8B 41 7C C3"
        }
      ]
    },
    {
      "Name": "PyFrame_LocalsToFast",
      "Arguments": "PyFrameObject *, int",
      "ReturnType": "void",
      "Signatures": [
        {
          "Signature": "48 85 C9 0F 84 ? ? ? ? 4C 8B DC 53"
        }
      ]
    },
    {
      "Name": "PyFrame_New",
      "Arguments": "PyThreadState *, PyCodeObject *, PyObject *, PyObject *",
      "ReturnType": "PyFrameObject *",
      "Signatures": [
        {
          "Signature": "48 89 5C 24 08 48 89 6C 24 10 48 89 74 24 18 4C 89 4C 24 20 57 41 54 41 55 41 56 41 57 48 83 EC 20 4C 8B 79 10"
        }
      ]
    }
  ],
  "Structures": [
    {
      "Name": "PyFrame_Type",
      "Type": "PyTypeObject",
      "Signatures": [
        {
          "Signature": "PyFrame_New+0x124",
          "ValidationPrefix": "48 8D 0D"
        }
      ]
    }
  ]
}