{
  "Functions": [
    {
      "Name": "PyBuffer_FillContiguousStrides",
      "Arguments": "int, Py_ssize_t *, Py_ssize_t *, int, char",
      "ReturnType": "void",
      "Signatures": []
    },
    {
      "Name": "PyBuffer_FillInfo",
      "Arguments": "Py_buffer *, PyObject *, void *, Py_ssize_t, int, int",
      "ReturnType": "int",
      "Signatures": [
        {
          "Signature": "48 89 5C 24 18 57 41 56 41 57 48 83 EC 20 4D 8B F1"
        }
      ]
    },
    {
      "Name": "PyBuffer_FromContiguous",
      "Arguments": "Py_buffer *, void *, Py_ssize_t, char",
      "ReturnType": "int",
      "Signatures": []
    },
    {
      "Name": "PyBuffer_FromMemory",
      "Arguments": "void *, Py_ssize_t",
      "ReturnType": "PyObject *",
      "Signatures": [
        {
          "Signature": "48 89 5C 24 08 57 48 83 EC 20 48 8B DA 48 8B F9 48 83 FA FE"
        }
      ]
    },
    {
      "Name": "PyBuffer_FromObject",
      "Arguments": "PyObject *, Py_ssize_t, Py_ssize_t",
      "ReturnType": "PyObject *",
      "Signatures": []
    },
    {
      "Name": "PyBuffer_FromReadWriteMemory",
      "Arguments": "void *, Py_ssize_t",
      "ReturnType": "PyObject *",
      "Signatures": []
    },
    {
      "Name": "PyBuffer_FromReadWriteObject",
      "Arguments": "PyObject *, Py_ssize_t, Py_ssize_t",
      "ReturnType": "PyObject *",
      "Signatures": []
    },
    {
      "Name": "PyBuffer_GetPointer",
      "Arguments": "Py_buffer *, Py_ssize_t *",
      "ReturnType": "void *",
      "Signatures": [
        {
          "Signature": "48 83 EC 08 4C 63 49 24"
        }
      ]
    },
    {
      "Name": "PyBuffer_IsContiguous",
      "Arguments": "Py_buffer *, char",
      "ReturnType": "int",
      "Signatures": [
        {
          "Signature": "48 83 EC 28 48 83 79 40 00 4C 8B D9"
        }
      ]
    },
    {
      "Name": "PyBuffer_New",
      "Arguments": "Py_ssize_t",
      "ReturnType": "PyObject *",
      "Signatures": []
    },
    {
      "Name": "PyBuffer_Release",
      "Arguments": "Py_buffer *",
      "ReturnType": "void",
      "Signatures": [
        {
          "Signature": "48 89 5C 24 08 57 48 83 EC 20 48 8B 59 08 48 8B F9 48 85 DB 74 ? 48 8B 43 08"
        }
      ]
    },
    {
      "Name": "PyBuffer_ToContiguous",
      "Arguments": "void *, Py_buffer *, Py_ssize_t, char",
      "ReturnType": "int",
      "Signatures": [
        {
          "Signature": "48 89 5C 24 18 55 56 41 56 48 83 EC 20 4C 3B 42 10"
        }
      ]
    }
  ],
  "Structures": [
    {
      "Name": "PyBuffer_Type",
      "Type": "PyTypeObject",
      "Signatures": [
        {
          "Signature": "PyBuffer_FromMemory+0x48",
          "ValidationPrefix": "48 8D 15"
        }
      ]
    }
  ]
}