{
  "Functions": [
    {
      "Name": "_PyUnicode_XStrip",
      "Arguments": "PyUnicodeObject *self, int striptype, PyObject *sepobj",
      "ReturnType": "PyObject *",
      "Signatures": [
        {
          "Signature": "48 89 5C 24 08 48 89 6C 24 10 48 89 74 24 18 48 89 7C 24 20 41 56 48 83 EC 20 4D 8B 48 10"
        }
      ]
    }
  ],
  "Structures": [
    {
      "Name": "PyUnicode_Type",
      "Type": "PyTypeObject",
      "Signatures": [
        {
          "Signature": "_PyUnicode_XStrip+0xE1",
          "ValidationPrefix": "48 8D 05"
        }
      ]
    }
  ]
}