-4S- 2000000117
-CNC- 2000002073
-QT- 2000003186
-SW- 2000002089
-V- 2000000263
ANZAF 2000001576
ARMED 2000000110
AUS 2000000102
B-S 2000000510
BALLZ 2000001922
C-A-D 2000001146
CIV 2000000463
CNC 2000001800
CORN 2000001730
DOTM 2000000046
DPS 2000001066
DPX 2000002282
FBB 2000001678
FD 2000000392
FLEX 2000001248
FLUKE 2000002681
FURY 2000000189
GNS 2000002091
GOT 2000001495
GVN-D 2000002088
I-A-F 2000000261
IAFSA 2000001365
LUCK 2000000745
MP 2000000209
MVP 2000001027
PANZA 2000000030
PBKAC 2000000277
PCAFV 2000000256
PVP 2000000012
PZSRL 2000002137
RPS 2000000887
SDRHB 2000000255
SNTR 2000000013
SVN 2000002121
SWA 2000002076
TIF 2000000344
UAD 2000000260
VM 2000002229
VN-F 2000002085
VNFF 2000000842
VPA 2000002078
WZ 2000001156
XD 2000000164
YSM 2000001326
ZHAN 2000000807
