{
    "id": "com.modxvm.xfw.actionscript",
    "name": "XFW Actionscript",
    "description": "XFW Actionscript module",

    "version": "XFW_VERSION",
    "dependencies": [],

    "url": "https://modxvm.com/",
    "url_update": "https://modxvm.com/",
    
    "wot_version_min": "WOT_VERSION",
    "wot_version_exactmatch": true,

    "features": ["actionscript", "python"],
    "features_provide": ["actionscript"]
}
