{
    "id": "com.modxvm.xfw.wotfix.hidpi",
    "name": "XFW HiDPI module",
    "description": "XFW HiDPI module",

    "version": "XFW_VERSION",
    "dependencies": ["com.modxvm.xfw.native"],

    "url": "https://modxvm.com/",
    "url_update": "https://modxvm.com/",
    
    "wot_version_min": "WOT_VERSION",
    "wot_version_exactmatch": false,

    "features": ["native", "python"]
}
