{
    "taskDefinitionArn": "arn:aws:ecs:us-east-2:894608134501:task-definition/vc-prod-test-api:8",
    "containerDefinitions": [
        {
            "name": "vc-prod-test-api",
            "image": "894608134501.dkr.ecr.us-east-2.amazonaws.com/vc-prod-test-api:latest",
            "cpu": 0,
            "portMappings": [
                {
                    "name": "vc-prod-test-api-80-tcp",
                    "containerPort": 80,
                    "hostPort": 80,
                    "protocol": "tcp",
                    "appProtocol": "http"
                }
            ],
            "essential": true,
            "environment": [
                {
                    "name": "ENV",
                    "value": "PROD"
                }
            ],
            "environmentFiles": [],
            "mountPoints": [
                {
                    "sourceVolume": "data",
                    "containerPath": "/data",
                    "readOnly": false
                }
            ],
            "volumesFrom": [],
            "ulimits": [],
            "logConfiguration": {
                "logDriver": "awslogs",
                "options": {
                    "awslogs-create-group": "true",
                    "awslogs-group": "/ecs/vc-prod-test-api",
                    "awslogs-region": "us-east-2",
                    "awslogs-stream-prefix": "ecs"
                },
                "secretOptions": []
            }
        }
    ],
    "family": "vc-prod-test-api",
    "taskRoleArn": "arn:aws:iam::894608134501:role/vc-prod-ecs-task-api-role",
    "executionRoleArn": "arn:aws:iam::894608134501:role/ecsTaskExecutionRole",
    "networkMode": "awsvpc",
    "revision": 8,
    "volumes": [
        {
            "name": "data",
            "efsVolumeConfiguration": {
                "fileSystemId": "fs-0abca0b1635d1ee4b",
                "rootDirectory": "/"
            }
        }
    ],
    "status": "ACTIVE",
    "requiresAttributes": [
        {
            "name": "com.amazonaws.ecs.capability.logging-driver.awslogs"
        },
        {
            "name": "ecs.capability.execution-role-awslogs"
        },
        {
            "name": "ecs.capability.efsAuth"
        },
        {
            "name": "com.amazonaws.ecs.capability.ecr-auth"
        },
        {
            "name": "com.amazonaws.ecs.capability.docker-remote-api.1.19"
        },
        {
            "name": "ecs.capability.efs"
        },
        {
            "name": "com.amazonaws.ecs.capability.task-iam-role"
        },
        {
            "name": "com.amazonaws.ecs.capability.docker-remote-api.1.25"
        },
        {
            "name": "ecs.capability.execution-role-ecr-pull"
        },
        {
            "name": "com.amazonaws.ecs.capability.docker-remote-api.1.18"
        },
        {
            "name": "ecs.capability.task-eni"
        },
        {
            "name": "com.amazonaws.ecs.capability.docker-remote-api.1.29"
        }
    ],
    "placementConstraints": [],
    "compatibilities": [
        "EC2",
        "FARGATE"
    ],
    "requiresCompatibilities": [
        "FARGATE"
    ],
    "cpu": "1024",
    "memory": "3072",
    "runtimePlatform": {
        "cpuArchitecture": "X86_64",
        "operatingSystemFamily": "LINUX"
    },
    "registeredAt": "2023-09-14T15:55:58.738Z",
    "registeredBy": "arn:aws:iam::894608134501:user/martin.vrc.aws",
    "tags": []
}