[
  {
    "id": "afganistan",
    "name": { "es": "Afganistán", "en": "Afganistan" },
    "description": {
      "es": "Afganistán es una tumba de imperios. Primero fueron invadidos por los británicos, después por los soviéticos y finalmente por los estadounidenses, pero ninguna de estas potencias consiguió subyugarlos. 17 años después de la última intervención militar, liderada por el gobierno de Washington, regresamos para ver sus consecuencias. Es el país más pobre y analfabeto de Asia, con divisiones sectarias cada vez más profundas, y un amplio mercado de grupos insurgentes que ofrecen protección y sustento. Los talibanes están recuperando terreno y ya controlan casi la mitad del país. Un territorio que además se disputan con los restos de Al Qaeda y un Daesh emergente. Una guerra de todos contra todos que, en 17 años, deja más de 50.000 muertos.",
      "en": "Afghanistan is an empires cemetery. First, they were invaded by the British, then by the Soviet and ultimately by the United States. None of these empires defeated them. 17 years after the last military intervention, leaded by Washington, we come to Afghanistan to discover the consequences.Afghanistan is the poorest and more illiterate Asian country. The sectarian divisions and the insurgent groups that offer their protection are growing. The Taliban are regaining some of the lost ground and they control almost half of the country. A territory contested by the Al Qaeda leftovers and the emergent Daesh. A war of all against all with more than 50.000 dead."
    },
    "gallery": ["afganistan1.jpg", "afganistan2.jpg", "afganistan3.jpg"],
    "video": {
      "es": "https://videos.telesurtv.net/player/767833/despues-de-la-guerra-afganistan-767833/?aspectratio=auto&external=true",
      "en": "https://videos.telesurtv.net/player/767944/after-war-afghanistan-767944/?aspectratio=auto&external=true&external=true"
    },
    "background": "afganistan1.jpg"
  },

  {
    "id": "panama",
    "name": { "es": "Panamá", "en": "Panama" },
    "description": {
      "es": "Panamá es un país creado por EE.UU. para el interés de EE.UU. Para su desarrollo industrial fue fundamental el Canal de Panamá. 35.000 trabajadores murieron para construir esta vía de comunicación, destinada a evitar que las mercancías estadounidenses tuvieran que atravesar en tren las montañas Rocosas. El Canal marca la relación entre Panamá y Estados Unidos, así como la historia del país istmeño y de toda Centroamérica. Para mantener bajo control el Canal tras sentir que había perdido su influencia en Manuel Antonio Noriega, Estados Unidos invadió Panamá. Aún no hay una cifra oficial de muertos. Son las propias víctimas quienes se han encargado de mantener viva la memoria durante tres décadas, frente a la inacción de los sucesivos gobiernos. Tras la invasión se consolida un programa neoliberal impuesto por EEUU. Ciudad de Panamá se ha convertido en un centro de lavado de dinero mundial.",
      "en": "Panama is an American-made country, in favour of the American interest. In order to achieve the industrial development they built up the Panama Canal. 35.000 workers died building this communication route, designed to prevent the American goods from going through the Rocky Mountains by train. The Canal determines the American-Panamanian relationship, as well as the history of the country and Central America.The United States invaded Panama to keep the Panama Canal under control, once they lost their influence on Manuel Antonio Noriega. There is not an official death toll yet. The victims try to keep memories alive against the lack of actions of the different governments. After the invasion, Panama becomes a neoliberal country. Panama City is now one of the most important money-laundering cities of the world."
    },
    "gallery": ["panama1.jpg", "panama2.jpg", "panama3.jpg"],
    "video": {
      "es": "https://videos.telesurtv.net/player/767567/despues-de-la-guerra-panama-767567/?aspectratio=auto&external=true",
      "en": "https://videos.telesurtv.net/player/767568/after-war-panama/?aspectratio=auto&external=true"
    },
    "background": "panama1.jpg"
  },

  {
    "id": "palestine",
    "name": { "es": "Palestina", "en": "Palestine" },
    "description": {
      "es": "La venta de armas es un gran negocio para Israel y Estados Unidos. Misiles, muros y servicios de espionaje que son vendidos después de ser “probados“ en la población palestina.       Los jóvenes palestinos llevan años sufriendo la violencia y la ocupación. Pero su resistencia no se detiene. Janna Jihad se ha convertido en uno de los símbolos de esta nación.",
      "en": "The business of the weapons’ sale is very profitable for Israel and the United States. Missiles, walls or intelligence services are sold after being tested on the Palestinian population. The young Palestinian have suffered the violence and the occupation for many years but their resistance never stops. Janna Jihad has become one of the national symbols."
    },
    "gallery": ["palestine1.jpg", "palestine2.jpg", "palestine3.jpg", "palestine4.jpg", "palestine5.jpg", "palestine6.jpg"],
    "video": {
      "es": "https://videos.telesurtv.net/player/767569/despues-de-la-guerra-palestina-767569/?aspectratio=auto&external=true",
      "en": "https://videos.telesurtv.net/player/767819/after-war-palestine-767819/?aspectratio=auto&external=true"
    },
    "background": "palestine0.jpg"
  },

  {
    "id": "cuba",
    "name": { "es": "Cuba", "en": "Cuba" },
    "description": {
      "es": "Un viaje por el país caribeño mostrando los verdaderos efectos que ha producido el bloqueo comercial sometido a la isla. Muchos niños deben afrontar durísimas operaciones debido a la falta de material sanitario básico. Productos que les prohíben comprar. Todo por culpa de un bloqueo que afecta a los más necesitados. La Revolución no sólo cuestionó el poder económico y político de Washington sobre la isla, también retó la hegemonía cultural y reivindicó la dignidad, no sólo de Cuba, sino de todo el continente.",
      "en": "A trip through the Caribbean country that shows the true effect produced by the commercial embargo the island is subjected to. A lot of children must face very hard surgeries due to the lack of basic health material. Products that are forbidden to be sold to Cuba. And all this is happening because of an embargo that is affecting those most in need. The revolution not only questioned Washington’s economic and political power over the island, but also the cultural hegemony and claimed dignity for Cuba and the whole continent."
    },
    "gallery": ["cuba0.jpg", "cuba1.jpg", "cuba2.jpg"],
    "video": {
      "es": "https://videos.telesurtv.net/player/767982/despues-de-la-guerra-cuba/?aspectratio=auto&external=true",
      "en": "https://videos.telesurtv.net/player/767917/after-war-cuba/?aspectratio=auto&external=true"
    },
    "background": "cuba0.jpg"
  },

  {
    "id": "irak",
    "name": { "es": "Irak", "en": "Iraq" },
    "description": {
      "es": "La juventud iraquí solo recuerda guerra y violencia. Catorce años después de la invasión estadounidense, el país se desangra como resultado de la guerra contra el autodenominado Estado Islámico, una organización terrorista que surgió en Iraq al calor de la ocupación antes de convertirse en la principal amenaza para la seguridad internacional. ¿Cómo se explica el surgimiento del ISIS? ¿Es posible acabar con estos fanáticos únicamente a través de la vía militar?",
      "en": "The Iraqi youth only remembers war and violence. Fourteen years after the US invasion, Iraq is bleeding to death as the consequence of the war against ISIS, a terrorist organization who emerged by the warmth of the occupation before becoming the main threat for international security. How can we explain ISIS emergence? Is it possible to end it just through the military way?"
    },
    "gallery": ["irak0.jpg", "irak1.jpg"],
    "video": {
      "es": "https://videos.telesurtv.net/player/771105/despues-de-la-guerra-irak/?aspectratio=auto&external=true",
      "en": "https://videos.telesurtv.net/player/771105/despues-de-la-guerra-irak/?aspectratio=auto&external=true"
    },
    "background": "irak0.jpg"
  },

  {
    "id": "mexico",
    "name": { "es": "México", "en": "Mexico" },
    "description": {
      "es": "Hay algunas guerras más silenciadas que otras. Las guerras donde no hay campos de batalla evidentes, donde los enemigos no están identificados. México pone los muertos, los desaparecidos, los mal pagados; además sufre la pobreza y la impunidad. Pero, ¿quiénes son los que realmente ganan? ¿Y cuál es el papel del vecino gigante, Estados Unidos, en esta guerra que desangra México? Ciudad Juárez, tierra de maquilas, de mujeres asesinadas y de muros es a donde hemos ido para documentar los problemas que se viven en todo el país.",
      "en": "There is some wars that have been silenced. Wars without battlefields, where the enemies are not identified. Mexico makes the dead, the disappeared, the underpaid and suffers the poverty and the impunity. Who is actually winning? Which is the role that the United States are playing in this war? Ciudad Juarez, the place of “maquilas”, killed women and walls is where we come to document the country’s problems."
    },
    "gallery": ["mexico0.jpg", "mexico1.jpg", "mexico2.jpg", "mexico3.jpg", "mexico4.jpg", "mexico5.jpg", "mexico6.jpg"],
    "video": {
      "es": "https://videos.telesurtv.net/player/767571/despues-de-la-guerra-mexico/?aspectratio=auto&external=true&external=true",
      "en": "https://videos.telesurtv.net/player/767570/after-war-mexico/?aspectratio=auto&external=true&external=true"
    },
    "background": "mexico0.jpg"
  },

  {
    "id": "vietnam",
    "name": { "es": "Vietnam", "en": "Vietnam" },
    "description": {
      "es": "Durante la guerra de Vietnam, Estados Unidos lanzó más de 40 millones de litros del llamado Agente Naranja en las zonas controladas por las guerrillas comunistas. Se trata de una mezcla de dos herbicidas potentes de gran toxicidad que arrasó con millones de hectáreas tanto de bosques como de cultivos. Las consecuencias de este arma química en el medio ambiente y en la salud siguen persiguiendo a la población de este país asiático.Estados Unidos y Monsanto, los principales responsables, no han asumido hasta hoy su responsabilidad. Más de cuarenta años después, los efectos de esta guerra se han convertido en una de las grandes deudas del gobierno de los Estados Unidos con el pueblo de Vietnam.",
      "en": "During the Vietnam War, the US sprayed more than 40 millions of litres of a gas known as Agent Orange in the areas occupied by the communist guerrillas. It is a mix composed by two powerful and very toxic herbicides that levelled millions of hectares of forests and crops. The consequences for the environment and health of this chemical weapon are still pursuing the population of the Asian country. The US and Monsanto have not accepted yet their responsibility on this issue. More than 40 years later, the effects of this war have become one of the biggest debts of the US Government with the Vietnamese people."
    },
    "gallery": ["vietnam1.jpg"],
    "video": {
      "es": "https://videos.telesurtv.net/player/772336/despues-de-la-guerra-vietnam/?aspectratio=auto&external=true&external=true",
      "en": "https://videos.telesurtv.net/player/772668/after-war-vietnam/?aspectratio=auto&external=true&external=true"
    },
    "background": "vietnam0.jpg"
  },

  {
    "id": "congo",
    "name": { "es": "Congo", "en": "Congo" },
    "description": {
      "es": "La región de Katanga, en el sur de la República Democrática del Congo, es el corazón de la revolución tecnológica más importante del siglo XXI. Esta provincia congolesa alberga el 58% de las reservas mundiales de cobalto, un mineral azulón clave para las baterías de teléfonos u ordenadores y para la conquista tecnológica más deseada: el coche eléctrico. Su riqueza mineral es vital para la economía de Congo y también para decenas de multinacionales de todo el mundo que, con el apoyo del ejército o grupos rebeldes, explotan el subsuelo y conforman el último capítulo de una historia de abuso ante una población condenada a la pobreza.",
      "en": "Katanga region, in the south of the Democratic Republic of Congo, is the hub of the most important technological revolution in the XXIst century. This Congolese province is home to 58% of the world reserves of cobalt, a blue mineral that is a key component of the batteries of cell phones and computers, but also for the most beloved technological conquer: the e-car. Its mineral wealth is vital for the economy in the DRC and for the dozens of international companies that, thanks to the support of the Army and rebel groups, exploit the subsoil and conform the last episode of a story of abuse against a population condemned to poverty."
    },
    "gallery": ["congo0.jpg", "congo1.jpg"],
    "video": {
      "es": "https://videos.telesurtv.net/player/769143/despues-de-la-guerra-congo/?aspectratio=auto&external=true",
      "en": "https://videos.telesurenglish.net/video/769164/after-war-congo/?aspectratio=auto&external=true"
    },
    "background": "congo0.jpg"
  }
]