{
  "title": "After War",
  "titleFirst": "After",
  "titleMiddle": "",
  "titleLast": "War",
  "home": "Home",
  "viewGallery": "VIEW GALLERY",
  "next": "NEXT",
  "description": "An analysis of the disaster produced by the American interventions in different countries, destroyed or badly damaged for decades as a result of the wars. ‘After War’ is a documentary series focused on certain recent conflicts, where the wounds are still fresh. Reporters lead us to know the images and testimonies of the true protagonists: civilians exposed to the social, political, economical and territorial breakdown that the interventions have caused."
}
