<?xml version="1.0" encoding="UTF-8" standalone="no"?>
<!-- Created with Inkscape (http://www.inkscape.org/) -->

<svg
   width="483.1001mm"
   height="93.431366mm"
   viewBox="0 0 483.10016 93.431367"
   version="1.1"
   id="logo-phenomx"
   sodipodi:docname="phx-logo-experiment.svg"
   inkscape:version="1.1 (1:1.1+202105261518+ce6663b3b7)"
   xmlns:inkscape="http://www.inkscape.org/namespaces/inkscape"
   xmlns:sodipodi="http://sodipodi.sourceforge.net/DTD/sodipodi-0.dtd"
   xmlns:xlink="http://www.w3.org/1999/xlink"
   xmlns="http://www.w3.org/2000/svg"
   xmlns:svg="http://www.w3.org/2000/svg">
  <sodipodi:namedview
     id="namedview48"
     pagecolor="#ffffff"
     bordercolor="#666666"
     borderopacity="1.0"
     inkscape:pageshadow="2"
     inkscape:pageopacity="0"
     inkscape:pagecheckerboard="false"
     inkscape:document-units="mm"
     showgrid="false"
     fit-margin-top="10"
     fit-margin-left="10"
     fit-margin-right="10"
     fit-margin-bottom="10"
     inkscape:zoom="0.27761784"
     inkscape:cx="884.30915"
     inkscape:cy="601.54635"
     inkscape:window-width="1848"
     inkscape:window-height="1035"
     inkscape:window-x="72"
     inkscape:window-y="27"
     inkscape:window-maximized="1"
     inkscape:current-layer="layer1" />
  <defs
     id="defs256380">
    <radialGradient
       xlink:href="#linearGradient8824"
       id="radialGradient47633"
       gradientUnits="userSpaceOnUse"
       gradientTransform="matrix(0.32093614,0,0,0.32590152,16.932879,4.0680569)"
       cx="165.04585"
       cy="158.63281"
       fx="165.04585"
       fy="158.63281"
       r="110.3818" />
    <linearGradient
       id="linearGradient8824">
      <stop
         style="stop-color:#880058;stop-opacity:1"
         offset="0"
         id="stop8820" />
      <stop
         style="stop-color:#190026;stop-opacity:1"
         offset="1"
         id="stop8822" />
    </linearGradient>
    <radialGradient
       xlink:href="#linearGradient8824"
       id="radialGradient47631"
       gradientUnits="userSpaceOnUse"
       gradientTransform="matrix(1,0,0,1.0154716,0,-2.4543066)"
       cx="165.04585"
       cy="158.63281"
       fx="165.04585"
       fy="158.63281"
       r="110.3818" />
    <radialGradient
       xlink:href="#linearGradient8824"
       id="radialGradient47627"
       gradientUnits="userSpaceOnUse"
       gradientTransform="matrix(1,0,0,1.0093881,0,-1.6102331)"
       cx="165.04585"
       cy="158.63281"
       fx="165.04585"
       fy="158.63281"
       r="110.3818" />
    <radialGradient
       xlink:href="#linearGradient8824"
       id="radialGradient47629"
       gradientUnits="userSpaceOnUse"
       gradientTransform="matrix(1,0,0,1.0676882,0,-16.803029)"
       cx="165.04585"
       cy="158.63281"
       fx="165.04585"
       fy="158.63281"
       r="110.3818" />
    <radialGradient
       xlink:href="#linearGradient8824"
       id="radialGradient47633-9"
       gradientUnits="userSpaceOnUse"
       gradientTransform="matrix(0.59914802,0,0,0.48357877,151.00164,3.0783986)"
       cx="165.04585"
       cy="158.63281"
       fx="165.04585"
       fy="158.63281"
       r="110.3818" />
    <radialGradient
       xlink:href="#linearGradient8824"
       id="radialGradient47631-4"
       gradientUnits="userSpaceOnUse"
       gradientTransform="matrix(1,0,0,1.0154716,0,-2.4543066)"
       cx="165.04585"
       cy="158.63281"
       fx="165.04585"
       fy="158.63281"
       r="110.3818" />
    <radialGradient
       xlink:href="#linearGradient8824"
       id="radialGradient47627-4"
       gradientUnits="userSpaceOnUse"
       gradientTransform="matrix(1,0,0,1.0093881,0,-1.6102331)"
       cx="165.04585"
       cy="158.63281"
       fx="165.04585"
       fy="158.63281"
       r="110.3818" />
    <radialGradient
       xlink:href="#linearGradient8824"
       id="radialGradient47629-2"
       gradientUnits="userSpaceOnUse"
       gradientTransform="matrix(1,0,0,1.0676882,0,-16.803029)"
       cx="165.04585"
       cy="158.63281"
       fx="165.04585"
       fy="158.63281"
       r="110.3818" />
    <radialGradient
       xlink:href="#linearGradient8824"
       id="radialGradient47633-9-0"
       gradientUnits="userSpaceOnUse"
       gradientTransform="matrix(0.51296343,0,0,0.52089977,-15.967735,-533.72024)"
       cx="165.04585"
       cy="158.63281"
       fx="165.04585"
       fy="158.63281"
       r="110.3818" />
    <radialGradient
       xlink:href="#linearGradient8824"
       id="radialGradient47633-9-0-0"
       gradientUnits="userSpaceOnUse"
       gradientTransform="matrix(0.36970299,0,0,0.24395391,-340.61373,-341.61833)"
       cx="165.04585"
       cy="158.63281"
       fx="165.04585"
       fy="158.63281"
       r="110.3818" />
    <radialGradient
       xlink:href="#linearGradient8824"
       id="radialGradient47631-4-9"
       gradientUnits="userSpaceOnUse"
       gradientTransform="matrix(1,0,0,1.0154716,0,-2.4543066)"
       cx="165.04585"
       cy="158.63281"
       fx="165.04585"
       fy="158.63281"
       r="110.3818" />
    <radialGradient
       xlink:href="#linearGradient8824"
       id="radialGradient47627-4-6"
       gradientUnits="userSpaceOnUse"
       gradientTransform="matrix(1,0,0,1.0093881,0,-1.6102331)"
       cx="165.04585"
       cy="158.63281"
       fx="165.04585"
       fy="158.63281"
       r="110.3818" />
    <radialGradient
       xlink:href="#linearGradient8824"
       id="radialGradient47629-2-1"
       gradientUnits="userSpaceOnUse"
       gradientTransform="matrix(1,0,0,1.0676882,0,-16.803029)"
       cx="165.04585"
       cy="158.63281"
       fx="165.04585"
       fy="158.63281"
       r="110.3818" />
    <radialGradient
       xlink:href="#linearGradient8824"
       id="radialGradient47633-9-2"
       gradientUnits="userSpaceOnUse"
       gradientTransform="matrix(0.59914802,0,0,0.48357877,151.00164,3.0783986)"
       cx="165.04585"
       cy="158.63281"
       fx="165.04585"
       fy="158.63281"
       r="110.3818" />
    <radialGradient
       inkscape:collect="always"
       xlink:href="#linearGradient8824"
       id="radialGradient95341"
       gradientUnits="userSpaceOnUse"
       gradientTransform="matrix(1,0,0,1.0154716,0,-2.4543066)"
       cx="165.04585"
       cy="158.63281"
       fx="165.04585"
       fy="158.63281"
       r="110.3818" />
    <radialGradient
       inkscape:collect="always"
       xlink:href="#linearGradient8824"
       id="radialGradient95343"
       gradientUnits="userSpaceOnUse"
       gradientTransform="matrix(1,0,0,1.0154716,0,-2.4543066)"
       cx="165.04585"
       cy="158.63281"
       fx="165.04585"
       fy="158.63281"
       r="110.3818" />
    <radialGradient
       inkscape:collect="always"
       xlink:href="#linearGradient8824"
       id="radialGradient95345"
       gradientUnits="userSpaceOnUse"
       gradientTransform="matrix(1,0,0,1.0154716,0,-2.4543066)"
       cx="165.04585"
       cy="158.63281"
       fx="165.04585"
       fy="158.63281"
       r="110.3818" />
    <radialGradient
       xlink:href="#linearGradient8824"
       id="radialGradient47631-4-6"
       gradientUnits="userSpaceOnUse"
       gradientTransform="matrix(1,0,0,1.0154716,0,-2.4543066)"
       cx="165.04585"
       cy="158.63281"
       fx="165.04585"
       fy="158.63281"
       r="110.3818" />
    <radialGradient
       xlink:href="#linearGradient8824"
       id="radialGradient47627-4-4"
       gradientUnits="userSpaceOnUse"
       gradientTransform="matrix(1,0,0,1.0093881,0,-1.6102331)"
       cx="165.04585"
       cy="158.63281"
       fx="165.04585"
       fy="158.63281"
       r="110.3818" />
    <radialGradient
       xlink:href="#linearGradient8824"
       id="radialGradient47629-2-4"
       gradientUnits="userSpaceOnUse"
       gradientTransform="matrix(1,0,0,1.0676882,0,-16.803029)"
       cx="165.04585"
       cy="158.63281"
       fx="165.04585"
       fy="158.63281"
       r="110.3818" />
    <radialGradient
       xlink:href="#linearGradient8824"
       id="radialGradient47631-4-9-6"
       gradientUnits="userSpaceOnUse"
       gradientTransform="matrix(1,0,0,1.0154716,0,-2.4543066)"
       cx="165.04585"
       cy="158.63281"
       fx="165.04585"
       fy="158.63281"
       r="110.3818" />
    <radialGradient
       inkscape:collect="always"
       xlink:href="#linearGradient8824"
       id="radialGradient95345-0"
       gradientUnits="userSpaceOnUse"
       gradientTransform="matrix(1,0,0,1.0154716,0,-2.4543066)"
       cx="165.04585"
       cy="158.63281"
       fx="165.04585"
       fy="158.63281"
       r="110.3818" />
    <radialGradient
       xlink:href="#linearGradient8824"
       id="radialGradient47633-9-2-2"
       gradientUnits="userSpaceOnUse"
       gradientTransform="matrix(0.59914802,0,0,0.48357877,79.331079,17.554517)"
       cx="219.87552"
       cy="144.37263"
       fx="219.87552"
       fy="144.37263"
       r="110.3818" />
    <radialGradient
       inkscape:collect="always"
       xlink:href="#linearGradient8824"
       id="radialGradient95341-9"
       gradientUnits="userSpaceOnUse"
       gradientTransform="matrix(1,0,0,1.0154716,-12.409074,10.307882)"
       cx="165.04585"
       cy="158.63281"
       fx="165.04585"
       fy="158.63281"
       r="110.3818" />
    <radialGradient
       inkscape:collect="always"
       xlink:href="#linearGradient8824"
       id="radialGradient98122"
       gradientUnits="userSpaceOnUse"
       gradientTransform="matrix(1,0,0,1.0154716,0,-2.4543066)"
       cx="165.04585"
       cy="158.63281"
       fx="165.04585"
       fy="158.63281"
       r="110.3818" />
    <radialGradient
       inkscape:collect="always"
       xlink:href="#linearGradient8824"
       id="radialGradient95343-4"
       gradientUnits="userSpaceOnUse"
       gradientTransform="matrix(1,0,0,1.0154716,-64.339209,12.606175)"
       cx="165.04585"
       cy="158.63281"
       fx="165.04585"
       fy="158.63281"
       r="110.3818" />
    <radialGradient
       inkscape:collect="always"
       xlink:href="#linearGradient8824"
       id="radialGradient98137"
       gradientUnits="userSpaceOnUse"
       gradientTransform="matrix(1,0,0,1.0154716,0,-2.4543066)"
       cx="165.04585"
       cy="158.63281"
       fx="165.04585"
       fy="158.63281"
       r="110.3818" />
    <radialGradient
       xlink:href="#linearGradient8824"
       id="radialGradient47627-4-6-3"
       gradientUnits="userSpaceOnUse"
       gradientTransform="matrix(1,0,0,1.0093881,0,-1.6102331)"
       cx="165.04585"
       cy="158.63281"
       fx="165.04585"
       fy="158.63281"
       r="110.3818" />
    <radialGradient
       xlink:href="#linearGradient8824"
       id="radialGradient47629-2-1-5"
       gradientUnits="userSpaceOnUse"
       gradientTransform="matrix(1,0,0,1.0676882,-11.160718,-16.803029)"
       cx="165.04585"
       cy="158.63281"
       fx="165.04585"
       fy="158.63281"
       r="110.3818" />
    <radialGradient
       xlink:href="#linearGradient8824"
       id="radialGradient47631-4-9-6-0"
       gradientUnits="userSpaceOnUse"
       gradientTransform="matrix(1,0,0,1.0154716,0,-2.4543066)"
       cx="165.04585"
       cy="158.63281"
       fx="165.04585"
       fy="158.63281"
       r="110.3818" />
    <radialGradient
       xlink:href="#linearGradient8824"
       id="radialGradient47627-4-6-3-6"
       gradientUnits="userSpaceOnUse"
       gradientTransform="matrix(1,0,0,1.0093881,0,-1.6102331)"
       cx="165.04585"
       cy="158.63281"
       fx="165.04585"
       fy="158.63281"
       r="110.3818" />
    <radialGradient
       xlink:href="#linearGradient8824"
       id="radialGradient47629-2-1-5-8"
       gradientUnits="userSpaceOnUse"
       gradientTransform="matrix(1,0,0,1.0676882,0,-16.803029)"
       cx="165.04585"
       cy="158.63281"
       fx="165.04585"
       fy="158.63281"
       r="110.3818" />
    <radialGradient
       inkscape:collect="always"
       xlink:href="#linearGradient8824"
       id="radialGradient110689"
       gradientUnits="userSpaceOnUse"
       gradientTransform="matrix(1,0,0,1.0154716,0,-2.4543066)"
       cx="165.04585"
       cy="158.63281"
       fx="165.04585"
       fy="158.63281"
       r="110.3818" />
    <radialGradient
       xlink:href="#linearGradient8824"
       id="radialGradient47631-4-6-7"
       gradientUnits="userSpaceOnUse"
       gradientTransform="matrix(1,0,0,1.0154716,0,-2.4543066)"
       cx="165.04585"
       cy="158.63281"
       fx="165.04585"
       fy="158.63281"
       r="110.3818" />
    <radialGradient
       xlink:href="#linearGradient8824"
       id="radialGradient47627-4-4-3"
       gradientUnits="userSpaceOnUse"
       gradientTransform="matrix(1,0,0,1.0093881,0,-1.6102331)"
       cx="165.04585"
       cy="158.63281"
       fx="165.04585"
       fy="158.63281"
       r="110.3818" />
    <radialGradient
       xlink:href="#linearGradient8824"
       id="radialGradient47629-2-4-3"
       gradientUnits="userSpaceOnUse"
       gradientTransform="matrix(1,0,0,1.0676882,0,-16.803029)"
       cx="165.04585"
       cy="158.63281"
       fx="165.04585"
       fy="158.63281"
       r="110.3818" />
    <radialGradient
       xlink:href="#linearGradient8824"
       id="radialGradient47633-9-0-0-2"
       gradientUnits="userSpaceOnUse"
       gradientTransform="matrix(0.36970299,0,0,0.24395391,-162.66869,-91.260511)"
       cx="165.04585"
       cy="158.63281"
       fx="165.04585"
       fy="158.63281"
       r="110.3818" />
    <radialGradient
       xlink:href="#linearGradient8824"
       id="radialGradient47631-4-9-6-0-6"
       gradientUnits="userSpaceOnUse"
       gradientTransform="matrix(1,0,0,1.0154716,0,-2.4543066)"
       cx="165.04585"
       cy="158.63281"
       fx="165.04585"
       fy="158.63281"
       r="110.3818" />
    <radialGradient
       xlink:href="#linearGradient8824"
       id="radialGradient47627-4-6-3-6-7"
       gradientUnits="userSpaceOnUse"
       gradientTransform="matrix(1,0,0,1.0093881,7.9365124,-1.6102331)"
       cx="165.04585"
       cy="158.63281"
       fx="165.04585"
       fy="158.63281"
       r="110.3818" />
    <radialGradient
       xlink:href="#linearGradient8824"
       id="radialGradient47629-2-1-5-8-9"
       gradientUnits="userSpaceOnUse"
       gradientTransform="matrix(1,0,0,1.0676882,1.4354378e-5,-16.803029)"
       cx="165.04585"
       cy="158.63281"
       fx="165.04585"
       fy="158.63281"
       r="110.3818" />
    <radialGradient
       xlink:href="#linearGradient8824"
       id="radialGradient47633-9-2-2-1"
       gradientUnits="userSpaceOnUse"
       gradientTransform="matrix(3.0135477,0,0,2.068498,-479.98538,34.383912)"
       cx="219.87552"
       cy="144.37263"
       fx="219.87552"
       fy="144.37263"
       r="110.3818" />
    <radialGradient
       inkscape:collect="always"
       xlink:href="#linearGradient8824"
       id="radialGradient111705"
       gradientUnits="userSpaceOnUse"
       gradientTransform="matrix(1,0,0,1.0154716,0,-2.4543066)"
       cx="165.04585"
       cy="158.63281"
       fx="165.04585"
       fy="158.63281"
       r="110.3818" />
    <radialGradient
       xlink:href="#linearGradient8824"
       id="radialGradient47631-4-9-6-0-6-0"
       gradientUnits="userSpaceOnUse"
       gradientTransform="matrix(1,0,0,1.0154716,0,-2.4543066)"
       cx="165.04585"
       cy="158.63281"
       fx="165.04585"
       fy="158.63281"
       r="110.3818" />
    <radialGradient
       xlink:href="#linearGradient8824"
       id="radialGradient47627-4-6-3-6-7-2"
       gradientUnits="userSpaceOnUse"
       gradientTransform="matrix(1,0,0,1.0093881,241.84732,9.4733863)"
       cx="165.04585"
       cy="158.63281"
       fx="165.04585"
       fy="158.63281"
       r="110.3818" />
    <radialGradient
       xlink:href="#linearGradient8824"
       id="radialGradient47633-9-2-2-1-4"
       gradientUnits="userSpaceOnUse"
       gradientTransform="matrix(-3.0135477,0,0,2.068498,887.63643,45.467531)"
       cx="219.87552"
       cy="144.37263"
       fx="219.87552"
       fy="144.37263"
       r="110.3818" />
    <radialGradient
       xlink:href="#linearGradient8824"
       id="radialGradient47629-2-1-5-8-9-7"
       gradientUnits="userSpaceOnUse"
       gradientTransform="matrix(1,0,0,1.0676882,233.91082,-5.7194096)"
       cx="165.04585"
       cy="158.63281"
       fx="165.04585"
       fy="158.63281"
       r="110.3818" />
    <radialGradient
       inkscape:collect="always"
       xlink:href="#linearGradient8824"
       id="radialGradient95345-0-8"
       gradientUnits="userSpaceOnUse"
       gradientTransform="matrix(1,0,0,1.0154716,0,-2.4543066)"
       cx="165.04585"
       cy="158.63281"
       fx="165.04585"
       fy="158.63281"
       r="110.3818" />
    <radialGradient
       xlink:href="#linearGradient8824"
       id="radialGradient47633-9-2-2-17"
       gradientUnits="userSpaceOnUse"
       gradientTransform="matrix(0.59914802,0,0,0.48357877,79.331079,17.554517)"
       cx="219.87552"
       cy="144.37263"
       fx="219.87552"
       fy="144.37263"
       r="110.3818" />
    <radialGradient
       inkscape:collect="always"
       xlink:href="#linearGradient8824"
       id="radialGradient95341-9-8"
       gradientUnits="userSpaceOnUse"
       gradientTransform="matrix(1,0,0,1.0154716,-12.409074,10.307882)"
       cx="165.04585"
       cy="158.63281"
       fx="165.04585"
       fy="158.63281"
       r="110.3818" />
    <radialGradient
       inkscape:collect="always"
       xlink:href="#linearGradient8824"
       id="radialGradient112278"
       gradientUnits="userSpaceOnUse"
       gradientTransform="matrix(1,0,0,1.0154716,-12.409074,10.307882)"
       cx="165.04585"
       cy="158.63281"
       fx="165.04585"
       fy="158.63281"
       r="110.3818" />
    <radialGradient
       inkscape:collect="always"
       xlink:href="#linearGradient8824"
       id="radialGradient95343-4-9"
       gradientUnits="userSpaceOnUse"
       gradientTransform="matrix(1,0,0,1.0154716,-64.339209,12.606175)"
       cx="165.04585"
       cy="158.63281"
       fx="165.04585"
       fy="158.63281"
       r="110.3818" />
    <radialGradient
       inkscape:collect="always"
       xlink:href="#linearGradient8824"
       id="radialGradient112293"
       gradientUnits="userSpaceOnUse"
       gradientTransform="matrix(1,0,0,1.0154716,-64.339209,12.606175)"
       cx="165.04585"
       cy="158.63281"
       fx="165.04585"
       fy="158.63281"
       r="110.3818" />
    <linearGradient
       inkscape:collect="always"
       xlink:href="#linearGradient8824"
       id="linearGradient112454"
       x1="74.756126"
       y1="92.786461"
       x2="157.384"
       y2="92.786461"
       gradientUnits="userSpaceOnUse"
       gradientTransform="matrix(0.70741229,0,0,0.70741229,31.250593,34.878155)" />
    <radialGradient
       inkscape:collect="always"
       xlink:href="#linearGradient8824"
       id="radialGradient20675-1-4-29-7"
       gradientUnits="userSpaceOnUse"
       gradientTransform="matrix(3.1188675,0,0,2.9286446,436.58452,-1099.8938)"
       cx="165.04585"
       cy="158.63281"
       fx="165.04585"
       fy="158.63281"
       r="110.3818" />
    <radialGradient
       inkscape:collect="always"
       xlink:href="#linearGradient8824"
       id="radialGradient20675-1-4-2-3"
       gradientUnits="userSpaceOnUse"
       gradientTransform="matrix(3.0006601,0,0,3.0470851,451.05575,-1115.1176)"
       cx="165.04585"
       cy="158.63281"
       fx="165.04585"
       fy="158.63281"
       r="110.3818" />
    <radialGradient
       inkscape:collect="always"
       xlink:href="#linearGradient8824"
       id="radialGradient20675-1-4-2-3-9"
       gradientUnits="userSpaceOnUse"
       gradientTransform="matrix(-0.5131025,0.60584005,-0.61521336,-0.52104101,95.913235,-246.85906)"
       cx="165.04585"
       cy="158.63281"
       fx="165.04585"
       fy="158.63281"
       r="110.3818" />
    <radialGradient
       inkscape:collect="always"
       xlink:href="#linearGradient8824"
       id="radialGradient20675-1-4-29-7-3"
       gradientUnits="userSpaceOnUse"
       gradientTransform="matrix(-1.5842144,0,0,1.3170254,247.28649,-125.31651)"
       cx="165.04585"
       cy="158.63281"
       fx="165.04585"
       fy="158.63281"
       r="110.3818" />
    <radialGradient
       xlink:href="#linearGradient8824"
       id="radialGradient47629-2-1-5-9"
       gradientUnits="userSpaceOnUse"
       gradientTransform="matrix(1,0,0,1.0676882,26.738625,1537.0733)"
       cx="165.04585"
       cy="158.63281"
       fx="165.04585"
       fy="158.63281"
       r="110.3818" />
    <radialGradient
       xlink:href="#linearGradient8824"
       id="radialGradient47627-4-6-3-2"
       gradientUnits="userSpaceOnUse"
       gradientTransform="matrix(1,0,0,1.0093881,37.899345,1552.2661)"
       cx="165.04585"
       cy="158.63281"
       fx="165.04585"
       fy="158.63281"
       r="110.3818" />
    <radialGradient
       xlink:href="#linearGradient8824"
       id="radialGradient47633-9-2-2-17-2"
       gradientUnits="userSpaceOnUse"
       gradientTransform="matrix(0.60191285,0,0,0.41315276,89.607285,141.94761)"
       cx="219.87552"
       cy="144.37263"
       fx="219.87552"
       fy="144.37263"
       r="110.3818" />
    <radialGradient
       inkscape:collect="always"
       xlink:href="#linearGradient8824"
       id="radialGradient95341-9-8-0"
       gradientUnits="userSpaceOnUse"
       gradientTransform="matrix(0.97318831,0,0,0.98824512,-58.82902,134.99112)"
       cx="165.04585"
       cy="158.63281"
       fx="165.04585"
       fy="158.63281"
       r="110.3818" />
    <radialGradient
       inkscape:collect="always"
       xlink:href="#linearGradient8824"
       id="radialGradient120569"
       gradientUnits="userSpaceOnUse"
       gradientTransform="matrix(1,0,0,1.0154716,-12.409074,10.307882)"
       cx="165.04585"
       cy="158.63281"
       fx="165.04585"
       fy="158.63281"
       r="110.3818" />
    <radialGradient
       inkscape:collect="always"
       xlink:href="#linearGradient8824"
       id="radialGradient120584"
       gradientUnits="userSpaceOnUse"
       gradientTransform="matrix(1,0,0,1.0154716,-64.339209,12.606175)"
       cx="165.04585"
       cy="158.63281"
       fx="165.04585"
       fy="158.63281"
       r="110.3818" />
    <radialGradient
       inkscape:collect="always"
       xlink:href="#linearGradient8824"
       id="radialGradient110689-3"
       gradientUnits="userSpaceOnUse"
       gradientTransform="matrix(1,0,0,1.0154716,0,-2.4543066)"
       cx="165.04585"
       cy="158.63281"
       fx="165.04585"
       fy="158.63281"
       r="110.3818" />
    <radialGradient
       xlink:href="#linearGradient8824"
       id="radialGradient47627-4-6-3-2-9"
       gradientUnits="userSpaceOnUse"
       gradientTransform="matrix(1,0,0,1.0093881,37.899345,1552.2661)"
       cx="165.04585"
       cy="158.63281"
       fx="165.04585"
       fy="158.63281"
       r="110.3818" />
    <radialGradient
       xlink:href="#linearGradient8824"
       id="radialGradient47629-2-1-5-9-0"
       gradientUnits="userSpaceOnUse"
       gradientTransform="matrix(1,0,0,1.0676882,26.738625,1537.0733)"
       cx="165.04585"
       cy="158.63281"
       fx="165.04585"
       fy="158.63281"
       r="110.3818" />
    <radialGradient
       inkscape:collect="always"
       xlink:href="#linearGradient8824"
       id="radialGradient20675-1-4-29-7-3-5"
       gradientUnits="userSpaceOnUse"
       gradientTransform="matrix(-1.5842144,0,0,1.3170254,247.28649,-125.31651)"
       cx="165.04585"
       cy="158.63281"
       fx="165.04585"
       fy="158.63281"
       r="110.3818" />
    <radialGradient
       inkscape:collect="always"
       xlink:href="#linearGradient8824"
       id="radialGradient110689-3-0"
       gradientUnits="userSpaceOnUse"
       gradientTransform="matrix(1,0,0,1.0154716,0,-2.4543066)"
       cx="165.04585"
       cy="158.63281"
       fx="165.04585"
       fy="158.63281"
       r="110.3818" />
    <radialGradient
       xlink:href="#linearGradient8824"
       id="radialGradient47627-4-6-3-2-9-4"
       gradientUnits="userSpaceOnUse"
       gradientTransform="matrix(1,0,0,1.0093881,37.899345,1552.2661)"
       cx="165.04585"
       cy="158.63281"
       fx="165.04585"
       fy="158.63281"
       r="110.3818" />
    <radialGradient
       xlink:href="#linearGradient8824"
       id="radialGradient47629-2-1-5-9-0-6"
       gradientUnits="userSpaceOnUse"
       gradientTransform="matrix(1,0,0,1.0676882,26.738625,1537.0733)"
       cx="165.04585"
       cy="158.63281"
       fx="165.04585"
       fy="158.63281"
       r="110.3818" />
    <radialGradient
       xlink:href="#linearGradient8824"
       id="radialGradient47633-9-0-07"
       gradientUnits="userSpaceOnUse"
       gradientTransform="matrix(0.66888523,0,0,0.43075808,111.55198,146.07748)"
       cx="165.04585"
       cy="158.63281"
       fx="165.04585"
       fy="158.63281"
       r="110.3818" />
    <radialGradient
       xlink:href="#linearGradient8824"
       id="radialGradient47633-9-2-2-17-2-1"
       gradientUnits="userSpaceOnUse"
       gradientTransform="matrix(0.60191285,0,0,0.41315276,-116.32866,11.509453)"
       cx="219.87552"
       cy="144.37263"
       fx="219.87552"
       fy="144.37263"
       r="110.3818" />
    <radialGradient
       xlink:href="#linearGradient8824"
       id="radialGradient47633-9-2-2-17-2-1-7"
       gradientUnits="userSpaceOnUse"
       gradientTransform="matrix(0.69279188,0,0,0.50031571,107.90402,137.42482)"
       cx="219.87552"
       cy="144.37263"
       fx="219.87552"
       fy="144.37263"
       r="110.3818" />
  </defs>
  <g
     id="layer1"
     transform="translate(3.8203912,3.1354027)"
     inkscape:label="all"
     inkscape:groupmode="layer">
    <ellipse
       style="fill:#ffffff;fill-opacity:1;stroke:none;stroke-width:0.382423;stroke-linecap:round;stroke-miterlimit:4;stroke-dasharray:0.382423, 1.52969;stroke-dashoffset:0;stroke-opacity:1"
       id="path258792-7"
       cx="213.96216"
       cy="-368.98596"
       rx="43.323174"
       ry="26.171492"
       inkscape:label="white-circle" />
    <path
       style="display:none;fill:url(#radialGradient47633);fill-opacity:1;stroke-width:0.159825"
       d="m 97.425399,19.944247 c 0.07247,0.145018 0.772504,1.969929 1.55567,4.055348 0.783167,2.085393 1.495821,3.769254 1.583721,3.741843 0.0879,-0.02728 0.30085,-0.403357 0.47323,-0.835448 0.26712,-0.669634 0.31245,-1.166257 0.30673,-3.362378 l -0.007,-2.57675 0.95565,-0.0998 1.46857,-0.09988 h 0.51295 l 0.10189,1.078627 c 0.36581,3.87178 -0.34026,6.83379 -2.0211,8.478599 l -0.70371,0.688657 1.89531,4.974802 c 1.04244,2.736135 1.85669,5.048647 1.77417,5.080106 l -2.49608,0.951865 c -0.12385,0.04723 -0.8381,-1.650603 -1.86113,-4.354407 -0.90623,-2.394929 -1.702281,-4.416398 -1.769035,-4.492175 -0.208386,-0.236617 -1.086432,1.165119 -1.220576,1.948656 -0.172217,1.005761 -0.09213,3.306128 0.176186,5.060289 0.120994,0.790998 0.202195,1.45796 0.180473,1.482116 L 95.42101,42.12456 c -0.09287,0.01482 -0.494718,-3.113061 -0.610447,-4.342977 -0.141102,-1.499447 0.163116,-3.608678 0.678868,-4.706858 0.231299,-0.492548 0.886116,-1.376336 1.482408,-2.000806 l 1.068096,-1.118552 -1.738789,-4.542181 c -0.956363,-2.498196 -1.683094,-4.594887 -1.614963,-4.65926 0.06816,-0.0644 0.682678,-0.332264 1.365699,-0.595233 1.117653,-0.430345 1.254972,-0.451776 1.373558,-0.214445 z"
       id="path46465"
       inkscape:label="hidden X" />
    <rect
       style="fill:#ffffff;fill-opacity:1;stroke:none;stroke-width:11.5772;stroke-linecap:round;stroke-miterlimit:4;stroke-dasharray:none;stroke-opacity:1"
       id="rect255856-8-9"
       width="98.401146"
       height="73.342247"
       x="344.36612"
       y="-388.13113"
       ry="0"
       rx="0"
       inkscape:label="bground" />
    <path
       id="rect255711-6"
       style="color:#000000;fill:#000000;stroke-width:1;stroke-linecap:round;-inkscape-stroke:none"
       d="m -16.068068,550.02257 v 61.38641 H 1.7623648 l 4.7625003,-6.29471 H -9.7707782 V 556.31725 H 37.742595 v 21.0597 l 6.2947,-3.175 v -24.17938 z"
       sodipodi:nodetypes="ccccccccccc" />
    <path
       id="rect255711-6-1"
       style="color:#000000;fill:#000000;stroke-width:1;stroke-linecap:round;-inkscape-stroke:none"
       d="m 14.595841,-94.8473 v 61.3864 h 19.41793 l 5.82083,-6.29471 h -18.94147 v -48.79701 h 47.513355 v 24.2347 l 5.765533,-3.704166 0.529167,-26.825214 z"
       sodipodi:nodetypes="ccccccccccc" />
    <path
       style="fill:url(#radialGradient47633-9-0);fill-opacity:1;stroke-width:0.255454"
       d="m 112.68626,-508.34478 c 0.11588,0.23179 1.23473,3.14861 2.48648,6.48181 1.25177,3.33315 2.39083,6.02453 2.53132,5.98071 0.14049,-0.0436 0.48086,-0.6447 0.75638,-1.33532 0.42695,-1.0703 0.4994,-1.86407 0.49026,-5.37421 l -0.0112,-4.11851 1.52745,-0.15951 2.34726,-0.15964 h 0.81987 l 0.16285,1.724 c 0.58469,6.18841 -0.54385,10.92269 -3.23039,13.55164 l -1.12476,1.10071 3.02934,7.9514 c 1.66616,4.37326 2.96761,8.06943 2.83571,8.11971 l -3.98957,1.5214 c -0.19795,0.0755 -1.33956,-2.63822 -2.97471,-6.9598 -1.44846,-3.8279 -2.72081,-7.05889 -2.8275,-7.18 -0.33308,-0.3782 -1.73648,1.86225 -1.9509,3.1146 -0.27525,1.60755 -0.1472,5.2843 0.28161,8.08804 0.19339,1.26428 0.32317,2.33031 0.28846,2.36892 l -4.65165,0.73562 c -0.14849,0.0237 -0.79072,-4.97572 -0.97569,-6.94153 -0.22553,-2.39662 0.2607,-5.76788 1.08506,-7.52314 0.36968,-0.78725 1.4163,-2.19984 2.36937,-3.19796 l 1.70718,-1.78782 -2.77917,-7.25992 c -1.52858,-3.99296 -2.69014,-7.34417 -2.58124,-7.44706 0.109,-0.10294 1.09115,-0.53107 2.18284,-0.95138 1.78638,-0.68784 2.00587,-0.72209 2.1954,-0.34276 z"
       id="path46465-1-6"
       inkscape:label="X" />
    <g
       id="g46463-5"
       style="fill:url(#radialGradient47631-4);fill-opacity:1"
       transform="matrix(0.26458333,0,0,0.26458333,178.2411,-423.52692)"
       inkscape:label="Ph">
      <path
         id="path46459-5"
         style="fill:url(#radialGradient47627-4);fill-opacity:1;stroke-width:0.664667"
         d="m 142.66406,140.47796 v 131.8926 l -0.0968,4.69447 25.08122,0.11884 c 0,0 0.77322,-3.62675 0.38993,-6.13771 -0.0933,-5.96656 -0.0125,-11.93496 -0.0384,-17.9023 -0.0126,-9.34486 0.0396,-18.69143 -0.0697,-28.03512 -0.33987,-6.9867 1.64838,-14.27301 6.29393,-19.6311 2.51437,-2.8064 6.05614,-4.73291 9.84711,-5.05317 2.44182,-0.46102 5.10504,-0.54772 7.34367,0.69308 3.91989,2.05291 6.25987,6.17374 7.3839,10.302 0.92412,3.52098 0.75088,7.186 0.99609,10.78655 0.64154,16.27734 -0.10193,32.69773 0.23372,49.03102 0.0596,0.57601 0,5.96405 0,5.96405 l 25.56618,-0.19457 c 0,0 0.26029,-3.49933 -0.11479,-5.95844 -0.14807,-5.03366 -0.0994,-10.07178 -0.1736,-15.10722 -0.10957,-14.12356 -0.26663,-28.24789 -0.32403,-42.37115 0.561,-11.3727 -4.69879,-22.86431 -13.64999,-29.95711 -4.32629,-3.38155 -9.68036,-5.89632 -15.10262,-6.06401 -6.15356,-0.1903 -12.83816,2.17999 -17.53198,5.80962 -4.69382,3.62963 -8.69428,9.49403 -10.76759,13.91819 -0.0263,-15.11981 0.0619,-43.65202 0.0346,-58.77183 l -25.30078,-0.0632 v 2.03655 z" />
      <path
         id="path46461-4"
         style="fill:url(#radialGradient47629-2);fill-opacity:1;stroke-width:0.683592"
         d="m 79.613281,138.25817 c -7.94877,0.11843 -16.012095,0.5059 -23.890625,0.29365 -1.663163,-0.035 -3.327189,-0.15386 -4.980468,-0.19919 -1.290619,0.081 -2.243724,1.40835 -2.078126,2.73451 0,45.16757 10e-7,90.33514 0,135.5027 8.889323,0 17.778646,0 26.667969,0 0,-15.65699 0,-31.314 0,-46.97099 10.023585,-0.009 20.261698,-0.43626 29.813619,-3.94053 5.60299,-2.05561 10.77883,-5.34513 15.14856,-9.56119 6.2286,-5.04849 10.09986,-12.72901 11.90862,-20.66621 1.27989,-5.49788 1.91015,-11.17289 1.85713,-16.83086 -0.82581,-15.04062 -9.72434,-29.40813 -22.7229,-35.88401 -3.91668,-1.97657 -8.218,-2.84964 -12.49331,-3.45727 -6.367974,-0.92461 -12.810277,-1.0785 -19.230469,-1.02061 z m 8.41211,25.37169 c 4.662791,0.0761 9.632112,0.41293 13.634599,3.20401 3.89146,2.79174 5.87979,7.68748 6.54296,12.45115 0.78071,5.37267 0.17023,11.23267 -2.80409,15.80308 -2.56621,3.75846 -6.741654,5.92768 -10.985723,6.77461 -6.274892,1.33639 -12.716707,1.13784 -19.085012,1.14615 -0.01634,-12.9553 0.03192,-25.91059 0.109375,-38.86561 2.989415,-0.1492 6.098474,-0.35319 9.011719,-0.44768 1.191888,-0.0367 2.383786,-0.0588 3.576172,-0.0657 z" />
    </g>
    <g
       id="g441790"
       inkscape:label="tagline logo"
       transform="translate(-35.977778,438.40173)">
      <g
         id="g94781">
        <rect
           style="fill:none;fill-opacity:1;stroke:#000000;stroke-width:6.2955;stroke-linecap:round;stroke-miterlimit:4;stroke-dasharray:none;stroke-opacity:1"
           id="rect255711"
           width="53.809948"
           height="55.092403"
           x="16.037506"
           y="14.743722" />
        <rect
           style="display:inline;fill:#ffffff;fill-opacity:1;stroke:none;stroke-width:7.40421;stroke-linecap:round;stroke-miterlimit:4;stroke-dasharray:none;stroke-opacity:1"
           id="rect255856"
           width="59.89687"
           height="49.282898"
           x="35.481476"
           y="31.013065" />
        <g
           id="g46463"
           style="fill:url(#radialGradient47631);fill-opacity:1"
           transform="matrix(0.26458333,0,0,0.26458333,28.69822,-0.23665034)">
          <path
             id="path46459"
             style="fill:url(#radialGradient47627);fill-opacity:1;stroke-width:0.664667"
             d="m 142.66406,140.47796 v 131.8926 l -0.0968,4.69447 25.08122,0.11884 c 0,0 0.77322,-3.62675 0.38993,-6.13771 -0.0933,-5.96656 -0.0125,-11.93496 -0.0384,-17.9023 -0.0126,-9.34486 0.0396,-18.69143 -0.0697,-28.03512 -0.33987,-6.9867 1.64838,-14.27301 6.29393,-19.6311 2.51437,-2.8064 6.05614,-4.73291 9.84711,-5.05317 2.44182,-0.46102 5.10504,-0.54772 7.34367,0.69308 3.91989,2.05291 6.25987,6.17374 7.3839,10.302 0.92412,3.52098 0.75088,7.186 0.99609,10.78655 0.64154,16.27734 -0.10193,32.69773 0.23372,49.03102 0.0596,0.57601 0,5.96405 0,5.96405 l 25.56618,-0.19457 c 0,0 0.26029,-3.49933 -0.11479,-5.95844 -0.14807,-5.03366 -0.0994,-10.07178 -0.1736,-15.10722 -0.10957,-14.12356 -0.26663,-28.24789 -0.32403,-42.37115 0.561,-11.3727 -4.69879,-22.86431 -13.64999,-29.95711 -4.32629,-3.38155 -9.68036,-5.89632 -15.10262,-6.06401 -6.15356,-0.1903 -12.83816,2.17999 -17.53198,5.80962 -4.69382,3.62963 -8.69428,9.49403 -10.76759,13.91819 -0.0263,-15.11981 0.0619,-43.65202 0.0346,-58.77183 l -25.30078,-0.0632 v 2.03655 z" />
          <path
             id="path46461"
             style="fill:url(#radialGradient47629);fill-opacity:1;stroke-width:0.683592"
             d="m 79.613281,138.25817 c -7.94877,0.11843 -16.012095,0.5059 -23.890625,0.29365 -1.663163,-0.035 -3.327189,-0.15386 -4.980468,-0.19919 -1.290619,0.081 -2.243724,1.40835 -2.078126,2.73451 0,45.16757 10e-7,90.33514 0,135.5027 8.889323,0 17.778646,0 26.667969,0 0,-15.65699 0,-31.314 0,-46.97099 10.023585,-0.009 20.261698,-0.43626 29.813619,-3.94053 5.60299,-2.05561 10.77883,-5.34513 15.14856,-9.56119 6.2286,-5.04849 10.09986,-12.72901 11.90862,-20.66621 1.27989,-5.49788 1.91015,-11.17289 1.85713,-16.83086 -0.82581,-15.04062 -9.72434,-29.40813 -22.7229,-35.88401 -3.91668,-1.97657 -8.218,-2.84964 -12.49331,-3.45727 -6.367974,-0.92461 -12.810277,-1.0785 -19.230469,-1.02061 z m 8.41211,25.37169 c 4.662791,0.0761 9.632112,0.41293 13.634599,3.20401 3.89146,2.79174 5.87979,7.68748 6.54296,12.45115 0.78071,5.37267 0.17023,11.23267 -2.80409,15.80308 -2.56621,3.75846 -6.741654,5.92768 -10.985723,6.77461 -6.274892,1.33639 -12.716707,1.13784 -19.085012,1.14615 -0.01634,-12.9553 0.03192,-25.91059 0.109375,-38.86561 2.989415,-0.1492 6.098474,-0.35319 9.011719,-0.44768 1.191888,-0.0367 2.383786,-0.0588 3.576172,-0.0657 z" />
        </g>
      </g>
      <g
         id="g94772"
         transform="translate(0,0.60075959)">
        <path
           style="fill:url(#radialGradient47633-9);fill-opacity:1;stroke-width:0.266008"
           d="m 301.27122,26.635792 c 0.13522,0.21518 1.44219,2.923016 2.90424,6.017398 1.4621,3.094347 2.79252,5.592891 2.95661,5.552218 0.16416,-0.04048 0.56167,-0.598509 0.88347,-1.239653 0.49868,-0.993613 0.5833,-1.730515 0.57264,-4.98916 l -0.0143,-3.823431 1.78407,-0.148085 2.74162,-0.14821 h 0.95764 l 0.19021,1.600486 c 0.6829,5.745021 -0.63523,10.140107 -3.77315,12.580705 l -1.31374,1.021842 3.53832,7.381708 c 1.94609,4.059927 3.4662,7.491276 3.31213,7.537956 l -4.65986,1.412395 c -0.23122,0.07008 -1.56461,-2.449195 -3.47449,-6.46115 -1.69183,-3.553641 -3.17795,-6.553138 -3.30256,-6.665577 -0.38904,-0.351095 -2.02823,1.728828 -2.27868,2.891454 -0.3215,1.492368 -0.17185,4.905695 0.32893,7.508553 0.22587,1.173698 0.37746,2.163347 0.33691,2.199191 l -5.43319,0.682916 c -0.17345,0.02199 -0.92356,-4.619218 -1.13961,-6.44419 -0.26343,-2.224907 0.30451,-5.354626 1.26736,-6.984125 0.43179,-0.730852 1.65425,-2.042233 2.76746,-2.968835 l 1.99401,-1.659728 -3.24612,-6.739774 c -1.78538,-3.706871 -3.14212,-6.81798 -3.01491,-6.913498 0.12736,-0.09557 1.27447,-0.493018 2.54959,-0.883219 2.08651,-0.638551 2.34288,-0.670352 2.56424,-0.318198 z"
           id="path46465-1" />
        <text
           xml:space="preserve"
           style="font-style:normal;font-variant:normal;font-weight:bold;font-stretch:normal;font-size:40.3309px;line-height:1.25;font-family:'Liberation Sans';-inkscape-font-specification:'Liberation Sans, Bold';font-variant-ligatures:normal;font-variant-caps:normal;font-variant-numeric:normal;font-variant-east-asian:normal;letter-spacing:3.78102px;stroke-width:0.472626"
           x="114.22296"
           y="59.153572"
           id="text339989"><tspan
             id="tspan339987"
             style="font-style:normal;font-variant:normal;font-weight:bold;font-stretch:normal;font-size:40.3309px;font-family:'Liberation Sans';-inkscape-font-specification:'Liberation Sans, Bold';font-variant-ligatures:normal;font-variant-caps:normal;font-variant-numeric:normal;font-variant-east-asian:normal;stroke-width:0.472626"
             x="114.22296"
             y="59.153572"
             dx="0">Phenom</tspan></text>
        <text
           xml:space="preserve"
           style="font-style:italic;font-variant:normal;font-weight:normal;font-stretch:normal;font-size:30.2481px;line-height:1.25;font-family:'Liberation Sans';-inkscape-font-specification:'Liberation Sans, Italic';font-variant-ligatures:normal;font-variant-caps:normal;font-variant-numeric:normal;font-variant-east-asian:normal;text-align:start;letter-spacing:3.78102px;text-anchor:start;stroke-width:0.472626"
           x="329.61823"
           y="59.153572"
           id="text351121"
           inkscape:label="health"><tspan
             id="tspan351119"
             style="font-style:normal;font-variant:normal;font-weight:bold;font-stretch:normal;font-size:40.3309px;font-family:'Liberation Sans';-inkscape-font-specification:'Liberation Sans, Bold';font-variant-ligatures:normal;font-variant-caps:normal;font-variant-numeric:normal;font-variant-east-asian:normal;text-align:start;text-anchor:start;stroke-width:0.472626"
             x="329.61823"
             y="59.153572">Health</tspan></text>
      </g>
      <text
         xml:space="preserve"
         style="font-size:16.9333px;line-height:1.25;font-family:sans-serif;text-align:end;letter-spacing:2.11667px;text-anchor:end;white-space:pre;inline-size:149.753;display:none;stroke-width:0.264583"
         x="332.76135"
         y="66.378883"
         id="text358647"
         transform="translate(14.491869,-102.21023)"
         inkscape:label="optimized" />
    </g>
    <text
       xml:space="preserve"
       style="font-style:normal;font-weight:normal;font-size:10.5833px;line-height:1.25;font-family:sans-serif;fill:#000000;fill-opacity:1;stroke:none;stroke-width:0.264583"
       x="227.59494"
       y="-195.3421"
       id="text27991"
       inkscape:label="tagline hint"><tspan
         sodipodi:role="line"
         id="tspan27989"
         style="font-style:italic;font-variant:normal;font-weight:normal;font-stretch:normal;font-size:16.9333px;font-family:sans-serif;-inkscape-font-specification:'sans-serif, Italic';font-variant-ligatures:normal;font-variant-caps:normal;font-variant-numeric:normal;font-variant-east-asian:normal;stroke-width:0.264583"
         x="227.59494"
         y="-195.3421">tagline: italic 48px</tspan></text>
    <text
       xml:space="preserve"
       style="font-size:22.5778px;line-height:1.25;font-family:sans-serif;stroke-width:0.264583"
       x="98.685005"
       y="-261.25549"
       id="text414120"
       inkscape:label="font hint"><tspan
         id="tspan414118"
         style="stroke-width:0.264583"
         x="98.685005"
         y="-261.25549">font: Liberation Sans 64px</tspan><tspan
         style="stroke-width:0.264583"
         x="98.685005"
         y="-233.03323"
         id="tspan414122">letter spacing 8px</tspan></text>
    <rect
       style="fill:none;fill-opacity:1;stroke:#000000;stroke-width:6.2955;stroke-linecap:round;stroke-miterlimit:4;stroke-dasharray:none;stroke-opacity:1"
       id="rect255711-6-2"
       width="53.809948"
       height="55.092403"
       x="-22.778719"
       y="-470.49612"
       inkscape:label="square" />
    <rect
       style="fill:none;fill-opacity:1;stroke:#000000;stroke-width:1.263;stroke-linecap:round;stroke-miterlimit:4;stroke-dasharray:none;stroke-opacity:1"
       id="rect255856-4-2"
       width="62.646889"
       height="48.999794"
       x="177.99452"
       y="-455.03967"
       inkscape:label="out-white" />
    <path
       style="fill:url(#radialGradient47633-9-0-0);fill-opacity:1;stroke-width:0.148413"
       d="m -247.89022,-329.73421 c 0.0835,0.10855 0.88989,1.47459 1.79205,3.03564 0.90218,1.56102 1.72312,2.82148 1.82437,2.80096 0.10126,-0.0204 0.34657,-0.30193 0.54514,-0.62538 0.30771,-0.50125 0.35993,-0.873 0.35334,-2.51691 l -0.008,-1.92883 1.10086,-0.0747 1.69172,-0.0748 h 0.5909 l 0.11737,0.80741 c 0.42139,2.89822 -0.39197,5.11544 -2.32821,6.34667 l -0.81064,0.5155 2.18331,3.72389 c 1.20083,2.04814 2.13882,3.77917 2.04375,3.80272 l -2.87536,0.71252 c -0.14267,0.0354 -0.96545,-1.23556 -2.14393,-3.2595 -1.04394,-1.79273 -1.96095,-3.3059 -2.03784,-3.36262 -0.24006,-0.17712 -1.25151,0.87215 -1.40605,1.45867 -0.19838,0.75286 -0.10609,2.4748 0.20296,3.78788 0.13938,0.5921 0.23292,1.09136 0.2079,1.10944 l -3.35254,0.34452 c -0.10702,0.0111 -0.56989,-2.33029 -0.7032,-3.25094 -0.16254,-1.12242 0.18789,-2.70128 0.78203,-3.52333 0.26643,-0.36869 1.02075,-1.03025 1.70765,-1.4977 l 1.2304,-0.8373 -2.00301,-3.40005 c -1.10167,-1.87003 -1.93883,-3.43951 -1.86035,-3.48769 0.0786,-0.0482 0.78642,-0.24872 1.57322,-0.44556 1.28748,-0.32214 1.44567,-0.33818 1.58227,-0.16053 z"
       id="path46465-1-6-2"
       inkscape:label="X" />
    <g
       id="g46463-5-0"
       style="fill:url(#radialGradient47631-4-9);fill-opacity:1"
       transform="matrix(0.23706659,0,0,0.20161103,4.1588431,555.58312)"
       inkscape:label="Ph">
      <g
         id="g94772-2"
         transform="matrix(4.2376896,0,0,4.2376896,-185.41666,-22.176244)"
         style="fill:url(#radialGradient95345)">
        <path
           style="fill:url(#radialGradient47633-9-2);fill-opacity:1;stroke-width:0.266008"
           d="m 301.27122,26.635792 c 0.13522,0.21518 1.44219,2.923016 2.90424,6.017398 1.4621,3.094347 2.79252,5.592891 2.95661,5.552218 0.16416,-0.04048 0.56167,-0.598509 0.88347,-1.239653 0.49868,-0.993613 0.5833,-1.730515 0.57264,-4.98916 l -0.0143,-3.823431 1.78407,-0.148085 2.74162,-0.14821 h 0.95764 l 0.19021,1.600486 c 0.6829,5.745021 -0.63523,10.140107 -3.77315,12.580705 l -1.31374,1.021842 3.53832,7.381708 c 1.94609,4.059927 3.4662,7.491276 3.31213,7.537956 l -4.65986,1.412395 c -0.23122,0.07008 -1.56461,-2.449195 -3.47449,-6.46115 -1.69183,-3.553641 -3.17795,-6.553138 -3.30256,-6.665577 -0.38904,-0.351095 -2.02823,1.728828 -2.27868,2.891454 -0.3215,1.492368 -0.17185,4.905695 0.32893,7.508553 0.22587,1.173698 0.37746,2.163347 0.33691,2.199191 l -5.43319,0.682916 c -0.17345,0.02199 -0.92356,-4.619218 -1.13961,-6.44419 -0.26343,-2.224907 0.30451,-5.354626 1.26736,-6.984125 0.43179,-0.730852 1.65425,-2.042233 2.76746,-2.968835 l 1.99401,-1.659728 -3.24612,-6.739774 c -1.78538,-3.706871 -3.14212,-6.81798 -3.01491,-6.913498 0.12736,-0.09557 1.27447,-0.493018 2.54959,-0.883219 2.08651,-0.638551 2.34288,-0.670352 2.56424,-0.318198 z"
           id="path46465-1-8" />
        <text
           xml:space="preserve"
           style="font-style:normal;font-variant:normal;font-weight:bold;font-stretch:normal;font-size:40.3309px;line-height:1.25;font-family:'Liberation Sans';-inkscape-font-specification:'Liberation Sans, Bold';font-variant-ligatures:normal;font-variant-caps:normal;font-variant-numeric:normal;font-variant-east-asian:normal;letter-spacing:3.78102px;fill:url(#radialGradient95341);stroke-width:0.472626"
           x="114.22296"
           y="59.153572"
           id="text339989-3"><tspan
             id="tspan339987-8"
             style="font-style:normal;font-variant:normal;font-weight:bold;font-stretch:normal;font-size:40.3309px;font-family:'Liberation Sans';-inkscape-font-specification:'Liberation Sans, Bold';font-variant-ligatures:normal;font-variant-caps:normal;font-variant-numeric:normal;font-variant-east-asian:normal;fill:url(#radialGradient95341);stroke-width:0.472626"
             x="114.22296"
             y="59.153572"
             dx="0">Phenom</tspan></text>
        <text
           xml:space="preserve"
           style="font-style:italic;font-variant:normal;font-weight:normal;font-stretch:normal;font-size:30.2481px;line-height:1.25;font-family:'Liberation Sans';-inkscape-font-specification:'Liberation Sans, Italic';font-variant-ligatures:normal;font-variant-caps:normal;font-variant-numeric:normal;font-variant-east-asian:normal;text-align:start;letter-spacing:3.78102px;text-anchor:start;fill:url(#radialGradient95343);stroke-width:0.472626"
           x="329.61823"
           y="59.153572"
           id="text351121-0"
           inkscape:label="health"><tspan
             id="tspan351119-4"
             style="font-style:normal;font-variant:normal;font-weight:bold;font-stretch:normal;font-size:40.3309px;font-family:'Liberation Sans';-inkscape-font-specification:'Liberation Sans, Bold';font-variant-ligatures:normal;font-variant-caps:normal;font-variant-numeric:normal;font-variant-east-asian:normal;text-align:start;text-anchor:start;fill:url(#radialGradient95343);stroke-width:0.472626"
             x="329.61823"
             y="59.153572">Health</tspan></text>
      </g>
      <path
         id="path46459-5-5"
         style="fill:url(#radialGradient47627-4-6);fill-opacity:1;stroke-width:0.664667"
         d="m 142.66406,140.47796 v 131.8926 l -0.0968,4.69447 25.08122,0.11884 c 0,0 0.77322,-3.62675 0.38993,-6.13771 -0.0933,-5.96656 -0.0125,-11.93496 -0.0384,-17.9023 -0.0126,-9.34486 0.0396,-18.69143 -0.0697,-28.03512 -0.33987,-6.9867 1.64838,-14.27301 6.29393,-19.6311 2.51437,-2.8064 6.05614,-4.73291 9.84711,-5.05317 2.44182,-0.46102 5.10504,-0.54772 7.34367,0.69308 3.91989,2.05291 6.25987,6.17374 7.3839,10.302 0.92412,3.52098 0.75088,7.186 0.99609,10.78655 0.64154,16.27734 -0.10193,32.69773 0.23372,49.03102 0.0596,0.57601 0,5.96405 0,5.96405 l 25.56618,-0.19457 c 0,0 0.26029,-3.49933 -0.11479,-5.95844 -0.14807,-5.03366 -0.0994,-10.07178 -0.1736,-15.10722 -0.10957,-14.12356 -0.26663,-28.24789 -0.32403,-42.37115 0.561,-11.3727 -4.69879,-22.86431 -13.64999,-29.95711 -4.32629,-3.38155 -9.68036,-5.89632 -15.10262,-6.06401 -6.15356,-0.1903 -12.83816,2.17999 -17.53198,5.80962 -4.69382,3.62963 -8.69428,9.49403 -10.76759,13.91819 -0.0263,-15.11981 0.0619,-43.65202 0.0346,-58.77183 l -25.30078,-0.0632 v 2.03655 z" />
      <path
         id="path46461-4-5"
         style="fill:url(#radialGradient47629-2-1);fill-opacity:1;stroke-width:0.683592"
         d="m 79.613281,138.25817 c -7.94877,0.11843 -16.012095,0.5059 -23.890625,0.29365 -1.663163,-0.035 -3.327189,-0.15386 -4.980468,-0.19919 -1.290619,0.081 -2.243724,1.40835 -2.078126,2.73451 0,45.16757 10e-7,90.33514 0,135.5027 8.889323,0 17.778646,0 26.667969,0 0,-15.65699 0,-31.314 0,-46.97099 10.023585,-0.009 20.261698,-0.43626 29.813619,-3.94053 5.60299,-2.05561 10.77883,-5.34513 15.14856,-9.56119 6.2286,-5.04849 10.09986,-12.72901 11.90862,-20.66621 1.27989,-5.49788 1.91015,-11.17289 1.85713,-16.83086 -0.82581,-15.04062 -9.72434,-29.40813 -22.7229,-35.88401 -3.91668,-1.97657 -8.218,-2.84964 -12.49331,-3.45727 -6.367974,-0.92461 -12.810277,-1.0785 -19.230469,-1.02061 z m 8.41211,25.37169 c 4.662791,0.0761 9.632112,0.41293 13.634599,3.20401 3.89146,2.79174 5.87979,7.68748 6.54296,12.45115 0.78071,5.37267 0.17023,11.23267 -2.80409,15.80308 -2.56621,3.75846 -6.741654,5.92768 -10.985723,6.77461 -6.274892,1.33639 -12.716707,1.13784 -19.085012,1.14615 -0.01634,-12.9553 0.03192,-25.91059 0.109375,-38.86561 2.989415,-0.1492 6.098474,-0.35319 9.011719,-0.44768 1.191888,-0.0367 2.383786,-0.0588 3.576172,-0.0657 z" />
    </g>
    <path
       style="color:#000000;fill:#000000;stroke-linecap:round;-inkscape-stroke:none"
       d="m -46.003906,-303.39258 v 61.38867 h 60.105469 v -61.38867 z m 6.296875,6.29492 H 7.8066406 v 48.79688 H -39.707031 Z"
       id="rect255711-6-2-9"
       sodipodi:nodetypes="cccccccccc" />
    <ellipse
       style="opacity:0.83;fill:#ee7d58;fill-opacity:1;stroke:#000000;stroke-width:1.43898;stroke-miterlimit:4;stroke-dasharray:none;stroke-opacity:1"
       id="path97861"
       cx="2.9356637"
       cy="-243.21931"
       rx="42.609493"
       ry="18.746107" />
    <g
       id="g46463-5-9"
       style="fill:url(#radialGradient47631-4-6);fill-opacity:1"
       transform="matrix(0.26458333,0,0,0.26458333,-29.770919,-315.40716)"
       inkscape:label="Ph">
      <path
         id="path46459-5-9"
         style="fill:url(#radialGradient47627-4-4);fill-opacity:1;stroke-width:0.664667"
         d="m 142.66406,140.47796 v 131.8926 l -0.0968,4.69447 25.08122,0.11884 c 0,0 0.77322,-3.62675 0.38993,-6.13771 -0.0933,-5.96656 -0.0125,-11.93496 -0.0384,-17.9023 -0.0126,-9.34486 0.0396,-18.69143 -0.0697,-28.03512 -0.33987,-6.9867 1.64838,-14.27301 6.29393,-19.6311 2.51437,-2.8064 6.05614,-4.73291 9.84711,-5.05317 2.44182,-0.46102 5.10504,-0.54772 7.34367,0.69308 3.91989,2.05291 6.25987,6.17374 7.3839,10.302 0.92412,3.52098 0.75088,7.186 0.99609,10.78655 0.64154,16.27734 -0.10193,32.69773 0.23372,49.03102 0.0596,0.57601 0,5.96405 0,5.96405 l 25.56618,-0.19457 c 0,0 0.26029,-3.49933 -0.11479,-5.95844 -0.14807,-5.03366 -0.0994,-10.07178 -0.1736,-15.10722 -0.10957,-14.12356 -0.26663,-28.24789 -0.32403,-42.37115 0.561,-11.3727 -4.69879,-22.86431 -13.64999,-29.95711 -4.32629,-3.38155 -9.68036,-5.89632 -15.10262,-6.06401 -6.15356,-0.1903 -12.83816,2.17999 -17.53198,5.80962 -4.69382,3.62963 -8.69428,9.49403 -10.76759,13.91819 -0.0263,-15.11981 0.0619,-43.65202 0.0346,-58.77183 l -25.30078,-0.0632 v 2.03655 z" />
      <path
         id="path46461-4-3"
         style="fill:url(#radialGradient47629-2-4);fill-opacity:1;stroke-width:0.683592"
         d="m 79.613281,138.25817 c -7.94877,0.11843 -16.012095,0.5059 -23.890625,0.29365 -1.663163,-0.035 -3.327189,-0.15386 -4.980468,-0.19919 -1.290619,0.081 -2.243724,1.40835 -2.078126,2.73451 0,45.16757 10e-7,90.33514 0,135.5027 8.889323,0 17.778646,0 26.667969,0 0,-15.65699 0,-31.314 0,-46.97099 10.023585,-0.009 20.261698,-0.43626 29.813619,-3.94053 5.60299,-2.05561 10.77883,-5.34513 15.14856,-9.56119 6.2286,-5.04849 10.09986,-12.72901 11.90862,-20.66621 1.27989,-5.49788 1.91015,-11.17289 1.85713,-16.83086 -0.82581,-15.04062 -9.72434,-29.40813 -22.7229,-35.88401 -3.91668,-1.97657 -8.218,-2.84964 -12.49331,-3.45727 -6.367974,-0.92461 -12.810277,-1.0785 -19.230469,-1.02061 z m 8.41211,25.37169 c 4.662791,0.0761 9.632112,0.41293 13.634599,3.20401 3.89146,2.79174 5.87979,7.68748 6.54296,12.45115 0.78071,5.37267 0.17023,11.23267 -2.80409,15.80308 -2.56621,3.75846 -6.741654,5.92768 -10.985723,6.77461 -6.274892,1.33639 -12.716707,1.13784 -19.085012,1.14615 -0.01634,-12.9553 0.03192,-25.91059 0.109375,-38.86561 2.989415,-0.1492 6.098474,-0.35319 9.011719,-0.44768 1.191888,-0.0367 2.383786,-0.0588 3.576172,-0.0657 z" />
    </g>
    <g
       id="g94772-2-3"
       transform="matrix(1.0046146,0,0,0.85436497,-7.3922603,-188.65726)"
       style="fill:url(#radialGradient95345-0);fill-opacity:1">
      <path
         style="fill:url(#radialGradient47633-9-2-2);fill-opacity:1;stroke-width:0.266008"
         d="m 229.60066,41.11191 c 0.13522,0.21518 1.44219,2.923016 2.90424,6.017398 1.4621,3.094347 2.79252,5.592891 2.95661,5.552218 0.16416,-0.04048 0.56167,-0.598509 0.88347,-1.239653 0.49868,-0.993613 0.5833,-1.730515 0.57264,-4.98916 l -0.0143,-3.823431 1.78407,-0.148085 2.74162,-0.14821 h 0.95764 l 0.19021,1.600486 c 0.6829,5.745021 -0.63523,10.140107 -3.77315,12.580705 l -1.31374,1.021842 3.53832,7.381708 c 1.94609,4.059927 3.4662,7.491276 3.31213,7.537956 l -4.65986,1.412395 c -0.23122,0.07008 -1.56461,-2.449195 -3.47449,-6.46115 -1.69183,-3.553641 -3.17795,-6.553138 -3.30256,-6.665577 -0.38904,-0.351095 -2.02823,1.728828 -2.27868,2.891454 -0.3215,1.492368 -0.17185,4.905695 0.32893,7.508553 0.22587,1.173698 0.37746,2.163347 0.33691,2.199191 l -5.43319,0.682916 c -0.17345,0.02199 -0.92356,-4.619218 -1.13961,-6.44419 -0.26343,-2.224907 0.30451,-5.354626 1.26736,-6.984125 0.43179,-0.730852 1.65425,-2.042233 2.76746,-2.968835 l 1.99401,-1.659728 -3.24612,-6.739774 c -1.78538,-3.706871 -3.14212,-6.81798 -3.01491,-6.913498 0.12736,-0.09557 1.27447,-0.493018 2.54959,-0.883219 2.08651,-0.638551 2.34288,-0.670352 2.56424,-0.318198 z"
         id="path46465-1-8-1" />
      <text
         xml:space="preserve"
         style="font-style:normal;font-variant:normal;font-weight:bold;font-stretch:normal;font-size:40.3309px;line-height:1.25;font-family:'Liberation Sans';-inkscape-font-specification:'Liberation Sans, Bold';font-variant-ligatures:normal;font-variant-caps:normal;font-variant-numeric:normal;font-variant-east-asian:normal;letter-spacing:3.78102px;fill:url(#radialGradient95341-9);stroke-width:0.472626"
         x="101.81389"
         y="71.915764"
         id="text339989-3-4"><tspan
           id="tspan339987-8-6"
           style="font-style:normal;font-variant:normal;font-weight:bold;font-stretch:normal;font-size:40.3309px;font-family:'Liberation Sans';-inkscape-font-specification:'Liberation Sans, Bold';font-variant-ligatures:normal;font-variant-caps:normal;font-variant-numeric:normal;font-variant-east-asian:normal;fill:url(#radialGradient95341-9);stroke-width:0.472626"
           x="101.81389"
           y="71.915764">enom</tspan></text>
      <text
         xml:space="preserve"
         style="font-style:italic;font-variant:normal;font-weight:normal;font-stretch:normal;font-size:30.2481px;line-height:1.25;font-family:'Liberation Sans';-inkscape-font-specification:'Liberation Sans, Italic';font-variant-ligatures:normal;font-variant-caps:normal;font-variant-numeric:normal;font-variant-east-asian:normal;text-align:start;letter-spacing:3.78102px;text-anchor:start;fill:url(#radialGradient95343-4);stroke-width:0.472626"
         x="265.27902"
         y="74.214058"
         id="text351121-0-9"
         inkscape:label="health"><tspan
           id="tspan351119-4-4"
           style="font-style:normal;font-variant:normal;font-weight:bold;font-stretch:normal;font-size:40.3309px;font-family:'Liberation Sans';-inkscape-font-specification:'Liberation Sans, Bold';font-variant-ligatures:normal;font-variant-caps:normal;font-variant-numeric:normal;font-variant-east-asian:normal;text-align:start;text-anchor:start;fill:url(#radialGradient95343-4);stroke-width:0.472626"
           x="265.27902"
           y="74.214058">Health</tspan></text>
    </g>
    <g
       id="g94772-2-3-1"
       transform="matrix(1.0046146,0,0,0.85436497,20.462618,268.97328)"
       style="fill:url(#radialGradient95345-0-8);fill-opacity:1">
      <path
         id="path46465-1-8-1-5"
         style="fill:url(#radialGradient47633-9-2-2-17);fill-opacity:1;stroke-width:0.266008"
         d="m 229.08008,41.46875 c -1.33102,0.291409 -2.62641,0.736589 -3.91406,1.179688 1.88178,4.58671 4.17334,8.991715 6.28906,13.472656 -1.83341,1.598494 -3.89176,2.945712 -5.14453,5.070312 -1.13526,2.486374 -1.31796,5.331151 -0.79462,7.994811 0.22375,1.407507 0.42579,2.820047 0.73407,4.212221 1.47331,-0.185547 2.94661,-0.371094 4.41992,-0.556641 -0.55317,-3.074297 -1.08094,-6.241447 -0.5957,-9.359375 0.39244,-1.258586 1.17229,-2.468461 2.26172,-3.226563 0.61261,-0.401665 1.1849,0.17357 1.36844,0.741338 2.09445,4.005868 3.82246,8.201809 6.07101,12.12585 0.4765,0.135795 1.14793,-0.313402 1.69744,-0.396705 0.69788,-0.242769 1.54866,-0.406474 2.15412,-0.697045 -2.07794,-4.940489 -4.55331,-9.783249 -6.85156,-14.662109 1.54429,-1.160042 3.17943,-2.347554 4.02196,-4.151102 1.63375,-3.166011 1.55644,-6.872956 1.08351,-10.313742 -1.47027,0.03523 -2.94058,0.127066 -4.40625,0.251953 -0.0485,2.419792 0.16549,4.861598 -0.17188,7.265625 -0.25477,1.022062 -0.71833,2.112401 -1.57031,2.763672 -0.62396,0.368584 -1.01719,-0.530178 -1.28977,-0.974225 -1.93248,-3.497801 -3.50064,-7.177897 -5.30007,-10.744525 z" />
      <text
         xml:space="preserve"
         style="font-style:normal;font-variant:normal;font-weight:bold;font-stretch:normal;font-size:40.3309px;line-height:1.25;font-family:'Liberation Sans';-inkscape-font-specification:'Liberation Sans, Bold';font-variant-ligatures:normal;font-variant-caps:normal;font-variant-numeric:normal;font-variant-east-asian:normal;letter-spacing:3.78102px;fill:url(#radialGradient95341-9-8);stroke-width:0.472626"
         x="101.81389"
         y="71.915764"
         id="text339989-3-4-4"><tspan
           id="tspan339987-8-6-9"
           style="font-style:normal;font-variant:normal;font-weight:bold;font-stretch:normal;font-size:40.3309px;font-family:'Liberation Sans';-inkscape-font-specification:'Liberation Sans, Bold';font-variant-ligatures:normal;font-variant-caps:normal;font-variant-numeric:normal;font-variant-east-asian:normal;fill:url(#radialGradient95341-9-8);stroke-width:0.472626"
           x="101.81389"
           y="71.915764">enom</tspan></text>
      <text
         xml:space="preserve"
         style="font-style:italic;font-variant:normal;font-weight:normal;font-stretch:normal;font-size:30.2481px;line-height:1.25;font-family:'Liberation Sans';-inkscape-font-specification:'Liberation Sans, Italic';font-variant-ligatures:normal;font-variant-caps:normal;font-variant-numeric:normal;font-variant-east-asian:normal;text-align:start;letter-spacing:3.78102px;text-anchor:start;fill:url(#radialGradient95343-4-9);stroke-width:0.472626"
         x="265.27902"
         y="74.214058"
         id="text351121-0-9-2"
         inkscape:label="health"><tspan
           id="tspan351119-4-4-5"
           style="font-style:normal;font-variant:normal;font-weight:bold;font-stretch:normal;font-size:40.3309px;font-family:'Liberation Sans';-inkscape-font-specification:'Liberation Sans, Bold';font-variant-ligatures:normal;font-variant-caps:normal;font-variant-numeric:normal;font-variant-east-asian:normal;text-align:start;text-anchor:start;fill:url(#radialGradient95343-4-9);stroke-width:0.472626"
           x="265.27902"
           y="74.214058">Health</tspan></text>
    </g>
    <g
       id="g110583"
       style="fill:url(#radialGradient110689);fill-opacity:1"
       transform="matrix(0.23706659,0,0,0.20161103,36.563835,-184.18628)">
      <path
         id="rect255711-6-17"
         style="color:#000000;fill:#000000;stroke-width:1;stroke-linecap:round;-inkscape-stroke:none"
         d="m 16.336925,-189.74684 v 61.38641 h 17.83043 l 4.7625,-6.29471 h -16.29564 v -48.79702 h 47.51337 v 21.0597 l 6.2947,-3.175 v -24.17938 z"
         sodipodi:nodetypes="ccccccccccc"
         transform="matrix(4.2182241,0,0,4.9600461,-154.23445,913.57244)" />
      <path
         id="path46459-5-5-2"
         style="fill:url(#radialGradient47627-4-6-3);fill-opacity:1;stroke-width:0.664667"
         d="m 142.66406,140.47796 v 131.8926 l -0.0968,4.69447 25.08122,0.11884 c 0,0 0.77322,-3.62675 0.38993,-6.13771 -0.0933,-5.96656 -0.0125,-11.93496 -0.0384,-17.9023 -0.0126,-9.34486 0.0396,-18.69143 -0.0697,-28.03512 -0.33987,-6.9867 1.64838,-14.27301 6.29393,-19.6311 2.51437,-2.8064 6.05614,-4.73291 9.84711,-5.05317 2.44182,-0.46102 5.10504,-0.54772 7.34367,0.69308 3.91989,2.05291 6.25987,6.17374 7.3839,10.302 0.92412,3.52098 0.75088,7.186 0.99609,10.78655 0.64154,16.27734 -0.10193,32.69773 0.23372,49.03102 0.0596,0.57601 0,5.96405 0,5.96405 l 25.56618,-0.19457 c 0,0 0.26029,-3.49933 -0.11479,-5.95844 -0.14807,-5.03366 -0.0994,-10.07178 -0.1736,-15.10722 -0.10957,-14.12356 -0.26663,-28.24789 -0.32403,-42.37115 0.561,-11.3727 -4.69879,-22.86431 -13.64999,-29.95711 -4.32629,-3.38155 -9.68036,-5.89632 -15.10262,-6.06401 -6.15356,-0.1903 -12.83816,2.17999 -17.53198,5.80962 -4.69382,3.62963 -8.69428,9.49403 -10.76759,13.91819 -0.0263,-15.11981 0.0619,-43.65202 0.0346,-58.77183 l -25.30078,-0.0632 v 2.03655 z" />
      <path
         id="path46461-4-5-2"
         style="fill:url(#radialGradient47629-2-1-5);fill-opacity:1;stroke-width:0.683592"
         d="m 68.452561,138.25817 c -7.94877,0.11843 -16.012095,0.5059 -23.890625,0.29365 -1.663163,-0.035 -3.327189,-0.15386 -4.980468,-0.19919 -1.290619,0.081 -2.243724,1.40835 -2.078126,2.73451 0,45.16757 10e-7,90.33514 0,135.5027 8.889323,0 17.778646,0 26.667969,0 0,-15.65699 0,-31.314 0,-46.97099 10.023585,-0.009 20.261698,-0.43626 29.813627,-3.94053 5.602998,-2.05561 10.778842,-5.34513 15.148572,-9.56119 6.2286,-5.04849 10.09986,-12.72901 11.90862,-20.66621 1.27989,-5.49788 1.91015,-11.17289 1.85713,-16.83086 -0.82581,-15.04062 -9.72434,-29.40813 -22.7229,-35.88401 -3.916688,-1.97657 -8.218016,-2.84964 -12.49333,-3.45727 -6.367974,-0.92461 -12.810277,-1.0785 -19.230469,-1.02061 z m 8.41211,25.37169 c 4.662791,0.0761 9.632112,0.41293 13.634599,3.20401 3.891468,2.79174 5.879802,7.68748 6.542972,12.45115 0.780714,5.37267 0.17023,11.23267 -2.804094,15.80308 -2.566214,3.75846 -6.741662,5.92768 -10.985731,6.77461 -6.274892,1.33639 -12.716707,1.13784 -19.085012,1.14615 -0.01634,-12.9553 0.03192,-25.91059 0.109375,-38.86561 2.989415,-0.1492 6.098474,-0.35319 9.011719,-0.44768 1.191888,-0.0367 2.383786,-0.0588 3.576172,-0.0657 z" />
    </g>
    <g
       id="g110583-9"
       style="fill:url(#radialGradient47631-4-9-6-0);fill-opacity:1"
       transform="matrix(0.23706659,0,0,0.20161103,-296.25078,-328.94415)">
      <path
         id="rect255711-6-17-0"
         style="color:#000000;fill:#000000;stroke-width:1;stroke-linecap:round;-inkscape-stroke:none"
         d="m 16.336925,-189.74684 v 61.38641 h 17.83043 l 4.7625,-6.29471 h -16.29564 v -48.79702 h 47.51337 v 21.0597 l 6.2947,-3.175 v -24.17938 z"
         sodipodi:nodetypes="ccccccccccc"
         transform="matrix(4.2182241,0,0,4.9600461,-154.23445,913.57244)" />
      <g
         id="g110847"
         style="fill:url(#radialGradient111705)">
        <path
           id="path46459-5-5-2-6"
           style="fill:url(#radialGradient47627-4-6-3-6);fill-opacity:1;stroke-width:0.664667"
           d="m 142.66406,140.47796 v 131.8926 l -0.0968,4.69447 25.08122,0.11884 c 0,0 0.77322,-3.62675 0.38993,-6.13771 -0.0933,-5.96656 -0.0125,-11.93496 -0.0384,-17.9023 -0.0126,-9.34486 0.0396,-18.69143 -0.0697,-28.03512 -0.33987,-6.9867 1.64838,-14.27301 6.29393,-19.6311 2.51437,-2.8064 6.05614,-4.73291 9.84711,-5.05317 2.44182,-0.46102 5.10504,-0.54772 7.34367,0.69308 3.91989,2.05291 6.25987,6.17374 7.3839,10.302 0.92412,3.52098 0.75088,7.186 0.99609,10.78655 0.64154,16.27734 -0.10193,32.69773 0.23372,49.03102 0.0596,0.57601 0,5.96405 0,5.96405 l 25.56618,-0.19457 c 0,0 0.26029,-3.49933 -0.11479,-5.95844 -0.14807,-5.03366 -0.0994,-10.07178 -0.1736,-15.10722 -0.10957,-14.12356 -0.26663,-28.24789 -0.32403,-42.37115 0.561,-11.3727 -4.69879,-22.86431 -13.64999,-29.95711 -4.32629,-3.38155 -9.68036,-5.89632 -15.10262,-6.06401 -6.15356,-0.1903 -12.83816,2.17999 -17.53198,5.80962 -4.69382,3.62963 -8.69428,9.49403 -10.76759,13.91819 -0.0263,-15.11981 0.0619,-43.65202 0.0346,-58.77183 l -25.30078,-0.0632 v 2.03655 z" />
        <path
           id="path46461-4-5-2-8"
           style="fill:url(#radialGradient47629-2-1-5-8);fill-opacity:1;stroke-width:0.683592"
           d="m 79.613281,138.25817 c -7.94877,0.11843 -16.012095,0.5059 -23.890625,0.29365 -1.663163,-0.035 -3.327189,-0.15386 -4.980468,-0.19919 -1.290619,0.081 -2.243724,1.40835 -2.078126,2.73451 0,45.16757 10e-7,90.33514 0,135.5027 8.889323,0 17.778646,0 26.667969,0 0,-15.65699 0,-31.314 0,-46.97099 10.023585,-0.009 20.261698,-0.43626 29.813619,-3.94053 5.60299,-2.05561 10.77883,-5.34513 15.14856,-9.56119 6.2286,-5.04849 10.09986,-12.72901 11.90862,-20.66621 1.27989,-5.49788 1.91015,-11.17289 1.85713,-16.83086 -0.82581,-15.04062 -9.72434,-29.40813 -22.7229,-35.88401 -3.91668,-1.97657 -8.218,-2.84964 -12.49331,-3.45727 -6.367974,-0.92461 -12.810277,-1.0785 -19.230469,-1.02061 z m 8.41211,25.37169 c 4.662791,0.0761 9.632112,0.41293 13.634599,3.20401 3.89146,2.79174 5.87979,7.68748 6.54296,12.45115 0.78071,5.37267 0.17023,11.23267 -2.80409,15.80308 -2.56621,3.75846 -6.741654,5.92768 -10.985723,6.77461 -6.274892,1.33639 -12.716707,1.13784 -19.085012,1.14615 -0.01634,-12.9553 0.03192,-25.91059 0.109375,-38.86561 2.989415,-0.1492 6.098474,-0.35319 9.011719,-0.44768 1.191888,-0.0367 2.383786,-0.0588 3.576172,-0.0657 z" />
      </g>
    </g>
    <g
       id="g110847-6"
       style="fill:url(#radialGradient47631-4-9-6-0-6);fill-opacity:1"
       transform="matrix(0.23706659,0,0,0.20161103,32.998091,-88.525072)">
      <path
         id="path46459-5-5-2-6-0"
         style="fill:url(#radialGradient47627-4-6-3-6-7);fill-opacity:1;stroke-width:0.664667"
         d="m 150.60057,140.47796 v 131.8926 l -0.0968,4.69447 25.08122,0.11884 c 0,0 0.77322,-3.62675 0.38993,-6.13771 -0.0933,-5.96656 -0.0125,-11.93496 -0.0384,-17.9023 -0.0126,-9.34486 0.0396,-18.69143 -0.0697,-28.03512 -0.33987,-6.9867 1.64838,-14.27301 6.29393,-19.6311 2.51437,-2.8064 6.05614,-4.73291 9.84711,-5.05317 2.44182,-0.46102 5.10504,-0.54772 7.34367,0.69308 3.91989,2.05291 6.25987,6.17374 7.3839,10.302 0.92412,3.52098 0.75088,7.186 0.99609,10.78655 0.64154,16.27734 -0.10193,32.69773 0.23372,49.03102 0.0596,0.57601 0,5.96405 0,5.96405 l 25.56618,-0.19457 c 0,0 0.26029,-3.49933 -0.11479,-5.95844 -0.14807,-5.03366 -0.0994,-10.07178 -0.1736,-15.10722 -0.10957,-14.12356 -0.26663,-28.24789 -0.32403,-42.37115 0.561,-11.3727 -4.69879,-22.86431 -13.64999,-29.95711 -4.32629,-3.38155 -9.68036,-5.89632 -15.10262,-6.06401 -6.15356,-0.1903 -12.83816,2.17999 -17.53198,5.80962 -4.69382,3.62963 -8.69428,9.49403 -10.76759,13.91819 -0.0263,-15.11981 0.0619,-43.65202 0.0346,-58.77183 l -25.30078,-0.0632 v 2.03655 z" />
      <path
         style="fill:url(#radialGradient47633-9-2-2-1);fill-opacity:1;stroke-width:1.23385"
         d="m 275.82879,135.15017 c 0.6801,0.92041 7.25379,12.50312 14.60751,25.73927 7.35392,13.236 14.04557,23.92347 14.87091,23.74949 0.82569,-0.17323 2.82503,-2.56013 4.44362,-5.30261 2.50822,-4.25011 2.93383,-7.40223 2.88021,-21.34101 l -0.0721,-16.35466 8.97336,-0.63339 13.78958,-0.63399 h 4.81667 l 0.95671,6.84605 c 3.43479,24.57418 -3.19502,43.37408 -18.97788,53.81368 l -6.60774,4.37093 17.79678,31.57509 c 9.78829,17.36625 17.43399,32.0438 16.65907,32.24347 l -23.43778,6.04148 c -1.16299,0.2999 -7.86955,-10.47639 -17.47575,-27.63743 -8.5094,-15.20064 -15.98418,-28.0309 -16.61096,-28.51189 -1.95674,-1.50178 -10.20143,7.39503 -11.4611,12.36815 -1.61709,6.38359 -0.86439,20.98399 1.65444,32.11766 1.13605,5.02048 1.89851,9.25368 1.69454,9.40703 l -27.32743,2.92116 c -0.8724,0.0941 -4.64524,-19.75861 -5.73192,-27.56488 -1.325,-9.51703 1.53157,-22.90433 6.37447,-29.87449 2.17177,-3.12619 8.3204,-8.7356 13.91955,-12.69909 l 10.02931,-7.09948 -16.32708,-28.82926 c -8.97997,-15.85606 -15.80399,-29.16375 -15.16415,-29.57234 0.6406,-0.40904 6.41023,-2.10884 12.8237,-3.77795 10.49458,-2.73136 11.78403,-2.86739 12.89745,-1.36104 z"
         id="path46465-1-8-1-8" />
      <path
         id="path46461-4-5-2-8-4"
         style="fill:url(#radialGradient47629-2-1-5-8-9);fill-opacity:1;stroke-width:0.683592"
         d="m 79.613295,138.25817 c -7.94877,0.11843 -16.012095,0.5059 -23.890625,0.29365 -1.663163,-0.035 -3.327189,-0.15386 -4.980468,-0.19919 -1.290619,0.081 -2.243724,1.40835 -2.078126,2.73451 0,45.16757 10e-7,90.33514 0,135.5027 8.889323,0 17.778646,0 26.667969,0 0,-15.65699 0,-31.314 0,-46.97099 10.023585,-0.009 20.261698,-0.43626 29.813615,-3.94053 5.60299,-2.05561 10.77883,-5.34513 15.14856,-9.56119 6.2286,-5.04849 10.09986,-12.72901 11.90862,-20.66621 1.27989,-5.49788 1.91015,-11.17289 1.85713,-16.83086 -0.82581,-15.04062 -9.72434,-29.40813 -22.7229,-35.88401 -3.91668,-1.97657 -8.218,-2.84964 -12.493306,-3.45727 -6.367974,-0.92461 -12.810277,-1.0785 -19.230469,-1.02061 z m 8.41211,25.37169 c 4.662791,0.0761 9.632112,0.41293 13.634595,3.20401 3.89146,2.79174 5.87979,7.68748 6.54296,12.45115 0.78071,5.37267 0.17023,11.23267 -2.80409,15.80308 -2.56621,3.75846 -6.74165,5.92768 -10.985719,6.77461 -6.274892,1.33639 -12.716707,1.13784 -19.085012,1.14615 -0.01634,-12.9553 0.03192,-25.91059 0.109375,-38.86561 2.989415,-0.1492 6.098474,-0.35319 9.011719,-0.44768 1.191888,-0.0367 2.383786,-0.0588 3.576172,-0.0657 z" />
    </g>
    <g
       id="g110847-6-9"
       style="fill:url(#radialGradient47631-4-9-6-0-6-0);fill-opacity:1"
       transform="matrix(0.23706659,0,0,0.20161103,6.0160036,272.05509)">
      <path
         id="path46459-5-5-2-6-0-3"
         style="fill:url(#radialGradient47627-4-6-3-6-7-2);fill-opacity:1;stroke-width:0.664667"
         d="m 384.51138,151.56158 v 131.8926 l -0.0968,4.69447 25.08122,0.11884 c 0,0 0.77322,-3.62675 0.38993,-6.13771 -0.0933,-5.96656 -0.0125,-11.93496 -0.0384,-17.9023 -0.0126,-9.34486 0.0396,-18.69143 -0.0697,-28.03512 -0.33987,-6.9867 1.64838,-14.27301 6.29393,-19.6311 2.51437,-2.8064 6.05614,-4.73291 9.84711,-5.05317 2.44182,-0.46102 5.10504,-0.54772 7.34367,0.69308 3.91989,2.05291 6.25987,6.17374 7.3839,10.302 0.92412,3.52098 0.75088,7.186 0.99609,10.78655 0.64154,16.27734 -0.10193,32.69773 0.23372,49.03102 0.0596,0.57601 0,5.96405 0,5.96405 l 25.56618,-0.19457 c 0,0 0.26029,-3.49933 -0.11479,-5.95844 -0.14807,-5.03366 -0.0994,-10.07178 -0.1736,-15.10722 -0.10957,-14.12356 -0.26663,-28.24789 -0.32403,-42.37115 0.561,-11.3727 -4.69879,-22.86431 -13.64999,-29.95711 -4.32629,-3.38155 -9.68036,-5.89632 -15.10262,-6.06401 -6.15356,-0.1903 -12.83816,2.17999 -17.53198,5.80962 -4.69382,3.62963 -8.69428,9.49403 -10.76759,13.91819 -0.0263,-15.11981 0.0619,-43.65202 0.0346,-58.77183 l -25.30078,-0.0632 v 2.03655 z" />
      <path
         id="path46465-1-8-1-8-9"
         style="fill:url(#radialGradient47633-9-2-2-1-4);fill-opacity:1;stroke-width:1.23385"
         d="m 133.77344,147.70312 c -1.83641,2.92836 -3.518,6.03643 -5.2339,9.01601 -6.70357,11.71562 -12.95398,23.69966 -20.20534,35.09325 -1.312,1.93545 -2.48222,4.02164 -4.18381,5.64856 -0.59332,0.52969 -1.43979,0.79953 -2.2122,0.6839 -2.066477,-0.58252 -3.324033,-2.49835 -4.565405,-4.10792 -2.083128,-2.86601 -3.712613,-6.13669 -4.172199,-9.68334 -0.757082,-5.35811 -0.558318,-10.78949 -0.596984,-16.18521 0.0195,-4.39662 0.03901,-8.79324 0.05851,-13.18985 -6.789365,-0.55203 -13.598103,-0.77116 -20.40039,-1.10157 -0.88086,0 -1.761719,0 -2.642578,0 -0.849857,5.75481 -1.620025,11.54738 -1.519532,17.37813 0.0861,9.47528 2.10423,19.17148 7.27737,27.22881 3.212349,5.07699 7.677961,9.28849 12.764908,12.45664 2.405252,1.59068 4.811592,3.17971 7.215535,4.77236 -7.82966,13.946 -15.751053,27.84079 -23.516985,41.82235 -3.471915,6.32268 -6.901377,12.59115 -10.081231,19.0473 -0.332857,0.66984 -0.644074,1.35003 -0.962331,2.02684 6.595052,1.69986 13.190104,3.39973 19.785156,5.0996 0.742244,-0.89772 1.396358,-1.86265 2.054688,-2.82226 0.207413,-0.3086 0.641418,-0.97174 0.935547,-1.41602 7.504136,-11.78123 14.017256,-24.15024 21.009981,-36.23355 2.72605,-4.69285 5.37108,-9.44033 8.31618,-14.0004 0.8361,-1.53692 2.85567,-1.99859 4.4004,-1.33245 2.70847,1.12632 4.74358,3.36941 6.66211,5.51172 2.4853,3.00697 4.89899,6.37303 5.42379,10.34288 0.83997,5.55528 0.60523,11.21059 0.17965,16.79267 -0.45575,5.8227 -1.43364,11.59232 -2.75736,17.27797 -0.29198,1.36671 -0.56694,2.73733 -0.80897,4.11382 7.70312,0.82292 15.40625,1.64583 23.10937,2.46875 1.62237,-6.31684 2.75115,-12.7485 3.89598,-19.16549 0.70395,-4.13742 1.50583,-8.30763 1.24562,-12.52619 -0.0349,-0.75696 -0.0789,-1.55804 -0.13947,-2.17944 -0.15483,-1.8552 -0.42297,-3.69968 -0.77557,-5.52732 -0.0895,-0.468 -0.26553,-1.29289 -0.40234,-1.89453 -1.08476,-4.45498 -2.56677,-8.93643 -5.29102,-12.67773 -3.15863,-3.82383 -6.98658,-7.03339 -10.88476,-10.07422 -0.73346,-0.55773 -1.38249,-1.02318 -2.06641,-1.51953 -3.93815,-2.78776 -7.87628,-5.57554 -11.81445,-8.36328 7.11907,-12.61862 14.32317,-25.18963 21.37825,-37.84411 3.56202,-6.52077 7.16962,-13.02844 10.28777,-19.77699 -5.92774,-1.79474 -11.91907,-3.3902 -17.95582,-4.77391 -0.92693,-0.18157 -1.86238,-0.39736 -2.81176,-0.38625 z" />
      <path
         id="path46461-4-5-2-8-4-2"
         style="fill:url(#radialGradient47629-2-1-5-8-9-7);fill-opacity:1;stroke-width:0.683592"
         d="m 313.5241,149.34179 c -7.94877,0.11843 -16.01209,0.5059 -23.89062,0.29365 -1.66317,-0.035 -3.32719,-0.15386 -4.98047,-0.19919 -1.29062,0.081 -2.24373,1.40835 -2.07813,2.73451 0,45.16757 0,90.33514 0,135.5027 8.88933,0 17.77865,0 26.66797,0 0,-15.65699 0,-31.314 0,-46.97099 10.02359,-0.009 20.2617,-0.43626 29.81362,-3.94053 5.60299,-2.05561 10.77883,-5.34513 15.14856,-9.56119 6.2286,-5.04849 10.09986,-12.72901 11.90862,-20.66621 1.27989,-5.49788 1.91015,-11.17289 1.85713,-16.83086 -0.82581,-15.04062 -9.72434,-29.40813 -22.7229,-35.88401 -3.91668,-1.97657 -8.218,-2.84964 -12.49331,-3.45727 -6.36797,-0.92461 -12.81028,-1.0785 -19.23047,-1.02061 z m 8.41211,25.37169 c 4.66279,0.0761 9.63211,0.41293 13.6346,3.20401 3.89146,2.79174 5.87979,7.68748 6.54296,12.45115 0.78071,5.37267 0.17023,11.23267 -2.80409,15.80308 -2.56621,3.75846 -6.74165,5.92768 -10.98572,6.77461 -6.27489,1.33639 -12.71671,1.13784 -19.08501,1.14615 -0.0163,-12.9553 0.0319,-25.91059 0.10937,-38.86561 2.98942,-0.1492 6.09847,-0.35319 9.01172,-0.44768 1.19189,-0.0367 2.38379,-0.0588 3.57617,-0.0657 z" />
      <ellipse
         style="opacity:0.83;fill:none;fill-opacity:1;stroke:url(#linearGradient112454);stroke-width:19.4147;stroke-miterlimit:4;stroke-dasharray:none;stroke-opacity:1"
         id="path111851"
         cx="113.35999"
         cy="100.51643"
         rx="29.225985"
         ry="34.365704" />
      <ellipse
         style="opacity:0.83;fill:#000000;fill-opacity:1;stroke:none;stroke-width:27.4448;stroke-miterlimit:4;stroke-dasharray:none;stroke-opacity:1"
         id="path111985"
         cx="1136.8669"
         cy="243.5593"
         rx="14.369547"
         ry="16.896593" />
      <ellipse
         style="opacity:0.83;fill:#000000;fill-opacity:1;stroke:none;stroke-width:27.4448;stroke-miterlimit:4;stroke-dasharray:none;stroke-opacity:1"
         id="path111985-7"
         cx="224.48967"
         cy="223.70404"
         rx="14.369547"
         ry="16.896593" />
    </g>
    <g
       id="g103084-2"
       transform="matrix(0.26458333,0,0,0.26458333,-430.78066,976.28772)">
      <path
         style="fill:url(#radialGradient20675-1-4-29-7);fill-opacity:1;stroke-width:1.49357"
         d="m 1218.8131,-957.22633 c 0.7042,1.30322 7.5074,17.70241 15.1182,36.4426 l 25.9595,63.025 18.4188,44.70515 c 10.1304,24.58781 18.0431,45.36852 17.2415,45.65118 l -24.2571,8.55377 c -18.9818,-51.14249 -46.7356,-103.90611 -79.1011,-191.10162 0.662,-0.57871 6.6343,-2.98568 13.2716,-5.3489 10.8616,-3.8671 12.1961,-4.0598 13.3486,-1.92718 z"
         id="path40362-5-81-1"
         inkscape:label="X"
         sodipodi:nodetypes="sccscccsss" />
      <path
         style="fill:url(#radialGradient20675-1-4-2-3);fill-opacity:1;stroke-width:1.49432"
         d="m 1232.9896,-893.7784 c 0.8217,-0.25626 2.8127,-3.7713 4.4245,-7.8115 2.4978,-6.26091 2.9213,-10.9041 2.8682,-31.43735 l -0.062,-24.09149 8.935,-0.93351 13.7308,-0.93353 h 4.7958 l 0.9528,10.08471 c 3.4202,36.20002 -3.0088,64.07249 -18.8966,79.27255 -10.048,9.61308 -19.5921,17.8803 -29.5495,26.63575 -2.214,1.94677 -10.158,10.89357 -11.4123,18.21956 -1.6102,9.40332 -0.8612,30.91136 1.6475,47.31215 1.1312,7.39543 1.8904,13.63135 1.6871,13.85757 l -27.2142,4.3027 c -0.8684,0.13713 -4.6255,-29.10608 -5.7075,-40.6055 -1.3191,-14.01917 1.5252,-33.74008 6.3472,-44.00774 2.1626,-4.60493 8.285,-12.8683 13.8601,-18.70678 10.1697,-11.45553 22.1035,-21.08304 33.5931,-31.15759 z"
         id="path40362-5-6-5"
         inkscape:label="X"
         sodipodi:nodetypes="cssccccsscssccsscc" />
      <ellipse
         style="opacity:0.99;fill:#ffffff;fill-opacity:0.3776;stroke:#030300;stroke-width:17.897;stroke-miterlimit:4;stroke-dasharray:none;stroke-opacity:1"
         id="ellipse46525-9"
         cy="-1010.0735"
         cx="1226.1"
         rx="35.374622"
         ry="36.125313" />
    </g>
    <path
       style="fill:url(#radialGradient20675-1-4-2-3-9);fill-opacity:1;stroke-width:0.395372"
       d="m -82.483636,-126.83309 c -0.0888,0.20972 0.28047,1.21277 0.82059,2.22905 0.83697,1.57491 1.70202,2.45438 5.85682,5.95478 l 4.87472,4.10704 -1.33938,1.96362 -2.15943,2.93191 -0.82007,0.96829 -2.19905,-1.53209 c -7.89371,-5.49953 -12.42189,-11.56365 -12.77405,-17.37059 -0.22273,-3.67252 -0.2599,-7.01315 -0.32496,-10.52074 -0.0145,-0.77989 -0.46245,-3.91367 -1.72711,-5.41964 -1.62321,-1.93304 -6.09381,-5.45962 -9.834144,-7.75758 -1.68659,-1.0362 -3.07545,-1.94924 -3.08637,-2.02897 l 3.78482,-6.23036 c 0.12079,-0.19879 6.667534,4.04315 9.174304,5.79105 3.05607,2.1309 6.55139,6.07738 7.79991,8.80668 0.55995,1.22407 1.18143,3.8732 1.40692,5.99719 0.57391,4.01213 0.47709,8.06787 0.54648,12.11036 z"
       id="path40362-5-6-5-9"
       inkscape:label="X"
       sodipodi:nodetypes="cssccccsscssccsscc" />
    <g
       id="g120471"
       transform="matrix(0.66569692,0,0,0.66569692,26.011764,60.836969)">
      <path
         style="fill:none;stroke:#000000;stroke-width:7.1;stroke-linecap:round;stroke-linejoin:miter;stroke-miterlimit:4;stroke-dasharray:none;stroke-opacity:1"
         d="m -1.7392252,174.75191 c 8.36285,-33.19026 22.8340502,6.0187 26.9506802,14.59163 4.11663,8.57293 22.15946,49.0078 32.56657,10.95338"
         id="path113291"
         sodipodi:nodetypes="czc" />
      <circle
         style="opacity:0.99;fill:none;fill-opacity:0.3776;stroke:#030300;stroke-width:6;stroke-miterlimit:4;stroke-dasharray:none;stroke-opacity:1"
         id="ellipse46525-9-8"
         cy="143.68399"
         cx="27.884443"
         r="14.496798" />
      <path
         id="path40362-5-81-1-0"
         style="fill:url(#radialGradient20675-1-4-29-7-3);fill-opacity:1;stroke-width:0.713835"
         inkscape:label="X"
         sodipodi:type="inkscape:offset"
         inkscape:radius="-2.1179574"
         inkscape:original="M -148.75977 -60.164062 L -148.81445 -60.080078 L -148.84961 -60.025391 C -156.64943 -43.447609 -164.29403 -26.78917 -172.05859 -10.191406 C -176.58228 -0.42330738 -181.20332 9.3011919 -185.48242 19.179688 C -186.03452 20.523736 -186.58567 21.82063 -187.07422 23.162109 C -183.90606 24.113589 -180.75809 25.138312 -177.59375 26.107422 C -170.32694 9.2329729 -161.6263 -6.9698234 -153.74023 -23.556641 C -148.44579 -34.601766 -143.36715 -45.741689 -138.61133 -57.021484 C -141.95452 -58.237547 -145.28409 -59.381626 -148.75977 -60.164062 z "
         d="m -147.64062,-57.605469 c -7.54808,16.066311 -14.96768,32.209226 -22.5,48.3105471 -4.52298,9.76644338 -9.12862,19.4606359 -13.38282,29.2792969 -0.003,0.0082 -0.006,0.01523 -0.01,0.02344 -0.002,0.0045 -0.004,0.0091 -0.006,0.01367 -0.25695,0.625174 -0.47574,1.200146 -0.71875,1.796875 1.8525,0.573471 3.69802,1.147015 5.53125,1.71875 7.15275,-16.3489448 15.48965,-32.0512522 23.07422,-48.003906 a 2.1181691,2.1181691 0 0 1 0.002,-0.0059 c 4.94504,-10.316218 9.64756,-20.730246 14.12305,-31.238282 -2.03604,-0.711793 -4.07075,-1.364177 -6.11328,-1.894531 z"
         transform="rotate(12.232815,-1038.553,965.28781)" />
    </g>
    <g
       id="g120471-7"
       transform="translate(506.23181,-392.51042)">
      <path
         style="fill:none;stroke:#000000;stroke-width:7.1;stroke-linecap:round;stroke-linejoin:miter;stroke-miterlimit:4;stroke-dasharray:none;stroke-opacity:1"
         d="m -1.7392252,174.75191 c 8.36285,-33.19026 22.8340502,6.0187 26.9506802,14.59163 4.11663,8.57293 22.15946,49.0078 32.56657,10.95338"
         id="path113291-4"
         sodipodi:nodetypes="czc" />
      <circle
         style="opacity:0.99;fill:none;fill-opacity:0.3776;stroke:#030300;stroke-width:6;stroke-miterlimit:4;stroke-dasharray:none;stroke-opacity:1"
         id="ellipse46525-9-8-0"
         cy="143.68399"
         cx="27.884443"
         r="14.496798" />
      <path
         id="path40362-5-81-1-0-6"
         style="fill:url(#radialGradient20675-1-4-29-7-3-5);fill-opacity:1;stroke-width:0.713835"
         inkscape:label="X"
         sodipodi:type="inkscape:offset"
         inkscape:radius="-2.1179574"
         inkscape:original="M -148.75977 -60.164062 L -148.81445 -60.080078 L -148.84961 -60.025391 C -156.64943 -43.447609 -164.29403 -26.78917 -172.05859 -10.191406 C -176.58228 -0.42330738 -181.20332 9.3011919 -185.48242 19.179688 C -186.03452 20.523736 -186.58567 21.82063 -187.07422 23.162109 C -183.90606 24.113589 -180.75809 25.138312 -177.59375 26.107422 C -170.32694 9.2329729 -161.6263 -6.9698234 -153.74023 -23.556641 C -148.44579 -34.601766 -143.36715 -45.741689 -138.61133 -57.021484 C -141.95452 -58.237547 -145.28409 -59.381626 -148.75977 -60.164062 z "
         transform="rotate(12.232815,-1038.553,965.28781)"
         d="m -147.64062,-57.605469 c -7.54808,16.066311 -14.96768,32.209226 -22.5,48.3105471 -4.52298,9.76644338 -9.12862,19.4606359 -13.38282,29.2792969 -0.003,0.0082 -0.006,0.01523 -0.01,0.02344 -0.002,0.0045 -0.004,0.0091 -0.006,0.01367 -0.25695,0.625174 -0.47574,1.200146 -0.71875,1.796875 1.8525,0.573471 3.69802,1.147015 5.53125,1.71875 7.15275,-16.3489448 15.48965,-32.0512522 23.07422,-48.003906 a 2.1181691,2.1181691 0 0 1 0.002,-0.0059 c 4.94504,-10.316218 9.64756,-20.730246 14.12305,-31.238282 -2.03604,-0.711793 -4.07075,-1.364177 -6.11328,-1.894531 z" />
    </g>
    <g
       id="g120914"
       transform="translate(38.629185,5.288437)">
      <text
         xml:space="preserve"
         style="font-style:normal;font-variant:normal;font-weight:bold;font-stretch:normal;font-size:39.2495px;line-height:1.25;font-family:'Liberation Sans';-inkscape-font-specification:'Liberation Sans, Bold';font-variant-ligatures:normal;font-variant-caps:normal;font-variant-numeric:normal;font-variant-east-asian:normal;letter-spacing:3.67964px;fill:url(#radialGradient95341-9-8-0);fill-opacity:1;stroke-width:0.459954"
         x="52.331417"
         y="194.94719"
         id="text339989-3-4-4-2"
         transform="scale(1.0322921,0.96871808)"><tspan
           id="tspan339987-8-6-9-1"
           style="font-style:normal;font-variant:normal;font-weight:bold;font-stretch:normal;font-size:39.2495px;font-family:'Liberation Sans';-inkscape-font-specification:'Liberation Sans, Bold';font-variant-ligatures:normal;font-variant-caps:normal;font-variant-numeric:normal;font-variant-east-asian:normal;fill:url(#radialGradient95341-9-8-0);stroke-width:0.459954"
           x="52.331417"
           y="194.94719">Phenom</tspan></text>
      <text
         xml:space="preserve"
         style="font-style:italic;font-variant:normal;font-weight:normal;font-stretch:normal;font-size:29.4371px;line-height:1.25;font-family:'Liberation Sans';-inkscape-font-specification:'Liberation Sans, Italic';font-variant-ligatures:normal;font-variant-caps:normal;font-variant-numeric:normal;font-variant-east-asian:normal;text-align:start;letter-spacing:3.67964px;text-anchor:start;fill:#010101;fill-opacity:1;stroke-width:0.459954"
         x="266.23019"
         y="195.72835"
         id="text351121-0-9-2-2"
         inkscape:label="health"
         transform="scale(1.0322921,0.96871806)"><tspan
           id="tspan351119-4-4-5-0"
           style="font-style:normal;font-variant:normal;font-weight:bold;font-stretch:normal;font-size:39.2495px;font-family:'Liberation Sans';-inkscape-font-specification:'Liberation Sans, Bold';font-variant-ligatures:normal;font-variant-caps:normal;font-variant-numeric:normal;font-variant-east-asian:normal;text-align:start;text-anchor:start;fill:#010101;fill-opacity:1;stroke-width:0.459954"
           x="266.23019"
           y="195.72835">Health</tspan></text>
      <g
         id="g120728"
         style="fill:url(#radialGradient110689-3);fill-opacity:1"
         transform="matrix(0.23706659,0,0,0.20161103,103.88366,55.317593)">
        <path
           id="path46459-5-5-2-5"
           style="fill:url(#radialGradient47627-4-6-3-2-9);fill-opacity:1;stroke-width:0.664667"
           d="m 180.56341,1694.3543 v 131.8926 l -0.0968,4.6944 25.08122,0.1189 c 0,0 0.77322,-3.6268 0.38993,-6.1377 -0.0933,-5.9666 -0.0125,-11.935 -0.0384,-17.9023 -0.0126,-9.3449 0.0396,-18.6915 -0.0697,-28.0352 -0.33987,-6.9867 1.64838,-14.273 6.29393,-19.6311 2.51437,-2.8064 6.05614,-4.7329 9.84711,-5.0531 2.44182,-0.461 5.10504,-0.5477 7.34367,0.6931 3.91989,2.0529 6.25987,6.1737 7.3839,10.302 0.92412,3.5209 0.75088,7.186 0.99609,10.7865 0.64154,16.2773 -0.10193,32.6977 0.23372,49.031 0.0596,0.576 0,5.9641 0,5.9641 l 25.56618,-0.1946 c 0,0 0.26029,-3.4993 -0.11479,-5.9584 -0.14807,-5.0337 -0.0994,-10.0718 -0.1736,-15.1073 -0.10957,-14.1235 -0.26663,-28.2478 -0.32403,-42.3711 0.561,-11.3727 -4.69879,-22.8643 -13.64999,-29.9571 -4.32629,-3.3816 -9.68036,-5.8963 -15.10262,-6.064 -6.15356,-0.1903 -12.83816,2.18 -17.53198,5.8096 -4.69382,3.6296 -8.69428,9.494 -10.76759,13.9182 -0.0263,-15.1198 0.0619,-43.652 0.0346,-58.7718 l -25.30078,-0.063 v 2.0365 z" />
        <path
           id="path46461-4-5-2-3"
           style="fill:url(#radialGradient47629-2-1-5-9-0);fill-opacity:1;stroke-width:0.683592"
           d="m 106.35191,1692.1345 c -7.948775,0.1184 -16.012095,0.5059 -23.890625,0.2936 -1.66317,-0.035 -3.32719,-0.1538 -4.98047,-0.1992 -1.29062,0.081 -2.24373,1.4084 -2.07813,2.7345 0,45.1676 0,90.3352 0,135.5027 8.88932,0 17.77865,0 26.667975,0 0,-15.6569 0,-31.314 0,-46.9709 10.02359,-0.01 20.2617,-0.4363 29.81363,-3.9406 5.603,-2.0556 10.77884,-5.3451 15.14857,-9.5612 6.2286,-5.0485 10.09986,-12.729 11.90862,-20.6662 1.27989,-5.4979 1.91015,-11.1729 1.85713,-16.8308 -0.82581,-15.0407 -9.72434,-29.4082 -22.7229,-35.884 -3.91669,-1.9766 -8.21802,-2.8497 -12.49333,-3.4573 -6.36797,-0.9246 -12.81028,-1.0785 -19.23047,-1.0206 z m 8.41211,25.3717 c 4.66279,0.076 9.63211,0.4129 13.6346,3.204 3.89147,2.7917 5.8798,7.6875 6.54297,12.4511 0.78072,5.3727 0.17023,11.2327 -2.80409,15.8031 -2.56622,3.7585 -6.74166,5.9277 -10.98573,6.7746 -6.27489,1.3364 -12.71671,1.1379 -19.08502,1.1462 -0.0163,-12.9553 0.0319,-25.9106 0.10938,-38.8656 2.98941,-0.1492 6.09847,-0.3532 9.01172,-0.4477 1.19189,-0.037 2.38378,-0.059 3.57617,-0.066 z" />
      </g>
      <g
         id="g120728-2"
         style="fill:url(#radialGradient110689-3-0);fill-opacity:1"
         transform="matrix(0.23706659,0,0,0.20161103,200.82497,55.640935)">
        <path
           id="path46459-5-5-2-5-8"
           style="fill:url(#radialGradient47627-4-6-3-2-9-4);fill-opacity:1;stroke-width:0.664667"
           d="m 180.56341,1694.3543 v 131.8926 l -0.0968,4.6944 25.08122,0.1189 c 0,0 0.77322,-3.6268 0.38993,-6.1377 -0.0933,-5.9666 -0.0125,-11.935 -0.0384,-17.9023 -0.0126,-9.3449 0.0396,-18.6915 -0.0697,-28.0352 -0.33987,-6.9867 1.64838,-14.273 6.29393,-19.6311 2.51437,-2.8064 6.05614,-4.7329 9.84711,-5.0531 2.44182,-0.461 5.10504,-0.5477 7.34367,0.6931 3.91989,2.0529 6.25987,6.1737 7.3839,10.302 0.92412,3.5209 0.75088,7.186 0.99609,10.7865 0.64154,16.2773 -0.10193,32.6977 0.23372,49.031 0.0596,0.576 0,5.9641 0,5.9641 l 25.56618,-0.1946 c 0,0 0.26029,-3.4993 -0.11479,-5.9584 -0.14807,-5.0337 -0.0994,-10.0718 -0.1736,-15.1073 -0.10957,-14.1235 -0.26663,-28.2478 -0.32403,-42.3711 0.561,-11.3727 -4.69879,-22.8643 -13.64999,-29.9571 -4.32629,-3.3816 -9.68036,-5.8963 -15.10262,-6.064 -6.15356,-0.1903 -12.83816,2.18 -17.53198,5.8096 -4.69382,3.6296 -8.69428,9.494 -10.76759,13.9182 -0.0263,-15.1198 0.0619,-43.652 0.0346,-58.7718 l -25.30078,-0.063 v 2.0365 z" />
        <path
           id="path46461-4-5-2-3-9"
           style="fill:url(#radialGradient47629-2-1-5-9-0-6);fill-opacity:1;stroke-width:0.683592"
           d="m 106.35191,1692.1345 c -7.948775,0.1184 -16.012095,0.5059 -23.890625,0.2936 -1.66317,-0.035 -3.32719,-0.1538 -4.98047,-0.1992 -1.29062,0.081 -2.24373,1.4084 -2.07813,2.7345 0,45.1676 0,90.3352 0,135.5027 8.88932,0 17.77865,0 26.667975,0 0,-15.6569 0,-31.314 0,-46.9709 10.02359,-0.01 20.2617,-0.4363 29.81363,-3.9406 5.603,-2.0556 10.77884,-5.3451 15.14857,-9.5612 6.2286,-5.0485 10.09986,-12.729 11.90862,-20.6662 1.27989,-5.4979 1.91015,-11.1729 1.85713,-16.8308 -0.82581,-15.0407 -9.72434,-29.4082 -22.7229,-35.884 -3.91669,-1.9766 -8.21802,-2.8497 -12.49333,-3.4573 -6.36797,-0.9246 -12.81028,-1.0785 -19.23047,-1.0206 z m 8.41211,25.3717 c 4.66279,0.076 9.63211,0.4129 13.6346,3.204 3.89147,2.7917 5.8798,7.6875 6.54297,12.4511 0.78072,5.3727 0.17023,11.2327 -2.80409,15.8031 -2.56622,3.7585 -6.74166,5.9277 -10.98573,6.7746 -6.27489,1.3364 -12.71671,1.1379 -19.08502,1.1462 -0.0163,-12.9553 0.0319,-25.9106 0.10938,-38.8656 2.98941,-0.1492 6.09847,-0.3532 9.01172,-0.4477 1.19189,-0.037 2.38378,-0.059 3.57617,-0.066 z" />
      </g>
    </g>
    <path
       style="fill:none;stroke:#000000;stroke-width:2;stroke-linecap:butt;stroke-linejoin:miter;stroke-miterlimit:4;stroke-dasharray:none;stroke-opacity:1"
       d="M 79.742338,216.6532 79.444107,139.05189"
       id="path121013"
       sodipodi:nodetypes="cc" />
    <path
       id="path46465-1-8-1-5-6"
       style="fill:url(#radialGradient47633-9-2-2-17-2-1);fill-opacity:1;stroke-width:0.246443"
       d="m 34.111372,31.940943 c -1.33717,0.248974 -2.63853,0.629314 -3.93213,1.007884 1.89047,3.91873 4.1926,7.68221 6.31809,11.51057 -1.84187,1.36569 -3.90972,2.51671 -5.16827,4.33189 -1.1405,2.12427 -1.32405,4.55475 -0.79829,6.83049 0.22478,1.20252 0.42775,2.40935 0.73746,3.59877 1.48011,-0.15852 2.9602,-0.31705 4.44031,-0.47557 -0.55572,-2.62657 -1.08593,-5.33247 -0.59845,-7.99632 0.39425,-1.07529 1.1777,-2.10897 2.27216,-2.75666 0.61544,-0.34317 1.19037,0.14829 1.37476,0.63337 2.10411,3.42247 3.84009,7.00734 6.09902,10.3599 0.4787,0.11602 1.15323,-0.26776 1.70527,-0.33893 0.7011,-0.20741 1.55581,-0.34728 2.16406,-0.59553 -2.08752,-4.22098 -4.57432,-8.35847 -6.88317,-12.52679 1.55141,-0.9911 3.1941,-2.00567 4.04052,-3.54656 1.64129,-2.70493 1.56362,-5.87201 1.08851,-8.8117 -1.47706,0.0301 -2.95415,0.10856 -4.42659,0.21526 -0.0487,2.06739 0.16626,4.15358 -0.17267,6.2075 -0.25595,0.87321 -0.72164,1.80476 -1.57756,2.36118 -0.62684,0.3149 -1.02188,-0.45297 -1.29572,-0.83234 -1.9414,-2.9884 -3.51679,-6.13255 -5.32453,-9.179754 z" />
    <path
       id="path46465-1-8-1-5-6-4"
       style="fill:url(#radialGradient47633-9-2-2-17-2-1-7);fill-opacity:1;stroke-width:0.290949"
       d="m 281.05805,162.16675 c -1.53906,0.30151 -3.03691,0.76209 -4.52582,1.22052 2.1759,4.74548 4.82561,9.30293 7.27202,13.93897 -2.11996,1.65381 -4.50003,3.04766 -5.9486,5.24578 -1.31269,2.57243 -1.52396,5.51567 -0.91881,8.27152 0.25871,1.45623 0.49233,2.91766 0.8488,4.35801 1.70358,-0.19196 3.40714,-0.38394 5.11072,-0.5759 -0.63962,-3.1807 -1.24988,-6.45746 -0.6888,-9.6833 0.45377,-1.30216 1.35551,-2.55391 2.61522,-3.33824 0.70836,-0.41557 1.37009,0.17957 1.58232,0.76699 2.4218,4.14451 4.41988,8.48568 7.01988,12.54553 0.55097,0.1405 1.32735,-0.32424 1.96273,-0.41043 0.80696,-0.25117 1.79072,-0.42055 2.4908,-0.72117 -2.4027,-5.11148 -5.26497,-10.12186 -7.92241,-15.16958 1.78564,-1.20018 3.67635,-2.4288 4.65057,-4.29477 1.8891,-3.27559 1.7997,-7.11083 1.25286,-10.67071 -1.70008,0.0364 -3.40018,0.13146 -5.09494,0.26068 -0.056,2.50354 0.19137,5.02986 -0.19874,7.51709 -0.29459,1.05743 -0.83059,2.18552 -1.81574,2.85933 -0.72149,0.38133 -1.17617,-0.54854 -1.49136,-1.00795 -2.23452,-3.61886 -4.04776,-7.42633 -6.12844,-11.11641 z" />
  </g>
</svg>
