<?xml version="1.0" encoding="UTF-8" standalone="no"?>
<svg
   xmlns:dc="http://purl.org/dc/elements/1.1/"
   xmlns:cc="http://creativecommons.org/ns#"
   xmlns:rdf="http://www.w3.org/1999/02/22-rdf-syntax-ns#"
   xmlns:svg="http://www.w3.org/2000/svg"
   xmlns="http://www.w3.org/2000/svg"
   version="1.1"
   id="svg-di-arrow"
   width="600"
   height="419"
   viewBox="0 0 600 419">
  <metadata
     id="metadata8">
    <rdf:RDF>
      <cc:Work
         rdf:about="">
        <dc:format>image/svg+xml</dc:format>
        <dc:type
           rdf:resource="http://purl.org/dc/dcmitype/StillImage" />
        <dc:title></dc:title>
      </cc:Work>
    </rdf:RDF>
  </metadata>
 <defs
     id="defs6">
   <filter id="shadow">
     <feDropShadow dx="-24.0" dy="16.2" stdDeviation="4.8"
                  flood-color="black" />
   </filter>
   <filter id="hue">
     <feColorMatrix type="hueRotate" values="60" />
   </filter>
 </defs>
  <g
     id="g10">
    <path
       style="fill:#400040;fill-opacity:1; filter:url(#shadow)"
       d="m 387.24913,373.13571 c -4.05757,-2.82171 -7.55046,-5.27297 -7.76199,-5.44726 -0.72297,-0.59567 2.18579,-6.89683 16.34481,-35.40727 7.79177,-15.68944 15.66615,-32.11444 17.49861,-36.5 3.10234,-7.42472 6.28297,-17.47374 5.53064,-17.47374 -0.18123,0 -5.878,1.60602 -12.65949,3.56892 -106.60124,30.85584 -218.38654,32.13796 -337.829972,3.87472 -7.975,-1.88708 -15.45004,-3.65178 -16.6112,-3.92156 -1.8701,-0.4345 -2.18397,-1.43444 -2.74847,-8.7563 -0.3505,-4.54618 -2.23992,-28.29078 -4.1987,-52.76578 -1.95879,-24.475 -4.32723,-54.64841 -5.263211,-67.05202 l -1.701777,-22.55202 19.511678,3.28523 c 96.744202,16.28908 160.548492,22.27255 224.011682,21.00749 37.96442,-0.75677 60.01898,-3.04519 88.84774,-9.21898 14.10702,-3.02107 32.99792,-8.41096 33.75119,-9.62978 0.73251,-1.18522 -5.41512,-12.04984 -11.29257,-19.95722 -8.27943,-11.13893 -29.02413,-31.444629 -54.30636,-53.157116 -13.475,-11.572388 -24.67647,-21.183777 -24.89216,-21.358642 -0.21569,-0.174866 1.96944,-3.915101 4.85585,-8.311634 l 5.24801,-7.993697 3.14415,1.346538 c 1.72928,0.740596 16.64415,7.643908 33.14415,15.340692 58.08966,27.097189 122.63409,54.655704 184.5,78.775909 17.875,6.96909 32.88258,13.03209 33.35018,13.47334 1.05174,0.99247 -4.9819,22.57115 -10.61177,37.95185 -9.19912,25.13187 -26.76324,55.13301 -47.12147,80.48779 -14.92021,18.5821 -33.83765,38.52198 -60.552,63.82469 -13.4937,12.78067 -33.59614,31.89078 -44.67208,42.4669 l -20.13808,19.22933 z m 66.85243,-78.46715 c 49.43764,-48.02132 71.65035,-76.67972 89.02718,-114.86112 4.87226,-10.70561 12.93376,-33.20336 12.13898,-33.877 -0.21779,-0.18459 -12.77098,-5.17177 -27.89598,-11.08262 -35.79158,-13.98736 -80.23036,-32.50541 -116.70004,-48.629982 -16.06003,-7.10072 -29.55114,-12.910401 -29.98025,-12.910401 -0.42912,0 3.3038,4.1625 8.29537,9.25 19.4876,19.862133 29.98277,35.493703 36.42393,54.250003 1.51102,4.4 3.04621,8.72933 3.41154,9.62074 0.54722,1.33524 -1.88798,2.51547 -13.82405,6.69986 -42.32076,14.83625 -76.19396,20.00601 -136.87165,20.88945 -61.76307,0.89925 -115.92833,-3.63491 -195.035914,-16.32641 -12.529588,-2.01016 -23.066018,-3.36989 -23.414288,-3.02162 -0.75826,0.75826 7.69044,109.85848 8.57836,110.77452 1.62703,1.67856 48.068252,11.0704 70.616992,14.28092 38.8128,5.52622 61.76046,6.9104 104.53932,6.3057 35.69146,-0.50451 49.40721,-1.45801 76.46068,-5.31545 30.04369,-4.2838 66.29343,-12.62462 97.34814,-22.39915 8.99148,-2.83009 16.48173,-5.00227 16.645,-4.82708 0.16327,0.17518 1.29417,3.68515 2.51311,7.79991 4.32013,14.58338 2.03332,26.91499 -9.57104,51.61181 -2.98937,6.36208 -5.43521,11.79628 -5.43521,12.076 0,1.13316 7.73921,-6.03341 32.72982,-30.30808 z"
       id="path837" />
  </g>
</svg>
