# DNS record for nutrau.cf
nutrau.cf,@,A,3600,104.198.14.52
nutrau.cf,www,CNAME,3600,nutra-u.netlify.app
nutrau.cf,@,MX,3600,mail.mailinator.com 20
nutrau.cf,_contact,TXT,3600,ursule
nutrau.cf,*,NS,0,ns01.freenom.com



