{
"title":"Hostless webSite",
"description":"This web-site is on the blockchain",
"prev":"z6cYNbecZSFzLjbSimKuibtdpGt7DAUMMt46aKQNdwfs",
"qm":"Qmb6EJ5NHLqpsTz8qBPgURjSJ1HKJDHobUVLKoH6ZLzBM3",
"name":"hostless"
}
