@,A,3600,35.185.44.232
www,CNAME,3600,xn--h98h.gitlab.io
contact,RP,3600,essenctango.gmail.com. .
contact,TXT,3600,addr1=Chemin de la Chiesaz, 8; ecublens CH 1024
contact,TXT,3600,gecos=Essence Tango
info,TXT,3600,title=410TM
info,TXT,3600,description=410 gone !
_dnslink,TXT,3600,dnslink=/ipns/QmNzufyrKrzzL3eqNKe6iuDV875SN1Egn2PkKeWxtpNeTk
_expires,TXT,3600,2021-06-10

