<?xml version="1.0" encoding="utf-8"?>
<!-- Generator: Adobe Illustrator 16.0.0, SVG Export Plug-In . SVG Version: 6.00 Build 0)  -->
<!DOCTYPE svg PUBLIC "-//W3C//DTD SVG 1.1//EN" "http://www.w3.org/Graphics/SVG/1.1/DTD/svg11.dtd">
<svg version="1.1" id="Calque_1" xmlns="http://www.w3.org/2000/svg" xmlns:xlink="http://www.w3.org/1999/xlink" x="0px" y="0px"
	 width="141.73px" height="141.73px" viewBox="0 0 141.73 141.73" enable-background="new 0 0 141.73 141.73" xml:space="preserve">
<g>
	<defs>
		<rect id="SVGID_1_" x="467.124" y="517.865" width="53.887" height="53.887"/>
	</defs>
	<clipPath id="SVGID_2_">
		<use xlink:href="#SVGID_1_"  overflow="visible"/>
	</clipPath>
	<g clip-path="url(#SVGID_2_)">
		<path fill="#FFFFFF" d="M494.245,542.473c0.537,0,0.964-0.396,1.053-0.907c0.001-0.003,0-0.006,0-0.009
			c0.001-0.005,0.004-0.008,0.005-0.013c0.008-0.054,0.032-0.104,0.032-0.16c0-0.6-0.488-1.088-1.09-1.088
			c-0.6,0-1.088,0.488-1.088,1.088C493.157,541.984,493.646,542.473,494.245,542.473z"/>
		<circle fill="#FFFFFF" cx="488.204" cy="551.052" r="1.088"/>
		<circle fill="#FFFFFF" cx="503.249" cy="542.57" r="1.088"/>
		<path fill="#FFFFFF" d="M494.067,517.865c-14.88,0-26.943,12.063-26.943,26.943c0,14.88,12.063,26.943,26.943,26.943
			s26.943-12.063,26.943-26.943C521.011,529.928,508.947,517.865,494.067,517.865z M488.204,548.541
			c0.285,0,0.556,0.058,0.812,0.146l3.383-5.615c-0.409-0.447-0.665-1.036-0.665-1.688c0-1.385,1.127-2.511,2.512-2.511
			c1.276,0,2.322,0.961,2.479,2.195l4.165,0.679c0.343-0.979,1.265-1.688,2.359-1.688c0.632,0,1.202,0.242,1.645,0.628l2.989-2.147
			c-0.127-0.3-0.197-0.63-0.197-0.976c0-1.385,1.127-2.511,2.513-2.511c1.385,0,2.512,1.126,2.512,2.511
			c0,1.386-1.127,2.512-2.512,2.512c-0.522,0-1.008-0.161-1.41-0.435l-3.132,2.25c0.062,0.218,0.105,0.442,0.105,0.68
			c0,1.384-1.127,2.511-2.513,2.511c-1.174,0-2.154-0.813-2.427-1.904l-4.324-0.706c-0.407,0.839-1.26,1.424-2.253,1.424
			c-0.218,0-0.426-0.037-0.628-0.089l-3.439,5.711c0.332,0.425,0.538,0.953,0.538,1.533c0,1.385-1.127,2.512-2.512,2.512
			c-0.646,0-1.229-0.252-1.674-0.653l-3.242,1.804c-0.109,0.061-0.229,0.09-0.345,0.09c-0.25,0-0.492-0.132-0.622-0.365
			c-0.191-0.344-0.068-0.776,0.275-0.968l3.19-1.776c-0.055-0.206-0.094-0.419-0.094-0.643
			C485.693,549.667,486.819,548.541,488.204,548.541z M512.523,558.086l-3.815,2.909c-0.129,0.1-0.279,0.146-0.43,0.146
			c-0.215,0-0.427-0.096-0.566-0.28c-0.239-0.312-0.178-0.759,0.134-0.997l2.173-1.657h-28.689c-1.572,0-2.852-1.216-2.852-2.711
			V533.28l-1.883,2.315c-0.141,0.172-0.346,0.262-0.553,0.262c-0.158,0-0.316-0.052-0.447-0.159
			c-0.306-0.248-0.352-0.696-0.104-1.001l2.908-3.578c0.174-0.214,0.446-0.292,0.698-0.239c0.253-0.053,0.524,0.025,0.698,0.239
			l2.91,3.578c0.246,0.305,0.201,0.753-0.104,1.001c-0.132,0.107-0.29,0.159-0.448,0.159c-0.207,0-0.412-0.09-0.552-0.263
			l-1.701-2.091v21.992c0,0.71,0.642,1.288,1.429,1.288h29.008l-2.491-1.899c-0.313-0.237-0.373-0.685-0.134-0.996
			c0.238-0.313,0.686-0.373,0.997-0.136l3.815,2.91c0.225,0.172,0.314,0.453,0.259,0.714
			C512.837,557.636,512.749,557.915,512.523,558.086z"/>
		<path fill="#FFFFFF" d="M479.059,532.565c0.022-0.004,0.044-0.012,0.067-0.014l-0.028-0.035L479.059,532.565z"/>
		<circle fill="#FFFFFF" cx="510.198" cy="537.565" r="1.088"/>
	</g>
</g>
<g>
	<defs>
		<rect id="SVGID_3_" x="15.822" y="19.027" width="103.677" height="103.676"/>
	</defs>
	<clipPath id="SVGID_4_">
		<use xlink:href="#SVGID_3_"  overflow="visible"/>
	</clipPath>
	<g clip-path="url(#SVGID_4_)">
		<path fill="#FFFFFF" d="M56.824,89.426h8.047c0.879,0,1.596-0.719,1.596-1.598V49.331c0-0.879-0.717-1.595-1.596-1.595h-8.047
			c-0.88,0-1.593,0.716-1.593,1.595v38.497C55.23,88.707,55.943,89.426,56.824,89.426z M60.848,77.188
			c2.766,0,5.014,2.248,5.014,5.014c0,2.762-2.248,5.01-5.014,5.01c-2.762,0-5.013-2.248-5.013-5.01
			C55.834,79.436,58.086,77.188,60.848,77.188z"/>
		<path fill="#FFFFFF" d="M91.907,78.568c-0.358,0-0.704,0.078-1.033,0.23c-1.23,0.572-1.764,2.035-1.192,3.266
			c0.401,0.863,1.277,1.424,2.232,1.424c0.356,0,0.705-0.08,1.032-0.232c0.598-0.275,1.05-0.768,1.273-1.385
			c0.227-0.617,0.195-1.283-0.082-1.877C93.735,79.129,92.861,78.568,91.907,78.568z"/>
		<path fill="#FFFFFF" d="M37.864,89.426h8.043c0.879,0,1.597-0.719,1.597-1.598V49.331c0-0.879-0.718-1.595-1.597-1.595h-8.043
			c-0.882,0-1.597,0.716-1.597,1.595v38.497C36.267,88.707,36.982,89.426,37.864,89.426z M41.886,76.182
			c2.762,0,5.011,2.25,5.011,5.014c0,2.762-2.25,5.012-5.011,5.012c-2.764,0-5.013-2.25-5.013-5.012
			C36.873,78.432,39.122,76.182,41.886,76.182z"/>
		<path fill="#FFFFFF" d="M41.886,83.652c1.353,0,2.458-1.104,2.458-2.457c0-1.357-1.105-2.459-2.458-2.459
			c-1.356,0-2.459,1.102-2.459,2.459C39.427,82.549,40.53,83.652,41.886,83.652z"/>
		<path fill="#FFFFFF" d="M67.66,19.027c-28.628,0-51.838,23.208-51.838,51.839c0,28.628,23.21,51.837,51.838,51.837
			c28.629,0,51.839-23.209,51.839-51.837C119.499,42.235,96.289,19.027,67.66,19.027z M52.676,49.331c0-2.289,1.86-4.15,4.147-4.15
			h8.047c2.287,0,4.151,1.861,4.151,4.15v38.497c0,2.285-1.864,4.15-4.151,4.15h-8.047c-2.287,0-4.147-1.865-4.147-4.15V49.331z
			 M33.713,49.331c0-2.289,1.86-4.15,4.151-4.15h8.043c2.289,0,4.152,1.861,4.152,4.15v38.497c0,2.285-1.863,4.15-4.152,4.15h-8.043
			c-2.291,0-4.151-1.865-4.151-4.15V49.331z M98.129,96.549H34.517c-0.707,0-1.277-0.57-1.277-1.277
			c0-0.703,0.571-1.275,1.277-1.275h63.612c0.706,0,1.277,0.572,1.277,1.275C99.406,95.979,98.835,96.549,98.129,96.549z
			 M101.828,85.857c-0.377,1.041-1.142,1.873-2.148,2.342l-7.293,3.391c-0.553,0.258-1.143,0.389-1.748,0.389
			c-1.607,0-3.089-0.943-3.765-2.4L70.642,54.671c-0.967-2.076-0.062-4.547,2.012-5.513l7.295-3.394
			c0.553-0.257,1.143-0.389,1.747-0.389c1.608,0,3.085,0.943,3.766,2.401l16.233,34.908C102.16,83.689,102.21,84.816,101.828,85.857
			z"/>
		<path fill="#FFFFFF" d="M60.848,84.66c1.355,0,2.458-1.105,2.458-2.459c0-1.357-1.103-2.461-2.458-2.461
			c-1.354,0-2.457,1.104-2.457,2.461C58.391,83.555,59.493,84.66,60.848,84.66z"/>
		<path fill="#FFFFFF" d="M83.145,48.856c-0.259-0.562-0.829-0.925-1.449-0.925c-0.23,0-0.458,0.051-0.668,0.15l-7.299,3.392
			c-0.796,0.373-1.142,1.323-0.771,2.121L89.189,88.5c0.259,0.561,0.83,0.926,1.449,0.926c0.233,0,0.46-0.055,0.671-0.152
			l7.295-3.391c0.387-0.182,0.678-0.502,0.824-0.902c0.146-0.398,0.13-0.832-0.053-1.219L83.145,48.856z M96.618,82.748
			c-0.458,1.258-1.379,2.26-2.594,2.826c-0.668,0.309-1.379,0.467-2.11,0.467c-1.943,0-3.729-1.139-4.549-2.898
			c-1.164-2.508-0.074-5.494,2.433-6.66c0.669-0.309,1.379-0.467,2.109-0.467c1.943,0,3.729,1.137,4.55,2.898
			C97.02,80.127,97.077,81.488,96.618,82.748z"/>
	</g>
</g>
</svg>
