<?xml version="1.0" encoding="utf-8"?>
<!-- Generator: Adobe Illustrator 16.0.0, SVG Export Plug-In . SVG Version: 6.00 Build 0)  -->
<!DOCTYPE svg PUBLIC "-//W3C//DTD SVG 1.1//EN" "http://www.w3.org/Graphics/SVG/1.1/DTD/svg11.dtd">
<svg version="1.1" id="Calque_1" xmlns="http://www.w3.org/2000/svg" xmlns:xlink="http://www.w3.org/1999/xlink" x="0px" y="0px"
	 width="141.73px" height="141.73px" viewBox="0 0 141.73 141.73" enable-background="new 0 0 141.73 141.73" xml:space="preserve">
<g>
	<defs>
		<rect id="SVGID_1_" x="467.124" y="517.865" width="53.887" height="53.887"/>
	</defs>
	<clipPath id="SVGID_2_">
		<use xlink:href="#SVGID_1_"  overflow="visible"/>
	</clipPath>
	<g clip-path="url(#SVGID_2_)">
		<path fill="#69696d" d="M494.245,542.473c0.537,0,0.964-0.396,1.053-0.907c0.001-0.003,0-0.006,0-0.009
			c0.001-0.005,0.004-0.008,0.005-0.013c0.008-0.054,0.032-0.104,0.032-0.16c0-0.6-0.488-1.088-1.09-1.088
			c-0.6,0-1.088,0.488-1.088,1.088C493.157,541.984,493.646,542.473,494.245,542.473z"/>
		<circle fill="#69696d" cx="488.204" cy="551.052" r="1.088"/>
		<circle fill="#69696d" cx="503.249" cy="542.57" r="1.088"/>
		<path fill="#69696d" d="M494.067,517.865c-14.88,0-26.943,12.063-26.943,26.943c0,14.88,12.063,26.943,26.943,26.943
			s26.943-12.063,26.943-26.943C521.011,529.928,508.947,517.865,494.067,517.865z M488.204,548.541
			c0.285,0,0.556,0.058,0.812,0.146l3.383-5.615c-0.409-0.447-0.665-1.036-0.665-1.688c0-1.385,1.127-2.511,2.512-2.511
			c1.276,0,2.322,0.961,2.479,2.195l4.165,0.679c0.343-0.979,1.265-1.688,2.359-1.688c0.632,0,1.202,0.242,1.645,0.628l2.989-2.147
			c-0.127-0.3-0.197-0.63-0.197-0.976c0-1.385,1.127-2.511,2.513-2.511c1.385,0,2.512,1.126,2.512,2.511
			c0,1.386-1.127,2.512-2.512,2.512c-0.522,0-1.008-0.161-1.41-0.435l-3.132,2.25c0.062,0.218,0.105,0.442,0.105,0.68
			c0,1.384-1.127,2.511-2.513,2.511c-1.174,0-2.154-0.813-2.427-1.904l-4.324-0.706c-0.407,0.839-1.26,1.424-2.253,1.424
			c-0.218,0-0.426-0.037-0.628-0.089l-3.439,5.711c0.332,0.425,0.538,0.953,0.538,1.533c0,1.385-1.127,2.512-2.512,2.512
			c-0.646,0-1.229-0.252-1.674-0.653l-3.242,1.804c-0.109,0.061-0.229,0.09-0.345,0.09c-0.25,0-0.492-0.132-0.622-0.365
			c-0.191-0.344-0.068-0.776,0.275-0.968l3.19-1.776c-0.055-0.206-0.094-0.419-0.094-0.643
			C485.693,549.667,486.819,548.541,488.204,548.541z M512.523,558.086l-3.815,2.909c-0.129,0.1-0.279,0.146-0.43,0.146
			c-0.215,0-0.427-0.096-0.566-0.28c-0.239-0.312-0.178-0.759,0.134-0.997l2.173-1.657h-28.689c-1.572,0-2.852-1.216-2.852-2.711
			V533.28l-1.883,2.315c-0.141,0.172-0.346,0.262-0.553,0.262c-0.158,0-0.316-0.052-0.447-0.159
			c-0.306-0.248-0.352-0.696-0.104-1.001l2.908-3.578c0.174-0.214,0.446-0.292,0.698-0.239c0.253-0.053,0.524,0.025,0.698,0.239
			l2.91,3.578c0.246,0.305,0.201,0.753-0.104,1.001c-0.132,0.107-0.29,0.159-0.448,0.159c-0.207,0-0.412-0.09-0.552-0.263
			l-1.701-2.091v21.992c0,0.71,0.642,1.288,1.429,1.288h29.008l-2.491-1.899c-0.313-0.237-0.373-0.685-0.134-0.996
			c0.238-0.313,0.686-0.373,0.997-0.136l3.815,2.91c0.225,0.172,0.314,0.453,0.259,0.714
			C512.837,557.636,512.749,557.915,512.523,558.086z"/>
		<path fill="#69696d" d="M479.059,532.565c0.022-0.004,0.044-0.012,0.067-0.014l-0.028-0.035L479.059,532.565z"/>
		<circle fill="#69696d" cx="510.198" cy="537.565" r="1.088"/>
	</g>
</g>
<g>
	<path fill="none" d="M71.201,123h51.25V71.75C122.451,100.054,99.505,123,71.201,123z"/>
	<path fill="none" d="M71.201,20.5h-51.25v51.25C19.951,43.445,42.898,20.5,71.201,20.5z"/>
	<path fill="none" d="M19.951,71.75V123h51.25C42.898,123,19.951,100.054,19.951,71.75z"/>
	<path fill="none" d="M78.553,52.25c-0.423-0.283-0.965-0.309-1.415-0.069c-0.445,0.24-0.724,0.708-0.724,1.213v36.711
		c0,0.509,0.278,0.976,0.724,1.215c0.204,0.11,0.43,0.163,0.652,0.163c0.266,0,0.532-0.077,0.763-0.231l27.533-18.356
		c0.383-0.255,0.613-0.685,0.613-1.145c0-0.46-0.23-0.889-0.613-1.146L78.553,52.25z M79.165,87.533V55.968l23.677,15.782
		L79.165,87.533z"/>
	<path fill="none" d="M71.201,20.5c28.304,0,51.25,22.945,51.25,51.25V20.5H71.201z"/>
	<path fill="#69696d" d="M71.201,20.5c-28.303,0-51.25,22.945-51.25,51.25c0,28.304,22.947,51.25,51.25,51.25
		c28.304,0,51.25-22.946,51.25-51.25C122.451,43.445,99.505,20.5,71.201,20.5z M49.074,90.15c0,0.788-0.639,1.427-1.427,1.427H39.73
		c-0.788,0-1.427-0.639-1.427-1.427V53.349c0-0.787,0.639-1.426,1.427-1.426h7.917c0.788,0,1.427,0.639,1.427,1.426V90.15z
		 M64.849,90.15c0,0.788-0.64,1.427-1.427,1.427h-7.913c-0.788,0-1.427-0.639-1.427-1.427V53.349c0-0.787,0.639-1.426,1.427-1.426
		h7.913c0.787,0,1.427,0.639,1.427,1.426V90.15z M106.086,72.895L78.553,91.251c-0.23,0.154-0.497,0.231-0.763,0.231
		c-0.223,0-0.448-0.053-0.652-0.163c-0.445-0.239-0.724-0.706-0.724-1.215V53.394c0-0.505,0.278-0.973,0.724-1.213
		c0.45-0.24,0.992-0.214,1.415,0.069l27.533,18.354c0.383,0.257,0.613,0.686,0.613,1.146
		C106.699,72.21,106.469,72.64,106.086,72.895z"/>
	<rect x="41.157" y="54.776" fill="#69696d" width="5.063" height="33.949"/>
	<rect x="56.935" y="54.776" fill="#69696d" width="5.06" height="33.949"/>
	<polygon fill="#69696d" points="79.165,87.533 102.842,71.75 79.165,55.968 	"/>
</g>
</svg>
