<?xml version="1.0" encoding="utf-8"?>
<!-- Generator: Adobe Illustrator 16.0.0, SVG Export Plug-In . SVG Version: 6.00 Build 0)  -->
<!DOCTYPE svg PUBLIC "-//W3C//DTD SVG 1.1//EN" "http://www.w3.org/Graphics/SVG/1.1/DTD/svg11.dtd">
<svg version="1.1" id="Calque_1" xmlns="http://www.w3.org/2000/svg" xmlns:xlink="http://www.w3.org/1999/xlink" x="0px" y="0px"
	 width="141.73px" height="141.73px" viewBox="0 0 141.73 141.73" enable-background="new 0 0 141.73 141.73" xml:space="preserve">
<g>
	<defs>
		<rect id="SVGID_1_" x="467.124" y="517.865" width="53.887" height="53.887"/>
	</defs>
	<clipPath id="SVGID_2_">
		<use xlink:href="#SVGID_1_"  overflow="visible"/>
	</clipPath>
	<g clip-path="url(#SVGID_2_)">
		<path fill="#69696d" d="M494.245,542.473c0.537,0,0.964-0.396,1.053-0.907c0.001-0.003,0-0.006,0-0.009
			c0.001-0.005,0.004-0.008,0.005-0.013c0.008-0.054,0.032-0.104,0.032-0.16c0-0.6-0.488-1.088-1.09-1.088
			c-0.6,0-1.088,0.488-1.088,1.088C493.157,541.984,493.646,542.473,494.245,542.473z"/>
		<circle fill="#69696d" cx="488.204" cy="551.052" r="1.088"/>
		<circle fill="#69696d" cx="503.249" cy="542.57" r="1.088"/>
		<path fill="#69696d" d="M494.067,517.865c-14.88,0-26.943,12.063-26.943,26.943c0,14.88,12.063,26.943,26.943,26.943
			s26.943-12.063,26.943-26.943C521.011,529.928,508.947,517.865,494.067,517.865z M488.204,548.541
			c0.285,0,0.556,0.058,0.812,0.146l3.383-5.615c-0.409-0.447-0.665-1.036-0.665-1.688c0-1.385,1.127-2.511,2.512-2.511
			c1.276,0,2.322,0.961,2.479,2.195l4.165,0.679c0.343-0.979,1.265-1.688,2.359-1.688c0.632,0,1.202,0.242,1.645,0.628l2.989-2.147
			c-0.127-0.3-0.197-0.63-0.197-0.976c0-1.385,1.127-2.511,2.513-2.511c1.385,0,2.512,1.126,2.512,2.511
			c0,1.386-1.127,2.512-2.512,2.512c-0.522,0-1.008-0.161-1.41-0.435l-3.132,2.25c0.062,0.218,0.105,0.442,0.105,0.68
			c0,1.384-1.127,2.511-2.513,2.511c-1.174,0-2.154-0.813-2.427-1.904l-4.324-0.706c-0.407,0.839-1.26,1.424-2.253,1.424
			c-0.218,0-0.426-0.037-0.628-0.089l-3.439,5.711c0.332,0.425,0.538,0.953,0.538,1.533c0,1.385-1.127,2.512-2.512,2.512
			c-0.646,0-1.229-0.252-1.674-0.653l-3.242,1.804c-0.109,0.061-0.229,0.09-0.345,0.09c-0.25,0-0.492-0.132-0.622-0.365
			c-0.191-0.344-0.068-0.776,0.275-0.968l3.19-1.776c-0.055-0.206-0.094-0.419-0.094-0.643
			C485.693,549.667,486.819,548.541,488.204,548.541z M512.523,558.086l-3.815,2.909c-0.129,0.1-0.279,0.146-0.43,0.146
			c-0.215,0-0.427-0.096-0.566-0.28c-0.239-0.312-0.178-0.759,0.134-0.997l2.173-1.657h-28.689c-1.572,0-2.852-1.216-2.852-2.711
			V533.28l-1.883,2.315c-0.141,0.172-0.346,0.262-0.553,0.262c-0.158,0-0.316-0.052-0.447-0.159
			c-0.306-0.248-0.352-0.696-0.104-1.001l2.908-3.578c0.174-0.214,0.446-0.292,0.698-0.239c0.253-0.053,0.524,0.025,0.698,0.239
			l2.91,3.578c0.246,0.305,0.201,0.753-0.104,1.001c-0.132,0.107-0.29,0.159-0.448,0.159c-0.207,0-0.412-0.09-0.552-0.263
			l-1.701-2.091v21.992c0,0.71,0.642,1.288,1.429,1.288h29.008l-2.491-1.899c-0.313-0.237-0.373-0.685-0.134-0.996
			c0.238-0.313,0.686-0.373,0.997-0.136l3.815,2.91c0.225,0.172,0.314,0.453,0.259,0.714
			C512.837,557.636,512.749,557.915,512.523,558.086z"/>
		<path fill="#69696d" d="M479.059,532.565c0.022-0.004,0.044-0.012,0.067-0.014l-0.028-0.035L479.059,532.565z"/>
		<circle fill="#69696d" cx="510.198" cy="537.565" r="1.088"/>
	</g>
</g>
<g>
	<defs>
		<rect id="SVGID_3_" x="22.061" y="18.333" width="97.606" height="97.607"/>
	</defs>
	<clipPath id="SVGID_4_">
		<use xlink:href="#SVGID_3_"  overflow="visible"/>
	</clipPath>
	<g clip-path="url(#SVGID_4_)">
		<path fill="#69696d" d="M71.187,62.907c0.973,0,1.745-0.719,1.906-1.646c0.002-0.003,0-0.01,0-0.014
			c0.002-0.01,0.007-0.014,0.009-0.024c0.014-0.095,0.058-0.187,0.058-0.291c0-1.084-0.884-1.969-1.973-1.969
			c-1.087,0-1.971,0.885-1.971,1.969C69.216,62.022,70.099,62.907,71.187,62.907z"/>
		<circle fill="#69696d" cx="60.244" cy="78.444" r="1.971"/>
		<path fill="#69696d" d="M87.495,65.054c1.089,0,1.974-0.885,1.974-1.97c0-1.087-0.885-1.971-1.974-1.971
			c-1.087,0-1.972,0.883-1.972,1.971C85.523,64.169,86.408,65.054,87.495,65.054z"/>
		<path fill="#69696d" d="M70.865,18.333c-26.953,0-48.804,21.849-48.804,48.805c0,26.949,21.851,48.802,48.804,48.802
			c26.952,0,48.802-21.854,48.802-48.802C119.667,40.183,97.816,18.333,70.865,18.333z M60.244,73.898
			c0.516,0,1.006,0.102,1.469,0.265l6.128-10.17c-0.741-0.811-1.205-1.878-1.205-3.061c0-2.508,2.041-4.546,4.55-4.546
			c2.312,0,4.206,1.741,4.49,3.977l7.545,1.228c0.621-1.772,2.291-3.055,4.273-3.055c1.145,0,2.178,0.438,2.979,1.137l5.414-3.89
			c-0.229-0.542-0.357-1.141-0.357-1.766c0-2.509,2.041-4.548,4.552-4.548c2.508,0,4.549,2.039,4.549,4.548
			s-2.041,4.549-4.549,4.549c-0.947,0-1.826-0.292-2.555-0.787l-5.673,4.074c0.112,0.397,0.191,0.804,0.191,1.232
			c0,2.507-2.041,4.549-4.551,4.549c-2.126,0-3.902-1.476-4.396-3.449l-7.834-1.281c-0.736,1.521-2.28,2.58-4.079,2.58
			c-0.396,0-0.771-0.068-1.139-0.16l-6.23,10.346c0.603,0.767,0.975,1.727,0.975,2.776c0,2.508-2.041,4.549-4.549,4.549
			c-1.169,0-2.227-0.456-3.032-1.185l-5.873,3.269c-0.198,0.109-0.414,0.163-0.624,0.163c-0.454,0-0.892-0.241-1.127-0.662
			c-0.347-0.622-0.124-1.407,0.499-1.755l5.778-3.215c-0.099-0.376-0.17-0.762-0.17-1.164
			C55.695,75.936,57.735,73.898,60.244,73.898z M104.294,91.187l-6.911,5.269c-0.233,0.18-0.506,0.265-0.778,0.265
			c-0.39,0-0.772-0.173-1.026-0.506c-0.434-0.565-0.321-1.375,0.242-1.808l3.936-3H47.791c-2.848,0-5.166-2.204-5.166-4.91V46.255
			l-3.41,4.194c-0.255,0.311-0.626,0.474-1.001,0.474c-0.286,0-0.573-0.094-0.81-0.289c-0.554-0.449-0.637-1.261-0.187-1.813
			l5.268-6.481c0.314-0.388,0.808-0.529,1.264-0.433c0.459-0.096,0.95,0.045,1.266,0.433l5.271,6.481
			c0.446,0.552,0.364,1.364-0.189,1.813c-0.239,0.195-0.526,0.289-0.812,0.289c-0.375,0-0.747-0.163-1-0.476l-3.081-3.788v39.836
			c0,1.284,1.162,2.331,2.588,2.331h52.542l-4.513-3.438c-0.566-0.432-0.676-1.241-0.242-1.804c0.433-0.57,1.242-0.677,1.807-0.248
			l6.91,5.271c0.407,0.311,0.57,0.82,0.469,1.294C104.862,90.37,104.702,90.875,104.294,91.187z"/>
		<path fill="#69696d" d="M43.678,44.96c0.041-0.007,0.08-0.021,0.123-0.025l-0.052-0.064L43.678,44.96z"/>
		<circle fill="#69696d" cx="100.082" cy="54.016" r="1.971"/>
	</g>
</g>
</svg>
