<?xml version="1.0" encoding="UTF-8"?>
<!-- Generator: Adobe Illustrator 25.4.1, SVG Export Plug-In . SVG Version: 6.00 Build 0)  -->
<svg version="1.1" id="Calque_1" xmlns="http://www.w3.org/2000/svg" xmlns:xlink="http://www.w3.org/1999/xlink" x="0px" y="0px" viewBox="0 0 500 500" style="enable-background:new 0 0 500 500;" xml:space="preserve">
<style type="text/css">
	.st0{fill:#1D1D1B;}
	.st1{fill:#FF5722;}
</style>
<g>
	<g>
		<path class="st0" d="M331.94,425.73c-13.26,0-22.7-10.69-22.7-23.66v-0.19c0-12.97,9.25-23.56,22.51-23.56s22.7,10.78,22.7,23.75    v0.19C354.45,415.24,345.2,425.73,331.94,425.73 M331.75,436.6c20.51,0,35.01-15.74,35.01-34.53v-0.19    c0-18.79-14.31-34.34-34.81-34.34c-20.51,0-35.01,15.74-35.01,34.53v0.19C296.94,421.05,311.24,436.6,331.75,436.6 M254.58,435.93    h10.4l27.66-67.25h-12.69l-20.03,51.32l-20.13-51.32h-12.97L254.58,435.93z M202.98,435.46h11.73v-66.77h-11.73V435.46z     M175.8,368.69l-16.69,24.23l-16.6-24.23h-13.83l23.18,32.81l-24.13,33.96h13.45l17.55-25.47l17.65,25.47h13.83l-24.23-34.15    l23.27-32.62H175.8z"/>
	</g>
	<path class="st1" d="M336.41,190.34c-10.16,0-19.49,3.43-26.98,9.15l-17.6-17.6v-72.42l17.51-17.51   c7.51,5.76,16.88,9.22,27.07,9.22c24.62,0,44.59-19.96,44.59-44.59S361.04,12,336.41,12c-24.62,0-44.59,19.96-44.59,44.59   c0,10.2,3.46,19.56,9.22,27.07l-17.43,17.44h-72.58l-17.52-17.52c5.72-7.5,9.15-16.83,9.15-26.98c0-24.62-19.96-44.59-44.59-44.59   s-44.59,19.96-44.59,44.59s19.96,44.59,44.59,44.59c10.15,0,19.49-3.43,26.98-9.15l17.6,17.6v72.42l-17.51,17.51   c-7.51-5.76-16.88-9.22-27.07-9.22c-24.62,0-44.59,19.96-44.59,44.59c0,24.62,19.96,44.59,44.59,44.59s44.59-19.96,44.59-44.59   c0-10.2-3.46-19.56-9.22-27.07l17.59-17.59h72.26l17.68,17.68c-5.72,7.5-9.15,16.83-9.15,26.98c0,24.62,19.96,44.59,44.59,44.59   c24.62,0,44.59-19.96,44.59-44.59C381,210.31,361.04,190.34,336.41,190.34z"/>
</g>
</svg>