<?xml version="1.0" encoding="UTF-8" standalone="no"?>
<!-- Created with Inkscape (http://www.inkscape.org/) -->

<svg
   xmlns:dc="http://purl.org/dc/elements/1.1/"
   xmlns:cc="http://creativecommons.org/ns#"
   xmlns:rdf="http://www.w3.org/1999/02/22-rdf-syntax-ns#"
   xmlns:svg="http://www.w3.org/2000/svg"
   xmlns="http://www.w3.org/2000/svg"
   xmlns:sodipodi="http://sodipodi.sourceforge.net/DTD/sodipodi-0.dtd"
   xmlns:inkscape="http://www.inkscape.org/namespaces/inkscape"
   width="210mm"
   height="297mm"
   viewBox="0 0 744.09448819 1052.3622047"
   id="svg2"
   version="1.1"
   inkscape:version="0.91 r13725"
   sodipodi:docname="agentstate.svg">
  <defs
     id="defs4" />
  <sodipodi:namedview
     id="base"
     pagecolor="#ffffff"
     bordercolor="#666666"
     borderopacity="1.0"
     inkscape:pageopacity="0.0"
     inkscape:pageshadow="2"
     inkscape:zoom="0.7"
     inkscape:cx="413.50021"
     inkscape:cy="608.26316"
     inkscape:document-units="px"
     inkscape:current-layer="layer1"
     showgrid="false"
     showguides="true"
     inkscape:window-width="1920"
     inkscape:window-height="1056"
     inkscape:window-x="1600"
     inkscape:window-y="24"
     inkscape:window-maximized="1" />
  <metadata
     id="metadata7">
    <rdf:RDF>
      <cc:Work
         rdf:about="">
        <dc:format>image/svg+xml</dc:format>
        <dc:type
           rdf:resource="http://purl.org/dc/dcmitype/StillImage" />
        <dc:title></dc:title>
      </cc:Work>
    </rdf:RDF>
  </metadata>
  <g
     inkscape:label="Layer 1"
     inkscape:groupmode="layer"
     id="layer1">
    <g
       id="g4461"
       transform="translate(-62.000529,135.59257)">
      <rect
         ry="4.5226102"
         y="36.647919"
         x="108.85602"
         height="78.571426"
         width="130"
         id="rect4136"
         style="fill:#a3a3a3;fill-opacity:1;fill-rule:nonzero;stroke:none" />
      <text
         sodipodi:linespacing="125%"
         id="text4201"
         y="81.851601"
         x="125.47711"
         style="font-style:normal;font-weight:normal;font-size:20px;line-height:125%;font-family:Sans;letter-spacing:0px;word-spacing:0px;fill:#ffffff;fill-opacity:1;stroke:none;stroke-width:1px;stroke-linecap:butt;stroke-linejoin:miter;stroke-opacity:1"
         xml:space="preserve"><tspan
           y="81.851601"
           x="125.47711"
           id="tspan4203"
           sodipodi:role="line">Déloggué</tspan></text>
    </g>
    <g
       id="g4469"
       transform="translate(406.47114,142.42718)">
      <rect
         ry="4.5226102"
         y="126.56856"
         x="108.85602"
         height="78.571426"
         width="130"
         id="rect4136-5"
         style="fill:#5cb85c;fill-opacity:1;fill-rule:nonzero;stroke:none" />
      <text
         sodipodi:linespacing="125%"
         id="text4201-7"
         y="173.71072"
         x="153.27496"
         style="font-style:normal;font-weight:normal;font-size:20px;line-height:125%;font-family:Sans;letter-spacing:0px;word-spacing:0px;fill:#ffffff;fill-opacity:1;stroke:none;stroke-width:1px;stroke-linecap:butt;stroke-linejoin:miter;stroke-opacity:1"
         xml:space="preserve"><tspan
           y="173.71072"
           x="153.27496"
           id="tspan4203-7"
           sodipodi:role="line">Prêt</tspan></text>
    </g>
    <g
       id="g4477"
       transform="translate(407.81612,-179.23922)">
      <rect
         ry="4.5226102"
         y="216.4892"
         x="108.85602"
         height="78.571426"
         width="130"
         id="rect4136-6"
         style="fill:#d9534f;fill-opacity:1;fill-rule:nonzero;stroke:none" />
      <text
         sodipodi:linespacing="125%"
         id="text4201-3"
         y="262.92334"
         x="143.97321"
         style="font-style:normal;font-weight:normal;font-size:20px;line-height:125%;font-family:Sans;letter-spacing:0px;word-spacing:0px;fill:#ffffff;fill-opacity:1;stroke:none;stroke-width:1px;stroke-linecap:butt;stroke-linejoin:miter;stroke-opacity:1"
         xml:space="preserve"><tspan
           y="262.92334"
           x="143.97321"
           id="tspan4203-8"
           sodipodi:role="line">Pause</tspan></text>
    </g>
    <g
       id="g4485"
       transform="translate(277.66427,-232.93416)">
      <rect
         ry="4.5226102"
         y="306.33051"
         x="108.85602"
         height="78.571426"
         width="130"
         id="rect4136-4"
         style="fill:#58acfa;fill-opacity:1;fill-rule:nonzero;stroke:none" />
      <text
         sodipodi:linespacing="125%"
         id="text4201-0"
         y="352.76465"
         x="135.98981"
         style="font-style:normal;font-weight:normal;font-size:20px;line-height:125%;font-family:Sans;letter-spacing:0px;word-spacing:0px;fill:#ffffff;fill-opacity:1;stroke:none;stroke-width:1px;stroke-linecap:butt;stroke-linejoin:miter;stroke-opacity:1"
         xml:space="preserve"><tspan
           y="352.76465"
           x="135.98981"
           id="tspan4203-2"
           sodipodi:role="line">Entrant</tspan></text>
    </g>
    <g
       id="g4493"
       transform="translate(201.98048,-374.38179)">
      <rect
         ry="4.5226102"
         y="396.2511"
         x="108.85602"
         height="78.571426"
         width="130"
         id="rect4136-1"
         style="fill:#a34719;fill-opacity:1;fill-rule:nonzero;stroke:none" />
      <text
         sodipodi:linespacing="125%"
         id="text4201-94"
         y="442.81708"
         x="136.52692"
         style="font-style:normal;font-weight:normal;font-size:20px;line-height:125%;font-family:Sans;letter-spacing:0px;word-spacing:0px;fill:#ffffff;fill-opacity:1;stroke:none;stroke-width:1px;stroke-linecap:butt;stroke-linejoin:miter;stroke-opacity:1"
         xml:space="preserve"><tspan
           y="442.81708"
           x="136.52692"
           id="tspan4203-4"
           sodipodi:role="line">Sortant</tspan></text>
    </g>
    <g
       id="g4506"
       transform="translate(-21.209423,105.31362)">
      <path
         style="fill:#f7612f;fill-opacity:1;fill-rule:nonzero;stroke:none"
         d="m 205.75958,52.163797 120.95478,0 c 2.50552,0 4.52261,2.01709 4.52261,4.52261 l 0,69.526213 c 0,2.50552 -2.01709,4.52261 -4.52261,4.52261 l -120.95478,0 c -2.50553,0 -4.52261,-2.01709 -4.52261,-4.52261 l 0,-69.526213 c 0,-2.50552 2.01708,-4.52261 4.52261,-4.52261 z"
         id="rect4136-7"
         inkscape:connector-curvature="0" />
      <g
         transform="translate(100.91122,-430.28816)"
         style="font-style:normal;font-weight:normal;font-size:20px;line-height:125%;font-family:Sans;letter-spacing:0px;word-spacing:0px;fill:#ffffff;fill-opacity:1;stroke:none;stroke-width:1px;stroke-linecap:butt;stroke-linejoin:miter;stroke-opacity:1"
         id="text4201-1">
        <path
           d="m 127.47418,512.36755 1.99219,0 3.06641,12.32422 3.05664,-12.32422 2.21679,0 3.06641,12.32422 3.05664,-12.32422 2.00195,0 -3.66211,14.58008 -2.48046,0 -3.07618,-12.65625 -3.10547,12.65625 -2.48046,0 -3.65235,-14.58008 z"
           id="path4413"
           inkscape:connector-curvature="0" />
        <path
           d="m 153.89996,517.68982 q -0.30273,-0.17578 -0.66406,-0.25391 -0.35156,-0.0879 -0.78125,-0.0879 -1.52344,0 -2.34375,0.9961 -0.81055,0.98632 -0.81055,2.84179 l 0,5.76172 -1.80664,0 0,-10.9375 1.80664,0 0,1.69922 q 0.56641,-0.99609 1.47461,-1.47461 0.90821,-0.48828 2.20703,-0.48828 0.18555,0 0.41016,0.0293 0.22461,0.0195 0.49805,0.0684 l 0.01,1.8457 z"
           id="path4415"
           inkscape:connector-curvature="0" />
        <path
           d="m 160.77496,521.44958 q -2.17773,0 -3.01757,0.49805 -0.83985,0.49805 -0.83985,1.69922 0,0.95703 0.625,1.52344 0.63477,0.55664 1.71875,0.55664 1.49414,0 2.39258,-1.05469 0.9082,-1.06445 0.9082,-2.82226 l 0,-0.4004 -1.78711,0 z m 3.58399,-0.74218 0,6.24023 -1.79688,0 0,-1.66015 q -0.61523,0.99609 -1.5332,1.4746 -0.91797,0.46875 -2.24609,0.46875 -1.67969,0 -2.67579,-0.9375 -0.98632,-0.94726 -0.98632,-2.52929 0,-1.84571 1.23047,-2.78321 1.24023,-0.9375 3.6914,-0.9375 l 2.51953,0 0,-0.17578 q 0,-1.24023 -0.82031,-1.91406 -0.81055,-0.68359 -2.28516,-0.68359 -0.9375,0 -1.82617,0.22461 -0.88867,0.22461 -1.70898,0.67382 l 0,-1.66015 q 0.98633,-0.38086 1.91406,-0.56641 0.92773,-0.19531 1.80664,-0.19531 2.37305,0 3.54492,1.23047 1.17188,1.23047 1.17188,3.73047 z"
           id="path4417"
           inkscape:connector-curvature="0" />
        <path
           d="m 169.80817,525.30701 0,5.80078 -1.80664,0 0,-15.09766 1.80664,0 0,1.66016 q 0.5664,-0.97656 1.42578,-1.44531 0.86914,-0.47852 2.07031,-0.47852 1.99219,0 3.23242,1.58203 1.25,1.58203 1.25,4.16016 0,2.57812 -1.25,4.16015 -1.24023,1.58203 -3.23242,1.58203 -1.20117,0 -2.07031,-0.46875 -0.85938,-0.47851 -1.42578,-1.45507 z m 6.11328,-3.81836 q 0,-1.98242 -0.82031,-3.10547 -0.81055,-1.13281 -2.23633,-1.13281 -1.42578,0 -2.2461,1.13281 -0.81054,1.12305 -0.81054,3.10547 0,1.98242 0.81054,3.11523 0.82032,1.12305 2.2461,1.12305 1.42578,0 2.23633,-1.12305 0.82031,-1.13281 0.82031,-3.11523 z"
           id="path4419"
           inkscape:connector-curvature="0" />
        <path
           d="m 180.57965,522.63123 0,-6.6211 1.79688,0 0,6.55274 q 0,1.55273 0.60546,2.33398 0.60547,0.77148 1.81641,0.77148 1.45508,0 2.29492,-0.92773 0.84961,-0.92773 0.84961,-2.5293 l 0,-6.20117 1.79688,0 0,10.9375 -1.79688,0 0,-1.67969 q -0.65429,0.9961 -1.52344,1.48438 -0.85937,0.47851 -2.00195,0.47851 -1.88476,0 -2.86133,-1.17187 -0.97656,-1.17188 -0.97656,-3.42773 z m 4.52149,-6.88477 0,0 z"
           id="path4421"
           inkscape:connector-curvature="0" />
        <path
           d="m 195.19879,525.30701 0,5.80078 -1.80664,0 0,-15.09766 1.80664,0 0,1.66016 q 0.56641,-0.97656 1.42578,-1.44531 0.86914,-0.47852 2.07032,-0.47852 1.99218,0 3.23242,1.58203 1.25,1.58203 1.25,4.16016 0,2.57812 -1.25,4.16015 -1.24024,1.58203 -3.23242,1.58203 -1.20118,0 -2.07032,-0.46875 -0.85937,-0.47851 -1.42578,-1.45507 z m 6.11328,-3.81836 q 0,-1.98242 -0.82031,-3.10547 -0.81055,-1.13281 -2.23633,-1.13281 -1.42578,0 -2.24609,1.13281 -0.81055,1.12305 -0.81055,3.10547 0,1.98242 0.81055,3.11523 0.82031,1.12305 2.24609,1.12305 1.42578,0 2.23633,-1.12305 0.82031,-1.13281 0.82031,-3.11523 z"
           id="path4423"
           inkscape:connector-curvature="0" />
      </g>
    </g>
    <g
       id="g4443"
       transform="translate(473.31861,-445.50556)">
      <rect
         ry="4.5226102"
         y="576.09229"
         x="108.85602"
         height="78.571426"
         width="130"
         id="rect4136-8"
         style="fill:#3c3cbc;fill-opacity:1;fill-rule:nonzero;stroke:none" />
      <text
         sodipodi:linespacing="125%"
         id="text4201-33"
         y="622.65826"
         x="121.57574"
         style="font-style:normal;font-weight:normal;font-size:20px;line-height:125%;font-family:Sans;letter-spacing:0px;word-spacing:0px;fill:#ffffff;fill-opacity:1;stroke:none;stroke-width:1px;stroke-linecap:butt;stroke-linejoin:miter;stroke-opacity:1"
         xml:space="preserve"><tspan
           y="622.65826"
           x="121.57574"
           id="tspan4203-5"
           sodipodi:role="line">Conv. ACD</tspan></text>
    </g>
    <g
       id="g4448"
       transform="translate(323.48312,-515.84839)">
      <rect
         ry="4.5226102"
         y="666.01294"
         x="108.85602"
         height="78.571426"
         width="130"
         id="rect4136-42"
         style="fill:#ffcc99;fill-opacity:1;fill-rule:nonzero;stroke:none" />
      <text
         sodipodi:linespacing="125%"
         id="text4201-71"
         y="712.7547"
         x="129.22223"
         style="font-style:normal;font-weight:normal;font-size:20px;line-height:125%;font-family:Sans;letter-spacing:0px;word-spacing:0px;fill:#ffffff;fill-opacity:1;stroke:none;stroke-width:1px;stroke-linecap:butt;stroke-linejoin:miter;stroke-opacity:1"
         xml:space="preserve"><tspan
           y="712.7547"
           x="129.22223"
           id="tspan4203-1"
           sodipodi:role="line">Emission</tspan></text>
    </g>
    <g
       id="g4453"
       transform="translate(218.73127,-499.68701)">
      <rect
         ry="4.5226102"
         y="755.93359"
         x="108.85602"
         height="78.571426"
         width="130"
         id="rect4136-59"
         style="fill:#f89406;fill-opacity:1;fill-rule:nonzero;stroke:none" />
      <text
         sodipodi:linespacing="125%"
         id="text4201-4"
         y="802.67535"
         x="129.3736"
         style="font-style:normal;font-weight:normal;font-size:20px;line-height:125%;font-family:Sans;letter-spacing:0px;word-spacing:0px;fill:#ffffff;fill-opacity:1;stroke:none;stroke-width:1px;stroke-linecap:butt;stroke-linejoin:miter;stroke-opacity:1"
         xml:space="preserve"><tspan
           y="802.67535"
           x="129.3736"
           id="tspan4203-83"
           sodipodi:role="line">Sonnerie</tspan></text>
    </g>
    <text
       xml:space="preserve"
       style="font-style:normal;font-weight:normal;font-size:40px;line-height:125%;font-family:Sans;letter-spacing:0px;word-spacing:0px;fill:#000000;fill-opacity:1;stroke:none;stroke-width:1px;stroke-linecap:butt;stroke-linejoin:miter;stroke-opacity:1"
       x="110"
       y="429.50507"
       id="text4287"
       sodipodi:linespacing="125%"><tspan
         sodipodi:role="line"
         id="tspan4289"
         x="110"
         y="429.50507"></tspan></text>
  </g>
</svg>
