<svg xmlns="http://www.w3.org/2000/svg" xmlns:xlink="http://www.w3.org/1999/xlink" width="234" height="234" viewBox="0 0 234 234">
    <defs>
        <path id="b" d="M116.615 233.23c64.405 0 116.615-52.21 116.615-116.615S181.02 0 116.615 0 0 52.21 0 116.615 52.21 233.23 116.615 233.23z"/>
        <filter id="a" width="200%" height="200%" x="-50%" y="-50%" filterUnits="objectBoundingBox">
            <feOffset dy="7" in="SourceAlpha" result="shadowOffsetOuter1"/>
            <feGaussianBlur in="shadowOffsetOuter1" result="shadowBlurOuter1" stdDeviation="8"/>
            <feColorMatrix in="shadowBlurOuter1" values="0 0 0 0 0 0 0 0 0 0 0 0 0 0 0 0 0 0 0.5 0"/>
        </filter>
    </defs>
    <g fill="none" fill-rule="evenodd">
        <use fill="#000" filter="url(#a)" xlink:href="#b"/>
        <use fill="#FFF" xlink:href="#b"/>
        <path fill="#595959" d="M81.402 67.786c0-3.192 1.166-5.955 3.497-8.287C87.23 57.166 89.99 56 93.18 56h47.114c3.19 0 5.95 1.166 8.282 3.499 2.331 2.332 3.497 5.095 3.497 8.287v94.285c0 3.192-1.166 5.955-3.497 8.287-2.331 2.333-5.092 3.5-8.282 3.5H93.181c-3.19 0-5.95-1.167-8.282-3.5-2.331-2.332-3.497-5.095-3.497-8.287V67.786zm8.834 79.553c0 .798.292 1.489.874 2.072.583.583 1.273.875 2.07.875h47.115c.798 0 1.488-.292 2.07-.875.584-.583.875-1.274.875-2.072V82.518c0-.798-.291-1.489-.874-2.072s-1.273-.875-2.07-.875H93.18c-.798 0-1.488.292-2.07.875-.583.583-.875 1.274-.875 2.072v64.821zm17.668-78.08c0 .982.49 1.473 1.472 1.473H124.1c.981 0 1.472-.49 1.472-1.473 0-.982-.49-1.473-1.472-1.473h-14.724c-.981 0-1.472.49-1.472 1.473zm1.472 92.812c0 2.026.721 3.76 2.163 5.203 1.442 1.442 3.175 2.163 5.199 2.163s3.758-.72 5.2-2.163c1.44-1.443 2.162-3.177 2.162-5.203 0-2.025-.721-3.76-2.163-5.202-1.441-1.442-3.175-2.164-5.199-2.164s-3.757.722-5.2 2.164c-1.44 1.443-2.162 3.177-2.162 5.202z"/>
    </g>
</svg>
