<?xml version="1.0" encoding="UTF-8" standalone="no"?>
<svg width="68px" height="68px" viewBox="0 0 68 68" version="1.1" xmlns="http://www.w3.org/2000/svg" xmlns:xlink="http://www.w3.org/1999/xlink">
    <!-- Generator: Sketch 40 (33762) - http://www.bohemiancoding.com/sketch -->
    <title>chevron_down</title>
    <desc>Created with Sketch.</desc>
    <defs></defs>
    <g id="Symbols" stroke="none" stroke-width="1" fill="none" fill-rule="evenodd">
        <g id="chevron_down">
            <g id="Group-2" transform="translate(0.363224, 0.363224)">
                <path d="M33.5484305,66.8670395 C51.9497901,66.8670395 66.8670395,51.9497901 66.8670395,33.5484305 C66.8670395,15.1470708 51.9497901,0.229821429 33.5484305,0.229821429 C15.1470708,0.229821429 0.229821429,15.1470708 0.229821429,33.5484305 C0.229821429,51.9497901 15.1470708,66.8670395 33.5484305,66.8670395 Z" id="Oval-8" fill="#595959" transform="translate(33.548430, 33.548430) scale(-1, 1) rotate(-90.000000) translate(-33.548430, -33.548430) "></path>
                <path d="M31.2235287,39.2040505 L36.2385114,39.1841678 L24.4837061,25.8567242 C23.2665062,24.476679 21.1610231,24.3446668 19.7809779,25.5618666 C18.4009326,26.7790665 18.2689204,28.8845497 19.4861203,30.2645949 L31.2409255,43.5920385 C32.5743844,45.1038966 34.9344791,45.0945396 36.2559082,43.5721559 L47.8241293,30.2447123 C49.0303483,28.855059 48.8816454,26.7506888 47.4919922,25.5444698 C46.102339,24.3382508 43.9979688,24.4869536 42.7917498,25.8766068 L31.2235287,39.2040505 Z" id="Shape-3" fill="#FFFFFF"></path>
            </g>
        </g>
    </g>
</svg>