<svg xmlns="http://www.w3.org/2000/svg" width="119" height="119" viewBox="0 0 119 119">
    <g fill="none" fill-rule="evenodd">
        <path fill="#545454" d="M57.617 54.45a4.192 4.192 0 0 0-.023 5.929 4.192 4.192 0 0 0 5.929.003l29.768-29.64a4.192 4.192 0 0 0 .023-5.928 4.192 4.192 0 0 0-5.928-.003l-29.77 29.64z"/>
        <path fill="#545454" d="M63.659 24.798a4.192 4.192 0 0 0-5.929-.003 4.192 4.192 0 0 0-.023 5.928L87.25 60.395a4.192 4.192 0 0 0 5.928.003 4.192 4.192 0 0 0 .023-5.929L63.659 24.798z"/>
        <path fill="#C1C1C1" d="M25.045 55.937c0-2.148.598-4.32 1.793-6.516 1.312-2.359 2.554-3.783 3.725-4.274.586-.257 1.389-.502 2.408-.735 1.02-.234 1.845-.35 2.478-.35.328 0 .574.034.738.104.422.14 1.043 1.028 1.863 2.663.258.444.609 1.074 1.054 1.892.445.817.855 1.559 1.23 2.224.375.666.738 1.29 1.09 1.874.07.094.275.386.615.876.34.49.592.905.756 1.244.164.338.246.671.246.998 0 .467-.334 1.051-1.002 1.752-.668.7-1.394 1.343-2.18 1.927a21.148 21.148 0 0 0-2.178 1.856c-.668.654-1.002 1.191-1.002 1.612 0 .21.059.473.176.788.117.315.216.555.299.718.082.164.246.444.492.841.246.397.38.619.404.666 1.78 3.2 3.82 5.943 6.115 8.232 2.297 2.289 5.05 4.32 8.26 6.096.047.023.27.157.668.403.398.245.68.408.843.49.165.082.405.181.721.298.316.117.58.175.79.175.423 0 .962-.333 1.618-.998a21.116 21.116 0 0 0 1.862-2.172 17.095 17.095 0 0 1 1.934-2.172c.703-.666 1.288-.999 1.757-.999.328 0 .662.082 1.002.245.34.164.755.415 1.247.754.492.338.785.543.88.613.585.35 1.212.712 1.88 1.086.667.373 1.411.782 2.231 1.226.82.444 1.453.794 1.898 1.05 1.64.818 2.53 1.437 2.672 1.858.07.163.105.408.105.735 0 .63-.117 1.454-.352 2.47-.234 1.016-.48 1.816-.738 2.4-.492 1.167-1.921 2.405-4.288 3.713-2.202 1.191-4.381 1.787-6.537 1.787-.633 0-1.248-.041-1.845-.123a15.235 15.235 0 0 1-2.021-.438c-.75-.21-1.307-.38-1.67-.508s-1.013-.368-1.95-.718c-.938-.35-1.512-.56-1.723-.63-2.296-.818-4.346-1.787-6.15-2.908-3-1.845-6.099-4.362-9.297-7.55-3.199-3.188-5.723-6.276-7.574-9.266-1.125-1.798-2.098-3.842-2.918-6.13-.07-.21-.28-.783-.632-1.717s-.592-1.582-.72-1.944a28.489 28.489 0 0 1-.51-1.664 15.099 15.099 0 0 1-.44-2.015 13.47 13.47 0 0 1-.123-1.839z"/>
    </g>
</svg>
