<?xml version="1.0" encoding="UTF-8" standalone="no"?>
<svg width="128px" height="101px" viewBox="0 0 128 101" version="1.1" xmlns="http://www.w3.org/2000/svg" xmlns:xlink="http://www.w3.org/1999/xlink">
    <!-- Generator: Sketch 40 (33762) - http://www.bohemiancoding.com/sketch -->
    <title>hangup_big</title>
    <desc>Created with Sketch.</desc>
    <defs></defs>
    <g id="Symbols" stroke="none" stroke-width="1" fill="none" fill-rule="evenodd">
        <g id="hangup_big" fill="#FFFFFF">
            <g id="Group-14-Copy" transform="translate(-9.750000, -39.000000)">
                <g id="Group-2" transform="translate(0.329661, 0.000000)">
                    <g id="Group-9">
                        <g id="Group-7">
                            <path d="M25.4705884,33.6263237 C28.2163258,28.6947689 30.814931,25.7163497 33.2664822,24.690977 C34.4922578,24.1538769 36.1715452,23.6411982 38.3043947,23.1529255 C40.4372442,22.6646527 42.1655619,22.42052 43.4893995,22.42052 C44.1758338,22.42052 44.6906519,22.4937598 45.033869,22.6402416 C45.9164275,22.9332053 47.2157301,24.7886139 48.9318159,28.2065232 C49.4711572,29.1342415 50.2066115,30.4525581 51.1382009,32.1615128 C52.0697904,33.8704674 52.9278204,35.4207102 53.7123168,36.8122875 C54.4968132,38.2038649 55.2567826,39.5099749 55.992248,40.7306568 C56.1393411,40.9259659 56.5683561,41.5362977 57.2793059,42.5616705 C57.9902558,43.5870433 58.5173314,44.4537144 58.8605485,45.1617099 C59.2037657,45.8697054 59.3753717,46.5654837 59.3753717,47.2490655 C59.3753717,48.2256111 58.6766901,49.4462746 57.2793059,50.9110929 C55.8819218,52.3759112 54.3619828,53.7186411 52.7194435,54.939323 C51.0769043,56.1600049 49.5569653,57.4539083 48.1595812,58.821072 C46.762197,60.1882357 46.0635154,61.3112462 46.0635154,62.1901372 C46.0635154,62.6295827 46.1860911,63.1788813 46.4312462,63.8380495 C46.6764013,64.4972177 46.8847801,64.9976898 47.0563886,65.3394807 C47.2279972,65.6812717 47.5712092,66.2671902 48.086035,67.0972539 C48.6008607,67.9273176 48.8827849,68.3911697 48.9318159,68.4888243 C52.6581737,75.178161 56.9238088,80.9152799 61.7288491,85.7003529 C66.5338894,90.4854259 72.2949482,94.7333352 79.0121985,98.4442081 C79.1102605,98.4930354 79.5760482,98.773788 80.4095756,99.2864744 C81.243103,99.7991608 81.8314665,100.140947 82.1746837,100.311842 C82.5179008,100.482738 83.0204613,100.69025 83.6823801,100.934387 C84.3442989,101.178523 84.8958897,101.300589 85.3371689,101.300589 C86.2197273,101.300589 87.3474239,100.604811 88.7202926,99.2132339 C90.0931612,97.8216565 91.3924639,96.3080337 92.6182395,94.67232 C93.8440151,93.0366062 95.192348,91.5229834 96.6632787,90.131406 C98.1342094,88.7398287 99.3599666,88.0440504 100.340587,88.0440504 C101.027021,88.0440504 101.725703,88.2149433 102.436653,88.5567343 C103.147603,88.8985252 104.01789,89.4234105 105.047542,90.131406 C106.077193,90.8394015 106.690072,91.2666338 106.886196,91.4131156 C108.111972,92.1455247 109.423532,92.9023362 110.820916,93.6835726 C112.2183,94.464809 113.775012,95.3192735 115.491098,96.2469917 C117.207183,97.17471 118.531001,97.9071081 119.462591,98.4442081 C122.894762,100.153163 124.757913,101.447066 125.052099,102.325957 C125.199192,102.667748 125.272738,103.180427 125.272738,103.864009 C125.272738,105.182345 125.027586,106.903481 124.537276,109.027467 C124.046966,111.151454 123.532148,112.823763 122.992807,114.044445 C121.963155,116.485809 118.972308,119.073615 114.020174,121.807943 C109.411258,124.298134 104.851441,125.543211 100.340587,125.543211 C99.0167494,125.543211 97.7297044,125.457764 96.4794133,125.286869 C95.2291222,125.115973 93.8195014,124.810807 92.2505086,124.371362 C90.6815159,123.931916 89.5170465,123.577924 88.7570657,123.309374 C87.9970848,123.040824 86.6364943,122.540352 84.6752534,121.807943 C82.7140124,121.075534 81.5127704,120.636095 81.0714912,120.489613 C76.2664508,118.780658 71.9763006,116.754357 68.2009118,114.410647 C61.9249408,110.553293 55.4406852,105.292233 48.7479505,98.6273095 C42.0552158,91.9623864 36.7722022,85.505076 32.8987514,79.2551847 C30.5452622,75.4954845 28.5105053,71.223162 26.7944195,66.438089 C26.6473264,65.9986435 26.2060538,64.8023932 25.4705884,62.8493021 C24.7351231,60.8962111 24.2325626,59.5412745 23.962892,58.7844518 C23.6932214,58.027629 23.3377518,56.8679986 22.8964726,55.3055258 C22.4551934,53.7430529 22.1487541,52.3392898 21.9771455,51.0941943 C21.8055369,49.8490987 21.7197339,48.567402 21.7197339,47.2490655 C21.7197339,42.7569562 22.9700062,38.2160877 25.4705884,33.6263237 Z" id="" transform="translate(73.496236, 73.981865) rotate(-225.000000) translate(-73.496236, -73.981865) "></path>
                        </g>
                    </g>
                    <path d="M93.7294048,107.488316 C93.7294048,108.389707 93.4126064,109.155877 92.7790001,109.786851 L82.7997513,119.724631 L92.7790001,129.662411 C93.4126064,130.293384 93.7294048,131.059555 93.7294048,131.960945 C93.7294048,132.862336 93.4126064,133.628506 92.7790001,134.259479 L88.162749,138.856548 C87.5291427,139.487521 86.7597752,139.803003 85.8546234,139.803003 C84.9494715,139.803003 84.180104,139.487521 83.5464978,138.856548 L73.5672489,128.918768 L63.588,138.856548 C62.9543938,139.487521 62.1850263,139.803003 61.2798744,139.803003 C60.3747226,139.803003 59.6053551,139.487521 58.9717488,138.856548 L54.3554977,134.259479 C53.7218914,133.628506 53.405093,132.862336 53.405093,131.960945 C53.405093,131.059555 53.7218914,130.293384 54.3554977,129.662411 L64.3347465,119.724631 L54.3554977,109.786851 C53.7218914,109.155877 53.405093,108.389707 53.405093,107.488316 C53.405093,106.586926 53.7218914,105.820755 54.3554977,105.189782 L58.9717488,100.592714 C59.6053551,99.9617404 60.3747226,99.6462585 61.2798744,99.6462585 C62.1850263,99.6462585 62.9543938,99.9617404 63.588,100.592714 L73.5672489,110.530494 L83.5464978,100.592714 C84.180104,99.9617404 84.9494715,99.6462585 85.8546234,99.6462585 C86.7597752,99.6462585 87.5291427,99.9617404 88.162749,100.592714 L92.7790001,105.189782 C93.4126064,105.820755 93.7294048,106.586926 93.7294048,107.488316 L93.7294048,107.488316" id=""></path>
                </g>
            </g>
        </g>
    </g>
</svg>