<?xml version="1.0" encoding="UTF-8" standalone="no"?>
<svg width="180px" height="180px" viewBox="0 0 180 180" version="1.1" xmlns="http://www.w3.org/2000/svg" xmlns:xlink="http://www.w3.org/1999/xlink">
    <!-- Generator: Sketch 40 (33762) - http://www.bohemiancoding.com/sketch -->
    <title>connexion</title>
    <desc>Created with Sketch.</desc>
    <defs>
        <filter x="-50%" y="-50%" width="200%" height="200%" filterUnits="objectBoundingBox" id="filter-1">
            <feOffset dx="2" dy="2" in="SourceAlpha" result="shadowOffsetOuter1"></feOffset>
            <feGaussianBlur stdDeviation="4" in="shadowOffsetOuter1" result="shadowBlurOuter1"></feGaussianBlur>
            <feColorMatrix values="0 0 0 0 0   0 0 0 0 0   0 0 0 0 0  0 0 0 0.5 0" type="matrix" in="shadowBlurOuter1" result="shadowMatrixOuter1"></feColorMatrix>
            <feMerge>
                <feMergeNode in="shadowMatrixOuter1"></feMergeNode>
                <feMergeNode in="SourceGraphic"></feMergeNode>
            </feMerge>
        </filter>
    </defs>
    <g id="Symbols" stroke="none" stroke-width="1" fill="none" fill-rule="evenodd">
        <g id="connexion">
            <g id="Group-5" filter="url(#filter-1)" transform="translate(15.000000, 15.000000)">
                <ellipse id="Oval-1-Copy-2" fill="#FFFFFF" cx="75" cy="75" rx="75" ry="75"></ellipse>
                <path d="M47.6428571,76.7857143 C47.6428571,72.3846506 48.6161547,68.2375567 50.562779,64.344308 C52.5094033,60.4510594 55.2479362,57.1865831 58.7784598,54.5507813 C59.8182716,53.7769679 60.9729289,53.4747015 62.2424665,53.6439732 C63.5120041,53.8132449 64.5215736,54.4177775 65.2712054,55.4575893 C66.0450188,56.4732194 66.3412397,57.6157861 66.1598772,58.8853237 C65.9785147,60.1548613 65.3800274,61.1765214 64.3643973,61.9503348 C61.9945938,63.7397783 60.1628599,65.9281865 58.8691406,68.515625 C57.5754214,71.1030635 56.9285714,73.8597324 56.9285714,76.7857143 C56.9285714,79.3006078 57.4182429,81.7006024 58.3976004,83.9857701 C59.376958,86.2709378 60.7008845,88.2477595 62.3694196,89.9162946 C64.0379548,91.5848298 66.0147765,92.9087563 68.2999442,93.8881138 C70.5851119,94.8674714 72.9851065,95.3571429 75.5,95.3571429 C78.0148935,95.3571429 80.4148881,94.8674714 82.7000558,93.8881138 C84.9852235,92.9087563 86.9620452,91.5848298 88.6305804,89.9162946 C90.2991155,88.2477595 91.623042,86.2709378 92.6023996,83.9857701 C93.5817571,81.7006024 94.0714286,79.3006078 94.0714286,76.7857143 C94.0714286,73.8597324 93.4245786,71.1030635 92.1308594,68.515625 C90.8371401,65.9281865 89.0054062,63.7397783 86.6356027,61.9503348 C85.6199726,61.1765214 85.0214853,60.1548613 84.8401228,58.8853237 C84.6587603,57.6157861 84.9549813,56.4732194 85.7287946,55.4575893 C86.4784264,54.4177775 87.4940412,53.8132449 88.7756696,53.6439732 C90.0572981,53.4747015 91.2059101,53.7769679 92.2215402,54.5507813 C95.7520638,57.1865831 98.4905967,60.4510594 100.437221,64.344308 C102.383845,68.2375567 103.357143,72.3846506 103.357143,76.7857143 C103.357143,80.5580546 102.619613,84.1610691 101.144531,87.5948661 C99.6694495,91.028663 97.6865824,93.990873 95.1958705,96.4815848 C92.7051587,98.9722967 89.7429487,100.955164 86.3091518,102.430246 C82.8753549,103.905327 79.2723403,104.642857 75.5,104.642857 C71.7276597,104.642857 68.1246451,103.905327 64.6908482,102.430246 C61.2570513,100.955164 58.2948413,98.9722967 55.8041295,96.4815848 C53.3134176,93.990873 51.3305505,91.028663 49.8554688,87.5948661 C48.380387,84.1610691 47.6428571,80.5580546 47.6428571,76.7857143 L47.6428571,76.7857143 Z M70.8571429,72.1428571 L70.8571429,48.9285714 C70.8571429,47.6711247 71.3165877,46.5829659 72.2354911,45.6640625 C73.1543945,44.7451591 74.2425532,44.2857143 75.5,44.2857143 C76.7574468,44.2857143 77.8456055,44.7451591 78.7645089,45.6640625 C79.6834123,46.5829659 80.1428571,47.6711247 80.1428571,48.9285714 L80.1428571,72.1428571 C80.1428571,73.4003039 79.6834123,74.4884627 78.7645089,75.4073661 C77.8456055,76.3262695 76.7574468,76.7857143 75.5,76.7857143 C74.2425532,76.7857143 73.1543945,76.3262695 72.2354911,75.4073661 C71.3165877,74.4884627 70.8571429,73.4003039 70.8571429,72.1428571 L70.8571429,72.1428571 Z" id="" fill="#58524F" transform="translate(75.500000, 74.464286) scale(-1, 1) translate(-75.500000, -74.464286) "></path>
            </g>
        </g>
    </g>
</svg>