{
  "annotations": {
    "list": [
      {
        "builtIn": 1,
        "datasource": {
          "type": "grafana",
          "uid": "-- Grafana --"
        },
        "enable": true,
        "hide": true,
        "iconColor": "rgba(0, 211, 255, 1)",
        "name": "Annotations & Alerts",
        "target": {
          "limit": 100,
          "matchAny": false,
          "tags": [],
          "type": "dashboard"
        },
        "type": "dashboard"
      }
    ]
  },
  "editable": true,
  "fiscalYearStartMonth": 0,
  "graphTooltip": 0,
  "links": [],
  "liveNow": false,
  "panels": [
    {
      "collapsed": false,
      "gridPos": {
        "h": 1,
        "w": 24,
        "x": 0,
        "y": 0
      },
      "id": 50,
      "panels": [],
      "title": "XIVO",
      "type": "row"
    },
    {
      "datasource": {
        "type": "postgres",
        "uid": "USM"
      },
      "fieldConfig": {
        "defaults": {
          "custom": {
            "align": "auto",
            "cellOptions": {
              "type": "auto"
            },
            "inspect": false
          },
          "mappings": [],
          "thresholds": {
            "mode": "absolute",
            "steps": [
              {
                "color": "green",
                "value": null
              },
              {
                "color": "red",
                "value": 80
              }
            ]
          }
        },
        "overrides": []
      },
      "gridPos": {
        "h": 3,
        "w": 12,
        "x": 0,
        "y": 1
      },
      "id": 51,
      "options": {
        "footer": {
          "countRows": false,
          "fields": "",
          "reducer": [
            "sum"
          ],
          "show": false
        },
        "showHeader": true
      },
      "pluginVersion": "",
      "targets": [
        {
          "datasource": {
            "type": "postgres",
            "uid": "USM"
          },
          "editorMode": "code",
          "format": "table",
          "rawQuery": true,
          "rawSql": "SELECT xivo_uuid from cfg.config_xivo order by time desc limit 1;",
          "refId": "A",
          "sql": {
            "columns": [
              {
                "parameters": [],
                "type": "function"
              }
            ],
            "groupBy": [
              {
                "property": {
                  "type": "string"
                },
                "type": "groupBy"
              }
            ],
            "limit": 50
          }
        }
      ],
      "transformations": [
        {
          "id": "renameByRegex",
          "options": {
            "regex": "(.*)",
            "renamePattern": "IDENTIFIANTS UNIQUE XiVO"
          }
        }
      ],
      "transparent": true,
      "type": "table"
    },
    {
      "datasource": {
        "type": "postgres",
        "uid": "P5CFE5948D716F5AC"
      },
      "fieldConfig": {
        "defaults": {
          "color": {
            "mode": "thresholds"
          },
          "custom": {
            "align": "auto",
            "cellOptions": {
              "type": "auto"
            },
            "inspect": false
          },
          "mappings": [],
          "thresholds": {
            "mode": "absolute",
            "steps": [
              {
                "color": "green",
                "value": null
              },
              {
                "color": "red",
                "value": 80
              }
            ]
          }
        },
        "overrides": []
      },
      "gridPos": {
        "h": 3,
        "w": 12,
        "x": 12,
        "y": 1
      },
      "id": 57,
      "options": {
        "footer": {
          "countRows": false,
          "fields": "",
          "reducer": [
            "sum"
          ],
          "show": false
        },
        "showHeader": true
      },
      "pluginVersion": "",
      "targets": [
        {
          "datasource": {
            "type": "postgres",
            "uid": "P5CFE5948D716F5AC"
          },
          "editorMode": "code",
          "format": "table",
          "hide": false,
          "rawQuery": true,
          "rawSql": "SELECT xivolts, xivoversion FROM cfg.config_xivo ORDER BY time desc limit 1;",
          "refId": "A",
          "sql": {
            "columns": [
              {
                "parameters": [],
                "type": "function"
              }
            ],
            "groupBy": [
              {
                "property": {
                  "type": "string"
                },
                "type": "groupBy"
              }
            ],
            "limit": 50
          }
        }
      ],
      "transformations": [
        {
          "id": "renameByRegex",
          "options": {
            "regex": "xivolts",
            "renamePattern": "LTS MAJEUR"
          }
        },
        {
          "id": "renameByRegex",
          "options": {
            "regex": "xivoversion",
            "renamePattern": "VERSION XiVO"
          }
        }
      ],
      "transparent": true,
      "type": "table"
    },
    {
      "datasource": {
        "type": "postgres",
        "uid": "P5CFE5948D716F5AC"
      },
      "fieldConfig": {
        "defaults": {
          "color": {
            "mode": "thresholds"
          },
          "mappings": [],
          "thresholds": {
            "mode": "absolute",
            "steps": [
              {
                "color": "green",
                "value": null
              },
              {
                "color": "red",
                "value": 80
              }
            ]
          }
        },
        "overrides": []
      },
      "gridPos": {
        "h": 3,
        "w": 12,
        "x": 0,
        "y": 4
      },
      "id": 22,
      "options": {
        "displayMode": "basic",
        "minVizHeight": 10,
        "minVizWidth": 0,
        "orientation": "horizontal",
        "reduceOptions": {
          "calcs": [
            "lastNotNull"
          ],
          "fields": "",
          "values": false
        },
        "showUnfilled": true
      },
      "pluginVersion": "",
      "targets": [
        {
          "datasource": {
            "type": "postgres",
            "uid": "P5CFE5948D716F5AC"
          },
          "editorMode": "code",
          "format": "table",
          "hide": false,
          "rawQuery": true,
          "rawSql": "\n    SELECT \n        nb_users,\n        nb_webrtc_users,\n        date_trunc('day', time) AS day_time\n    FROM \n        cfg.config_xivo \n    WHERE \n        time >= $__timeFrom() AND time <= $__timeTo()\n    ORDER BY \n        cfg.config_xivo.time DESC limit 1;",
          "refId": "B",
          "sql": {
            "columns": [
              {
                "parameters": [],
                "type": "function"
              }
            ],
            "groupBy": [
              {
                "property": {
                  "type": "string"
                },
                "type": "groupBy"
              }
            ],
            "limit": 50
          }
        }
      ],
      "transformations": [
        {
          "id": "renameByRegex",
          "options": {
            "regex": "nb_users",
            "renamePattern": "Nb  d'utilisateurs"
          }
        },
        {
          "id": "renameByRegex",
          "options": {
            "regex": "actif_user",
            "renamePattern": "Utilisateurs actifs"
          }
        },
        {
          "id": "renameByRegex",
          "options": {
            "regex": "nb_webrtc_users",
            "renamePattern": "Utilisateurs web"
          }
        }
      ],
      "transparent": true,
      "type": "bargauge"
    },
    {
      "datasource": {
        "type": "postgres",
        "uid": "P5CFE5948D716F5AC"
      },
      "fieldConfig": {
        "defaults": {
          "color": {
            "mode": "continuous-GrYlRd"
          },
          "mappings": [],
          "thresholds": {
            "mode": "absolute",
            "steps": [
              {
                "color": "green",
                "value": null
              },
              {
                "color": "red",
                "value": 80
              }
            ]
          }
        },
        "overrides": []
      },
      "gridPos": {
        "h": 3,
        "w": 12,
        "x": 12,
        "y": 4
      },
      "id": 52,
      "options": {
        "displayMode": "basic",
        "minVizHeight": 10,
        "minVizWidth": 0,
        "orientation": "horizontal",
        "reduceOptions": {
          "calcs": [
            "lastNotNull"
          ],
          "fields": "",
          "values": false
        },
        "showUnfilled": true
      },
      "pluginVersion": "",
      "targets": [
        {
          "datasource": {
            "type": "postgres",
            "uid": "P5CFE5948D716F5AC"
          },
          "editorMode": "code",
          "format": "table",
          "hide": false,
          "rawQuery": true,
          "rawSql": "\n    SELECT \n        nb_agents,\n        date_trunc('day', time) AS day_time\n    FROM \n        cfg.config_xivo \n    WHERE \n        time >= $__timeFrom() AND time <= $__timeTo()\n    ORDER BY \n        cfg.config_xivo.time DESC limit 1;",
          "refId": "B",
          "sql": {
            "columns": [
              {
                "parameters": [],
                "type": "function"
              }
            ],
            "groupBy": [
              {
                "property": {
                  "type": "string"
                },
                "type": "groupBy"
              }
            ],
            "limit": 50
          }
        }
      ],
      "title": "Nombre d'agent",
      "transformations": [],
      "transparent": true,
      "type": "bargauge"
    },
    {
      "collapsed": false,
      "gridPos": {
        "h": 1,
        "w": 24,
        "x": 0,
        "y": 7
      },
      "id": 48,
      "panels": [],
      "title": "LES OPTIONS XIVO",
      "type": "row"
    },
    {
      "datasource": {
        "type": "postgres",
        "uid": "P5CFE5948D716F5AC"
      },
      "description": "##### [Objectif]\n\nVérifier la présence de l'architecture Edge sur XiVO\n\n##### [Description]\nL'architecture Edge permet de s'affranchir d'un VPN.",
      "fieldConfig": {
        "defaults": {
          "custom": {
            "align": "center",
            "cellOptions": {
              "mode": "basic",
              "type": "color-background"
            },
            "inspect": false
          },
          "mappings": [
            {
              "options": {
                "false": {
                  "color": "red",
                  "index": 1,
                  "text": "Non configuré"
                },
                "true": {
                  "color": "green",
                  "index": 0,
                  "text": "Actif"
                }
              },
              "type": "value"
            }
          ],
          "thresholds": {
            "mode": "percentage",
            "steps": [
              {
                "color": "green",
                "value": null
              },
              {
                "color": "red",
                "value": 80
              }
            ]
          }
        },
        "overrides": []
      },
      "gridPos": {
        "h": 3,
        "w": 8,
        "x": 0,
        "y": 8
      },
      "id": 20,
      "options": {
        "footer": {
          "countRows": false,
          "fields": "",
          "reducer": [
            "sum"
          ],
          "show": false
        },
        "showHeader": false,
        "sortBy": [
          {
            "desc": false,
            "displayName": "Module edge"
          }
        ]
      },
      "pluginVersion": "",
      "targets": [
        {
          "datasource": {
            "type": "postgres",
            "uid": "P5CFE5948D716F5AC"
          },
          "editorMode": "code",
          "format": "table",
          "hide": false,
          "rawQuery": true,
          "rawSql": "select edge_activated FROM cfg.config_xivo WHERE cfg.config_xivo.time >= $__timeFrom() AND cfg.config_xivo.time <= $__timeTo() order by cfg.config_xivo.time desc LIMIT 1 ;\n",
          "refId": "B",
          "sql": {
            "columns": [
              {
                "parameters": [],
                "type": "function"
              }
            ],
            "groupBy": [
              {
                "property": {
                  "type": "string"
                },
                "type": "groupBy"
              }
            ],
            "limit": 50
          }
        }
      ],
      "title": "Edge",
      "transformations": [
        {
          "id": "renameByRegex",
          "options": {
            "regex": "edge_activated",
            "renamePattern": "Module edge"
          }
        }
      ],
      "type": "table"
    },
    {
      "datasource": {
        "type": "postgres",
        "uid": "P5CFE5948D716F5AC"
      },
      "description": "##### [Objectif]\n\nVérifier la présence d'une synchronisation LDAP sur XiVO\n\n##### [Description]\nPermet de synchroniser les utilisateurs d'un LDAP vers XiVO, de XiVO vers LDAP ou les deux.",
      "fieldConfig": {
        "defaults": {
          "custom": {
            "align": "auto",
            "cellOptions": {
              "mode": "basic",
              "type": "color-background"
            },
            "inspect": false
          },
          "mappings": [
            {
              "options": {
                "false": {
                  "color": "red",
                  "index": 1,
                  "text": "Non configuré"
                },
                "true": {
                  "color": "green",
                  "index": 0,
                  "text": "Actif"
                }
              },
              "type": "value"
            }
          ],
          "thresholds": {
            "mode": "absolute",
            "steps": [
              {
                "color": "green",
                "value": null
              },
              {
                "color": "red",
                "value": 80
              }
            ]
          }
        },
        "overrides": []
      },
      "gridPos": {
        "h": 3,
        "w": 5,
        "x": 8,
        "y": 8
      },
      "id": 62,
      "options": {
        "footer": {
          "countRows": false,
          "fields": "",
          "reducer": [
            "sum"
          ],
          "show": false
        },
        "showHeader": false
      },
      "pluginVersion": "",
      "targets": [
        {
          "datasource": {
            "type": "postgres",
            "uid": "P5CFE5948D716F5AC"
          },
          "editorMode": "code",
          "format": "table",
          "hide": false,
          "rawQuery": true,
          "rawSql": "SELECT \n  CASE \n    WHEN nb_mds > 1 THEN true\n    ELSE false\n  END AS result\nFROM cfg.config_xivo \nWHERE time >= $__timeFrom() AND time <= $__timeTo()\nORDER BY config_xivo.time DESC \nLIMIT 1;",
          "refId": "B",
          "sql": {
            "columns": [
              {
                "parameters": [],
                "type": "function"
              }
            ],
            "groupBy": [
              {
                "property": {
                  "type": "string"
                },
                "type": "groupBy"
              }
            ],
            "limit": 50
          }
        }
      ],
      "title": "Architecture distribué MDS",
      "type": "table"
    },
    {
      "datasource": {
        "type": "postgres",
        "uid": "P5CFE5948D716F5AC"
      },
      "description": "##### [Objectif]\n\nVérifier la présence d'une synchronisation LDAP sur XiVO\n\n##### [Description]\nPermet de synchroniser les utilisateurs d'un LDAP vers XiVO, de XiVO vers LDAP ou les deux.",
      "fieldConfig": {
        "defaults": {
          "custom": {
            "align": "auto",
            "cellOptions": {
              "mode": "basic",
              "type": "color-background"
            },
            "inspect": false
          },
          "mappings": [
            {
              "options": {
                "false": {
                  "color": "red",
                  "index": 1,
                  "text": "Non configuré"
                },
                "true": {
                  "color": "green",
                  "index": 0,
                  "text": "Actif"
                }
              },
              "type": "value"
            }
          ],
          "thresholds": {
            "mode": "absolute",
            "steps": [
              {
                "color": "green",
                "value": null
              },
              {
                "color": "red",
                "value": 80
              }
            ]
          }
        },
        "overrides": []
      },
      "gridPos": {
        "h": 3,
        "w": 5,
        "x": 13,
        "y": 8
      },
      "id": 29,
      "options": {
        "footer": {
          "countRows": false,
          "fields": "",
          "reducer": [
            "sum"
          ],
          "show": false
        },
        "showHeader": false
      },
      "pluginVersion": "",
      "targets": [
        {
          "datasource": {
            "type": "postgres",
            "uid": "P5CFE5948D716F5AC"
          },
          "editorMode": "code",
          "format": "table",
          "hide": false,
          "rawQuery": true,
          "rawSql": "SELECT \n    CASE \n        WHEN cfg.config_xivo.ldap_user_sync = 0 THEN false \n        ELSE true \n    END AS synchro_ldap \nFROM \n    cfg.config_xivo\nWHERE \n    cfg.config_xivo.time >= $__timeFrom() \n    AND cfg.config_xivo.time <= $__timeTo() \nORDER BY \n    cfg.config_xivo.time DESC \nLIMIT 1;",
          "refId": "B",
          "sql": {
            "columns": [
              {
                "parameters": [],
                "type": "function"
              }
            ],
            "groupBy": [
              {
                "property": {
                  "type": "string"
                },
                "type": "groupBy"
              }
            ],
            "limit": 50
          }
        }
      ],
      "title": "Synchronisation LDAP",
      "type": "table"
    },
    {
      "datasource": {
        "type": "postgres",
        "uid": "P5CFE5948D716F5AC"
      },
      "fieldConfig": {
        "defaults": {
          "custom": {
            "align": "center",
            "cellOptions": {
              "mode": "basic",
              "type": "color-background"
            },
            "inspect": false
          },
          "mappings": [
            {
              "options": {
                "false": {
                  "color": "red",
                  "index": 1,
                  "text": "Non configuré"
                },
                "true": {
                  "color": "green",
                  "index": 0,
                  "text": "Actif"
                }
              },
              "type": "value"
            }
          ],
          "thresholds": {
            "mode": "absolute",
            "steps": [
              {
                "color": "green",
                "value": null
              },
              {
                "color": "red",
                "value": 80
              }
            ]
          }
        },
        "overrides": []
      },
      "gridPos": {
        "h": 3,
        "w": 5,
        "x": 18,
        "y": 8
      },
      "id": 31,
      "options": {
        "footer": {
          "countRows": false,
          "fields": "",
          "reducer": [
            "sum"
          ],
          "show": false
        },
        "showHeader": false
      },
      "pluginVersion": "",
      "targets": [
        {
          "datasource": {
            "type": "postgres",
            "uid": "P5CFE5948D716F5AC"
          },
          "editorMode": "code",
          "format": "table",
          "hide": false,
          "rawQuery": true,
          "rawSql": "select switchboard_activated FROM cfg.config_xivo WHERE cfg.config_xivo.time >= $__timeFrom() AND cfg.config_xivo.time <= $__timeTo() order by cfg.config_xivo.time desc LIMIT 1 ;\n",
          "refId": "B",
          "sql": {
            "columns": [
              {
                "parameters": [],
                "type": "function"
              }
            ],
            "groupBy": [
              {
                "property": {
                  "type": "string"
                },
                "type": "groupBy"
              }
            ],
            "limit": 50
          }
        }
      ],
      "title": "POPC",
      "type": "table"
    },
    {
      "datasource": {
        "type": "postgres",
        "uid": "P5CFE5948D716F5AC"
      },
      "description": "##### [Objectif]\n\nVérifier la présence de de l'application mobile sur XiVO\n\nA noter: l'application mobile est dépendante de l'architecture Edge\n\n##### [Description]\nPermet d'utiliser XiVO sur son téléphone mobile via l'application",
      "fieldConfig": {
        "defaults": {
          "custom": {
            "align": "center",
            "cellOptions": {
              "mode": "basic",
              "type": "color-background"
            },
            "filterable": false,
            "inspect": false
          },
          "mappings": [
            {
              "options": {
                "false": {
                  "color": "red",
                  "index": 1,
                  "text": "Non configuré"
                },
                "true": {
                  "color": "green",
                  "index": 0,
                  "text": "Actif"
                }
              },
              "type": "value"
            }
          ],
          "thresholds": {
            "mode": "absolute",
            "steps": [
              {
                "color": "green",
                "value": null
              },
              {
                "color": "red",
                "value": 80
              }
            ]
          }
        },
        "overrides": []
      },
      "gridPos": {
        "h": 3,
        "w": 4,
        "x": 0,
        "y": 11
      },
      "id": 26,
      "options": {
        "footer": {
          "countRows": false,
          "fields": "",
          "reducer": [
            "sum"
          ],
          "show": false
        },
        "showHeader": false
      },
      "pluginVersion": "",
      "targets": [
        {
          "datasource": {
            "type": "postgres",
            "uid": "P5CFE5948D716F5AC"
          },
          "editorMode": "code",
          "format": "table",
          "hide": false,
          "rawQuery": true,
          "rawSql": "select mobile_app_activated FROM cfg.config_xivo WHERE cfg.config_xivo.time >= $__timeFrom() AND cfg.config_xivo.time <= $__timeTo() order by cfg.config_xivo.time desc LIMIT 1 ;\n",
          "refId": "B",
          "sql": {
            "columns": [
              {
                "parameters": [],
                "type": "function"
              }
            ],
            "groupBy": [
              {
                "property": {
                  "type": "string"
                },
                "type": "groupBy"
              }
            ],
            "limit": 50
          }
        }
      ],
      "title": "Application Mobile",
      "type": "table"
    },
    {
      "datasource": {
        "type": "postgres",
        "uid": "P5CFE5948D716F5AC"
      },
      "description": "##### [Objectif]\n\nVérifier la présence de la visioconférence sur XiVO\n\nA noter: La visioconférence est dépendante de l'architecture Edge\n\n##### [Description]\nPermet de passer des appels vidéo via XiVO",
      "fieldConfig": {
        "defaults": {
          "custom": {
            "align": "center",
            "cellOptions": {
              "mode": "basic",
              "type": "color-background"
            },
            "inspect": false
          },
          "mappings": [
            {
              "options": {
                "false": {
                  "color": "red",
                  "index": 1,
                  "text": "Non configuré"
                },
                "true": {
                  "color": "green",
                  "index": 0,
                  "text": "Actif"
                }
              },
              "type": "value"
            }
          ],
          "thresholds": {
            "mode": "absolute",
            "steps": [
              {
                "color": "green",
                "value": null
              },
              {
                "color": "red",
                "value": 80
              }
            ]
          }
        },
        "overrides": []
      },
      "gridPos": {
        "h": 3,
        "w": 4,
        "x": 4,
        "y": 11
      },
      "id": 28,
      "options": {
        "footer": {
          "countRows": false,
          "enablePagination": false,
          "fields": "",
          "reducer": [
            "sum"
          ],
          "show": false
        },
        "showHeader": false
      },
      "pluginVersion": "",
      "targets": [
        {
          "datasource": {
            "type": "postgres",
            "uid": "P5CFE5948D716F5AC"
          },
          "editorMode": "code",
          "format": "table",
          "hide": false,
          "rawQuery": true,
          "rawSql": "select cfg.config_xivo.visio_activated FROM cfg.config_xivo WHERE cfg.config_xivo.time >= $__timeFrom() AND cfg.config_xivo.time <= $__timeTo() order by cfg.config_xivo.time desc LIMIT 1 ;\n",
          "refId": "B",
          "sql": {
            "columns": [
              {
                "parameters": [],
                "type": "function"
              }
            ],
            "groupBy": [
              {
                "property": {
                  "type": "string"
                },
                "type": "groupBy"
              }
            ],
            "limit": 50
          }
        }
      ],
      "title": "Visio Conférence ( Jitsi ) ",
      "transformations": [],
      "type": "table"
    },
    {
      "datasource": {
        "type": "postgres",
        "uid": "P5CFE5948D716F5AC"
      },
      "description": "##### [Objectif]\n\nVérifier la présence d'une synchronisation LDAP sur XiVO\n\n##### [Description]\nPermet de synchroniser les utilisateurs d'un LDAP vers XiVO, de XiVO vers LDAP ou les deux.",
      "fieldConfig": {
        "defaults": {
          "color": {
            "mode": "continuous-GrYlRd"
          },
          "mappings": [
            {
              "options": {
                "1": {
                  "color": "dark-orange",
                  "index": 0
                }
              },
              "type": "value"
            }
          ],
          "thresholds": {
            "mode": "absolute",
            "steps": [
              {
                "color": "green",
                "value": null
              },
              {
                "color": "red",
                "value": 80
              }
            ]
          }
        },
        "overrides": []
      },
      "gridPos": {
        "h": 3,
        "w": 5,
        "x": 8,
        "y": 11
      },
      "id": 61,
      "options": {
        "displayMode": "basic",
        "minVizHeight": 10,
        "minVizWidth": 0,
        "orientation": "horizontal",
        "reduceOptions": {
          "calcs": [
            "lastNotNull"
          ],
          "fields": "",
          "values": false
        },
        "showUnfilled": true
      },
      "pluginVersion": "",
      "targets": [
        {
          "datasource": {
            "type": "postgres",
            "uid": "P5CFE5948D716F5AC"
          },
          "editorMode": "code",
          "format": "table",
          "hide": false,
          "rawQuery": true,
          "rawSql": "SELECT nb_mds\nFROM cfg.config_xivo \nWHERE time >= $__timeFrom() AND time <= $__timeTo()\nORDER BY config_xivo.time desc limit 1;",
          "refId": "B",
          "sql": {
            "columns": [
              {
                "parameters": [],
                "type": "function"
              }
            ],
            "groupBy": [
              {
                "property": {
                  "type": "string"
                },
                "type": "groupBy"
              }
            ],
            "limit": 50
          }
        }
      ],
      "title": "Nombre de MDS",
      "type": "bargauge"
    },
    {
      "datasource": {
        "type": "postgres",
        "uid": "P5CFE5948D716F5AC"
      },
      "description": "##### [Objectif]\n\nAfficher le nombre d'utilisateurs synchronisé via LDAP\n",
      "fieldConfig": {
        "defaults": {
          "color": {
            "mode": "continuous-GrYlRd"
          },
          "mappings": [
            {
              "options": {
                "0": {
                  "color": "dark-orange",
                  "index": 0
                }
              },
              "type": "value"
            }
          ],
          "thresholds": {
            "mode": "absolute",
            "steps": [
              {
                "color": "green",
                "value": null
              },
              {
                "color": "red",
                "value": 80
              }
            ]
          }
        },
        "overrides": []
      },
      "gridPos": {
        "h": 3,
        "w": 5,
        "x": 13,
        "y": 11
      },
      "id": 30,
      "options": {
        "displayMode": "basic",
        "minVizHeight": 10,
        "minVizWidth": 0,
        "orientation": "horizontal",
        "reduceOptions": {
          "calcs": [
            "lastNotNull"
          ],
          "fields": "",
          "values": false
        },
        "showUnfilled": true
      },
      "pluginVersion": "",
      "targets": [
        {
          "datasource": {
            "type": "postgres",
            "uid": "P5CFE5948D716F5AC"
          },
          "editorMode": "code",
          "format": "table",
          "hide": false,
          "rawQuery": true,
          "rawSql": "SELECT time, ldap_user_sync \nFROM cfg.config_xivo \nWHERE time >= $__timeFrom() AND time <= $__timeTo()\nORDER BY config_xivo.time desc limit 1;",
          "refId": "B",
          "sql": {
            "columns": [
              {
                "parameters": [],
                "type": "function"
              }
            ],
            "groupBy": [
              {
                "property": {
                  "type": "string"
                },
                "type": "groupBy"
              }
            ],
            "limit": 50
          }
        }
      ],
      "title": "Utilisateurs synchronisés",
      "transformations": [
        {
          "id": "renameByRegex",
          "options": {
            "regex": "ldap_user_sync",
            "renamePattern": "Utilisateurs LDAP Synchronisés"
          }
        }
      ],
      "transparent": true,
      "type": "bargauge"
    },
    {
      "datasource": {
        "type": "postgres",
        "uid": "P5CFE5948D716F5AC"
      },
      "description": "##### [Objectif]\n\nAfficher le nombre de file POPC configuré sur XiVO\n",
      "fieldConfig": {
        "defaults": {
          "color": {
            "mode": "continuous-GrYlRd"
          },
          "mappings": [
            {
              "options": {
                "0": {
                  "color": "dark-orange",
                  "index": 0
                }
              },
              "type": "value"
            }
          ],
          "thresholds": {
            "mode": "absolute",
            "steps": [
              {
                "color": "green",
                "value": null
              },
              {
                "color": "red",
                "value": 80
              }
            ]
          }
        },
        "overrides": []
      },
      "gridPos": {
        "h": 3,
        "w": 5,
        "x": 18,
        "y": 11
      },
      "id": 32,
      "options": {
        "displayMode": "basic",
        "minVizHeight": 10,
        "minVizWidth": 0,
        "orientation": "horizontal",
        "reduceOptions": {
          "calcs": [
            "lastNotNull"
          ],
          "fields": "",
          "values": false
        },
        "showUnfilled": true
      },
      "pluginVersion": "",
      "targets": [
        {
          "datasource": {
            "type": "postgres",
            "uid": "P5CFE5948D716F5AC"
          },
          "editorMode": "code",
          "format": "table",
          "hide": false,
          "rawQuery": true,
          "rawSql": "SELECT time, nb_switchboards\nFROM cfg.config_xivo \nWHERE time >= $__timeFrom() AND time <= $__timeTo()\nORDER BY config_xivo.time desc limit 1;",
          "refId": "B",
          "sql": {
            "columns": [
              {
                "parameters": [],
                "type": "function"
              }
            ],
            "groupBy": [
              {
                "property": {
                  "type": "string"
                },
                "type": "groupBy"
              }
            ],
            "limit": 50
          }
        }
      ],
      "title": "Nombre de files POPC",
      "transformations": [
        {
          "id": "renameByRegex",
          "options": {
            "regex": "nb_switchboards",
            "renamePattern": "Nombre de Switchboard"
          }
        },
        {
          "id": "renameByRegex",
          "options": {
            "regex": "nb_meetingrooms",
            "renamePattern": "Nombre de chambre de conférences"
          }
        }
      ],
      "transparent": true,
      "type": "bargauge"
    },
    {
      "datasource": {
        "type": "postgres",
        "uid": "P5CFE5948D716F5AC"
      },
      "description": "##### [Objectif]\n\nAfficher le nombre de compte dont au moins une connexion a été réaliser sur un téléphone.\n\n##### [Description]\n- Mobile Androïd = Nombre de comptes XiVO utilisant l'application mobile avec un téléphone Androïd\n- Mobile IOS = Nombre de comptes XiVO utilisant l'application mobile avec un téléphone IOS\n- Autre mobile = Nombre de comptes XiVO utilisant l'application mobile sur un systeme d'exploitation différents\n- Compte sans application mobile =  Nombre de comptes qui ne se sont jamais connecté sur l'application mobile. ",
      "fieldConfig": {
        "defaults": {
          "color": {
            "mode": "thresholds"
          },
          "mappings": [
            {
              "options": {
                "0": {
                  "color": "dark-orange",
                  "index": 0
                }
              },
              "type": "value"
            }
          ],
          "thresholds": {
            "mode": "absolute",
            "steps": [
              {
                "color": "green",
                "value": null
              },
              {
                "color": "red",
                "value": 80
              }
            ]
          }
        },
        "overrides": []
      },
      "gridPos": {
        "h": 3,
        "w": 4,
        "x": 0,
        "y": 14
      },
      "id": 27,
      "options": {
        "displayMode": "basic",
        "minVizHeight": 10,
        "minVizWidth": 0,
        "orientation": "horizontal",
        "reduceOptions": {
          "calcs": [
            "lastNotNull"
          ],
          "fields": "",
          "values": false
        },
        "showUnfilled": true
      },
      "pluginVersion": "",
      "targets": [
        {
          "datasource": {
            "type": "postgres",
            "uid": "P5CFE5948D716F5AC"
          },
          "editorMode": "code",
          "format": "table",
          "hide": false,
          "rawQuery": true,
          "rawSql": "SELECT time, nb_mapp_android_users, nb_mapp_ios_users\nFROM cfg.config_xivo \nWHERE time >= $__timeFrom() AND time <= $__timeTo()\nORDER BY config_xivo.time desc limit 1;",
          "refId": "B",
          "sql": {
            "columns": [
              {
                "parameters": [],
                "type": "function"
              }
            ],
            "groupBy": [
              {
                "property": {
                  "type": "string"
                },
                "type": "groupBy"
              }
            ],
            "limit": 50
          }
        }
      ],
      "transformations": [
        {
          "id": "renameByRegex",
          "options": {
            "regex": "ios_count",
            "renamePattern": "Mobile IOS"
          }
        },
        {
          "id": "renameByRegex",
          "options": {
            "regex": "android_count",
            "renamePattern": "Mobile Android"
          }
        },
        {
          "id": "renameByRegex",
          "options": {
            "regex": "other_count",
            "renamePattern": "Autre mobile"
          }
        },
        {
          "id": "renameByRegex",
          "options": {
            "regex": "empty_count",
            "renamePattern": "Compte sans application mobile"
          }
        }
      ],
      "transparent": true,
      "type": "bargauge"
    },
    {
      "datasource": {
        "type": "postgres",
        "uid": "P5CFE5948D716F5AC"
      },
      "description": "##### [Objectif]\n\nAfficher le nombre de chambre de visio configuré sur XiVO",
      "fieldConfig": {
        "defaults": {
          "color": {
            "mode": "continuous-GrYlRd"
          },
          "mappings": [
            {
              "options": {
                "0": {
                  "color": "dark-orange",
                  "index": 0
                }
              },
              "type": "value"
            }
          ],
          "thresholds": {
            "mode": "absolute",
            "steps": [
              {
                "color": "green",
                "value": null
              },
              {
                "color": "red",
                "value": 80
              }
            ]
          }
        },
        "overrides": []
      },
      "gridPos": {
        "h": 3,
        "w": 4,
        "x": 4,
        "y": 14
      },
      "id": 58,
      "options": {
        "displayMode": "basic",
        "minVizHeight": 10,
        "minVizWidth": 0,
        "orientation": "horizontal",
        "reduceOptions": {
          "calcs": [
            "lastNotNull"
          ],
          "fields": "",
          "values": false
        },
        "showUnfilled": true
      },
      "pluginVersion": "",
      "targets": [
        {
          "datasource": {
            "type": "postgres",
            "uid": "P5CFE5948D716F5AC"
          },
          "editorMode": "code",
          "format": "table",
          "hide": false,
          "rawQuery": true,
          "rawSql": "SELECT time, nb_meetingrooms\nFROM cfg.config_xivo \nWHERE time >= $__timeFrom() AND time <= $__timeTo()\nORDER BY config_xivo.time desc limit 1;",
          "refId": "B",
          "sql": {
            "columns": [
              {
                "parameters": [],
                "type": "function"
              }
            ],
            "groupBy": [
              {
                "property": {
                  "type": "string"
                },
                "type": "groupBy"
              }
            ],
            "limit": 50
          }
        }
      ],
      "title": "Nombre de chambre de visioconférences",
      "transformations": [],
      "transparent": true,
      "type": "bargauge"
    },
    {
      "datasource": {
        "type": "datasource",
        "uid": "grafana"
      },
      "gridPos": {
        "h": 3,
        "w": 24,
        "x": 0,
        "y": 17
      },
      "id": 59,
      "options": {
        "code": {
          "language": "html",
          "showLineNumbers": false,
          "showMiniMap": false
        },
        "content": "#",
        "mode": "markdown"
      },
      "pluginVersion": "",
      "transparent": true,
      "type": "text"
    },
    {
      "collapsed": false,
      "gridPos": {
        "h": 1,
        "w": 24,
        "x": 0,
        "y": 20
      },
      "id": 46,
      "panels": [],
      "title": "USAGES",
      "type": "row"
    },
    {
      "datasource": {
        "type": "datasource",
        "uid": "grafana"
      },
      "gridPos": {
        "h": 2,
        "w": 24,
        "x": 0,
        "y": 21
      },
      "id": 40,
      "options": {
        "code": {
          "language": "html",
          "showLineNumbers": false,
          "showMiniMap": false
        },
        "content": "# Postes Physiques",
        "mode": "markdown"
      },
      "pluginVersion": "",
      "transparent": true,
      "type": "text"
    },
    {
      "datasource": {
        "type": "postgres",
        "uid": "P5CFE5948D716F5AC"
      },
      "description": "##### [Description]\n\nAffiche la répartition du nombre de téléphone par constructeur\n",
      "fieldConfig": {
        "defaults": {
          "color": {
            "mode": "palette-classic"
          },
          "custom": {
            "hideFrom": {
              "legend": false,
              "tooltip": false,
              "viz": false
            }
          },
          "mappings": []
        },
        "overrides": []
      },
      "gridPos": {
        "h": 10,
        "w": 6,
        "x": 0,
        "y": 23
      },
      "id": 33,
      "options": {
        "displayLabels": [
          "percent"
        ],
        "legend": {
          "displayMode": "list",
          "placement": "right",
          "showLegend": true,
          "values": []
        },
        "pieType": "pie",
        "reduceOptions": {
          "calcs": [
            "lastNotNull"
          ],
          "fields": "",
          "values": true
        },
        "tooltip": {
          "mode": "single",
          "sort": "none"
        }
      },
      "pluginVersion": "",
      "targets": [
        {
          "datasource": {
            "type": "postgres",
            "uid": "P5CFE5948D716F5AC"
          },
          "editorMode": "code",
          "format": "table",
          "hide": false,
          "rawQuery": true,
          "rawSql": "SELECT result.vendor_list, count(result.vendor_list) from (\n  select distinct(id), vendor as vendor_list\nfrom cfg.config_devices \nWHERE  time >= $__timeFrom() AND time <= $__timeTo()\nGROUP BY id, vendor\n) as result GROUP BY vendor_list\n",
          "refId": "B",
          "sql": {
            "columns": [
              {
                "parameters": [],
                "type": "function"
              }
            ],
            "groupBy": [
              {
                "property": {
                  "type": "string"
                },
                "type": "groupBy"
              }
            ],
            "limit": 50
          }
        }
      ],
      "title": "Constructeurs téléphones",
      "transformations": [
        {
          "id": "filterByValue",
          "options": {
            "filters": [
              {
                "config": {
                  "id": "notEqual",
                  "options": {
                    "value": "vendor"
                  }
                },
                "fieldName": "vendor_list"
              }
            ],
            "match": "any",
            "type": "include"
          }
        }
      ],
      "transparent": true,
      "type": "piechart"
    },
    {
      "datasource": {
        "type": "postgres",
        "uid": "P5CFE5948D716F5AC"
      },
      "description": "##### [Description]\n\nProportion du nombre de modèle parmi l'ensemble des constructeurs\n",
      "fieldConfig": {
        "defaults": {
          "color": {
            "mode": "palette-classic"
          },
          "custom": {
            "hideFrom": {
              "legend": false,
              "tooltip": false,
              "viz": false
            }
          },
          "mappings": []
        },
        "overrides": []
      },
      "gridPos": {
        "h": 10,
        "w": 6,
        "x": 6,
        "y": 23
      },
      "id": 34,
      "options": {
        "displayLabels": [
          "percent"
        ],
        "legend": {
          "displayMode": "list",
          "placement": "right",
          "showLegend": true,
          "values": []
        },
        "pieType": "pie",
        "reduceOptions": {
          "calcs": [
            "lastNotNull"
          ],
          "fields": "",
          "values": true
        },
        "tooltip": {
          "mode": "single",
          "sort": "none"
        }
      },
      "pluginVersion": "",
      "targets": [
        {
          "datasource": {
            "type": "postgres",
            "uid": "P5CFE5948D716F5AC"
          },
          "editorMode": "code",
          "format": "table",
          "hide": false,
          "rawQuery": true,
          "rawSql": "SELECT result.model_list, count(result.model_list) FROM (\nSELECT distinct(id), model as model_list\nfrom cfg.config_devices \nWHERE  time >= $__timeFrom() AND time <= $__timeTo()\nGROUP BY id, model) as result GROUP BY model_list",
          "refId": "B",
          "sql": {
            "columns": [
              {
                "parameters": [],
                "type": "function"
              }
            ],
            "groupBy": [
              {
                "property": {
                  "type": "string"
                },
                "type": "groupBy"
              }
            ],
            "limit": 50
          }
        }
      ],
      "title": "Modèles",
      "transformations": [
        {
          "id": "filterByValue",
          "options": {
            "filters": [
              {
                "config": {
                  "id": "notEqual",
                  "options": {
                    "value": "model"
                  }
                },
                "fieldName": "model_list"
              }
            ],
            "match": "any",
            "type": "include"
          }
        }
      ],
      "transparent": true,
      "type": "piechart"
    },
    {
      "datasource": {
        "type": "postgres",
        "uid": "P5CFE5948D716F5AC"
      },
      "description": "##### [Description]\n\nNombre de téléphone utilisant le greffon",
      "fieldConfig": {
        "defaults": {
          "color": {
            "mode": "palette-classic"
          },
          "custom": {
            "hideFrom": {
              "legend": false,
              "tooltip": false,
              "viz": false
            }
          },
          "mappings": []
        },
        "overrides": []
      },
      "gridPos": {
        "h": 10,
        "w": 6,
        "x": 12,
        "y": 23
      },
      "id": 36,
      "options": {
        "displayLabels": [
          "percent"
        ],
        "legend": {
          "displayMode": "list",
          "placement": "right",
          "showLegend": true,
          "values": []
        },
        "pieType": "pie",
        "reduceOptions": {
          "calcs": [
            "lastNotNull"
          ],
          "fields": "",
          "values": true
        },
        "tooltip": {
          "mode": "single",
          "sort": "none"
        }
      },
      "pluginVersion": "",
      "targets": [
        {
          "datasource": {
            "type": "postgres",
            "uid": "P5CFE5948D716F5AC"
          },
          "editorMode": "code",
          "format": "table",
          "hide": false,
          "rawQuery": true,
          "rawSql": "SELECT result.plugin_list, count(result.plugin_list) FROM (\n  SELECT distinct(id), plugin as plugin_list\n  FROM cfg.config_devices \n  WHERE  time >= $__timeFrom() AND time <= $__timeTo()\n  GROUP BY id, plugin) \nas result GROUP BY plugin_list\n\n",
          "refId": "B",
          "sql": {
            "columns": [
              {
                "parameters": [],
                "type": "function"
              }
            ],
            "groupBy": [
              {
                "property": {
                  "type": "string"
                },
                "type": "groupBy"
              }
            ],
            "limit": 50
          }
        }
      ],
      "title": "Greffons",
      "transformations": [
        {
          "id": "filterByValue",
          "options": {
            "filters": [
              {
                "config": {
                  "id": "notEqual",
                  "options": {
                    "value": "plugin"
                  }
                },
                "fieldName": "plugin_list"
              }
            ],
            "match": "any",
            "type": "include"
          }
        }
      ],
      "transparent": true,
      "type": "piechart"
    },
    {
      "datasource": {
        "type": "postgres",
        "uid": "P5CFE5948D716F5AC"
      },
      "description": "##### [Description]\n\nProportion de firmware utilisé\n",
      "fieldConfig": {
        "defaults": {
          "color": {
            "mode": "palette-classic"
          },
          "custom": {
            "hideFrom": {
              "legend": false,
              "tooltip": false,
              "viz": false
            }
          },
          "mappings": []
        },
        "overrides": []
      },
      "gridPos": {
        "h": 10,
        "w": 6,
        "x": 18,
        "y": 23
      },
      "id": 37,
      "options": {
        "displayLabels": [
          "percent"
        ],
        "legend": {
          "displayMode": "list",
          "placement": "right",
          "showLegend": true,
          "values": []
        },
        "pieType": "pie",
        "reduceOptions": {
          "calcs": [
            "lastNotNull"
          ],
          "fields": "",
          "values": true
        },
        "tooltip": {
          "mode": "single",
          "sort": "none"
        }
      },
      "pluginVersion": "",
      "targets": [
        {
          "datasource": {
            "type": "postgres",
            "uid": "P5CFE5948D716F5AC"
          },
          "editorMode": "code",
          "format": "table",
          "hide": false,
          "rawQuery": true,
          "rawSql": "  SELECT result.version_list, count(result.version_list) FROM (\n  SELECT distinct(id), version as version_list\n  from cfg.config_devices \n  WHERE  time >= $__timeFrom() AND time <= $__timeTo()\n  GROUP BY id, version) \n  as result GROUP BY version_list\n",
          "refId": "B",
          "sql": {
            "columns": [
              {
                "parameters": [],
                "type": "function"
              }
            ],
            "groupBy": [
              {
                "property": {
                  "type": "string"
                },
                "type": "groupBy"
              }
            ],
            "limit": 50
          }
        }
      ],
      "title": "Version firmware",
      "transformations": [
        {
          "id": "filterByValue",
          "options": {
            "filters": [
              {
                "config": {
                  "id": "notEqual",
                  "options": {
                    "value": "version"
                  }
                },
                "fieldName": "version_list"
              }
            ],
            "match": "any",
            "type": "include"
          }
        }
      ],
      "transparent": true,
      "type": "piechart"
    },
    {
      "datasource": {
        "type": "datasource",
        "uid": "grafana"
      },
      "gridPos": {
        "h": 2,
        "w": 24,
        "x": 0,
        "y": 33
      },
      "id": 25,
      "options": {
        "code": {
          "language": "html",
          "showLineNumbers": false,
          "showMiniMap": false
        },
        "content": "# Evenements",
        "mode": "markdown"
      },
      "pluginVersion": "",
      "transparent": true,
      "type": "text"
    },
    {
      "datasource": {
        "type": "postgres",
        "uid": "USM"
      },
      "fieldConfig": {
        "defaults": {
          "color": {
            "mode": "palette-classic"
          },
          "custom": {
            "axisCenteredZero": false,
            "axisColorMode": "text",
            "axisLabel": "",
            "axisPlacement": "auto",
            "barAlignment": 0,
            "drawStyle": "line",
            "fillOpacity": 0,
            "gradientMode": "none",
            "hideFrom": {
              "legend": false,
              "tooltip": false,
              "viz": false
            },
            "lineInterpolation": "linear",
            "lineWidth": 1,
            "pointSize": 5,
            "scaleDistribution": {
              "type": "linear"
            },
            "showPoints": "auto",
            "spanNulls": false,
            "stacking": {
              "group": "A",
              "mode": "none"
            },
            "thresholdsStyle": {
              "mode": "off"
            }
          },
          "mappings": [],
          "thresholds": {
            "mode": "absolute",
            "steps": [
              {
                "color": "green",
                "value": null
              },
              {
                "color": "red",
                "value": 80
              }
            ]
          }
        },
        "overrides": []
      },
      "gridPos": {
        "h": 10,
        "w": 12,
        "x": 0,
        "y": 35
      },
      "id": 43,
      "options": {
        "legend": {
          "calcs": [],
          "displayMode": "list",
          "placement": "bottom",
          "showLegend": true
        },
        "tooltip": {
          "mode": "single",
          "sort": "none"
        }
      },
      "pluginVersion": "",
      "targets": [
        {
          "datasource": {
            "type": "postgres",
            "uid": "USM"
          },
          "editorMode": "code",
          "format": "table",
          "rawQuery": true,
          "rawSql": "SELECT  date_trunc('day', time), count(distinct(\"userId\")) from  evt.event_login GROUP BY  date_trunc('day', time);",
          "refId": "A",
          "sql": {
            "columns": [
              {
                "parameters": [],
                "type": "function"
              }
            ],
            "groupBy": [
              {
                "property": {
                  "type": "string"
                },
                "type": "groupBy"
              }
            ],
            "limit": 50
          }
        }
      ],
      "title": "Nombre de connexion utilisateurs unique par jour",
      "type": "timeseries"
    },
    {
      "datasource": {
        "type": "postgres",
        "uid": "USM"
      },
      "fieldConfig": {
        "defaults": {
          "color": {
            "mode": "palette-classic"
          },
          "custom": {
            "axisCenteredZero": false,
            "axisColorMode": "text",
            "axisLabel": "",
            "axisPlacement": "auto",
            "barAlignment": 0,
            "drawStyle": "line",
            "fillOpacity": 0,
            "gradientMode": "none",
            "hideFrom": {
              "legend": false,
              "tooltip": false,
              "viz": false
            },
            "lineInterpolation": "linear",
            "lineWidth": 1,
            "pointSize": 5,
            "scaleDistribution": {
              "type": "linear"
            },
            "showPoints": "auto",
            "spanNulls": false,
            "stacking": {
              "group": "A",
              "mode": "none"
            },
            "thresholdsStyle": {
              "mode": "off"
            }
          },
          "mappings": [],
          "thresholds": {
            "mode": "absolute",
            "steps": [
              {
                "color": "green",
                "value": null
              },
              {
                "color": "red",
                "value": 80
              }
            ]
          }
        },
        "overrides": []
      },
      "gridPos": {
        "h": 10,
        "w": 12,
        "x": 12,
        "y": 35
      },
      "id": 44,
      "options": {
        "legend": {
          "calcs": [],
          "displayMode": "list",
          "placement": "bottom",
          "showLegend": true
        },
        "tooltip": {
          "mode": "single",
          "sort": "none"
        }
      },
      "pluginVersion": "",
      "targets": [
        {
          "datasource": {
            "type": "postgres",
            "uid": "USM"
          },
          "editorMode": "code",
          "format": "table",
          "rawQuery": true,
          "rawSql": "WITH line_types AS (   SELECT DISTINCT \"lineType\" FROM evt.event_login) SELECT  date_trunc('day', time) AS time_day,   SUM(CASE WHEN \"lineType\" = 'webRTC' THEN 1 ELSE 0 END) AS nb_webRTC,    SUM(CASE WHEN \"lineType\" = 'phone' THEN 1 ELSE 0 END) AS nb_phone,    SUM(CASE WHEN \"lineType\" = 'mobile' THEN 1 ELSE 0 END) AS nb_mobile,    SUM(CASE WHEN \"lineType\" = 'ua' THEN 1 ELSE 0 END) AS nb_ua FROM   evt.event_login WHERE    time >= $__timeFrom() AND time <= $__timeTo() GROUP BY     date_trunc('day', time)",
          "refId": "A",
          "sql": {
            "columns": [
              {
                "parameters": [],
                "type": "function"
              }
            ],
            "groupBy": [
              {
                "property": {
                  "type": "string"
                },
                "type": "groupBy"
              }
            ],
            "limit": 50
          }
        }
      ],
      "title": "Nombre de connexion par type",
      "type": "timeseries"
    }
  ],
  "refresh": "",
  "revision": 1,
  "schemaVersion": 38,
  "style": "dark",
  "tags": [],
  "templating": {
    "list": []
  },
  "time": {
    "from": "now-1h",
    "to": "now"
  },
  "timepicker": {},
  "timezone": "browser",
  "title": "USM Dashboard",
  "uid": "taShzluIk",
  "version": 1,
  "weekStart": ""
}
